nixbot

builds

Enzime/hyperconfig build #1034 failed

branch next · PR #1050 · commit d2f2763235 · · took 10m 14s · eval 20s

eval warnings 4 kinds · 5 occurrences
  • warn The option `nix.nixPath' defined in `/nix/store/…-source/flakeModules/clan.nix, via option flake.clan.machines.gaia' has been renamed to `nix.settings.nix-path'. ×1
  • warn The option `nix.nixPath' defined in `/nix/store/…-source/flakeModules/clan.nix, via option flake.clan.machines.sigma' has been renamed to `nix.settings.nix-path'. ×1
  • warn The option `nix.nixPath' defined in `/nix/store/…-source/flakeModules/clan.nix, via option flake.clan.machines.phi-nixos' has been renamed to `nix.settings.nix-path'. ×1
  • warn A legacy Nextcloud install (from before NixOS 26.11) may be installed. ×2

6 failed ⚠ 2
failed attributes
status attribute duration
failed checks.x86_64-linux.nixos-phi-nixos
  • The option `nix.nixPath' defined in `/nix/store/5mp027jvlfspqkwra9bdsq0l82c7j763-source/flakeModules/clan.nix, via option flake.clan.machines.phi-nixos' has been renamed to `nix.settings.nix-path'.
  • A legacy Nextcloud install (from before NixOS 26.11) may be installed. After nextcloud33 is installed successfully, you can safely upgrade to 34. The latest version available is Nextcloud35. Please note that Nextcloud doesn't support upgrades across multiple major versions (i.e. an upgrade from 16 is possible to 17, but not 16 to 18). The package can be upgraded by explicitly declaring the service-option `services.nextcloud.package`.
  • A legacy Nextcloud install (from before NixOS 26.11) may be installed. After nextcloud34 is installed successfully, you can safely upgrade to 35. The latest version available is Nextcloud35. Please note that Nextcloud doesn't support upgrades across multiple major versions (i.e. an upgrade from 16 is possible to 17, but not 16 to 18). The package can be upgraded by explicitly declaring the service-option `services.nextcloud.package`.
5m 43s
setup: don't know how to build these paths: /nix/store/ja7y5nxy6gcrhky9hchzmcdf5rlyyfg7-nixos-system-phi-nixos-26.11.20260929.b6c8664.drv warning: ignoring th …
setup:
don't know how to build these paths:
  /nix/store/ja7y5nxy6gcrhky9hchzmcdf5rlyyfg7-nixos-system-phi-nixos-26.11.20260929.b6c8664.drv
warning: ignoring the client-specified setting 'store', because it is a restricted setting and you are not a trusted user
bbc65d7vfb736vc945qakz95cwpllhxb-offline.drv: gi-build-x86-02: the build this call attached to did not finish, retry, asking the scheduler again
bbc65d7vfb736vc945qakz95cwpllhxb-offline.drv: gi-build-x86-02: the build this call attached to did not finish, retry, asking the scheduler again
error: dependency '1iq6y4wx79zbb79ayr719n2hg4xi54yi-etc.drv' failed
failed checks.x86_64-linux.nixos-sigma
  • The option `nix.nixPath' defined in `/nix/store/5mp027jvlfspqkwra9bdsq0l82c7j763-source/flakeModules/clan.nix, via option flake.clan.machines.sigma' has been renamed to `nix.settings.nix-path'.
5m 43s
setup: /nix/store/ivd3qx6dvhnx75jiwcgqw3762ybg8l15-zix-0.8.2 /nix/store/lx6h2hjqchiiib68zzaxa7xq6piwf334-zlib-1.3.2 /nix/store/cxl0dm4qhs087wd25ddqq4cj4pp …
setup:
  /nix/store/ivd3qx6dvhnx75jiwcgqw3762ybg8l15-zix-0.8.2
  /nix/store/lx6h2hjqchiiib68zzaxa7xq6piwf334-zlib-1.3.2
  /nix/store/cxl0dm4qhs087wd25ddqq4cj4ppi8w8q-zlib-1.3.2-static
  /nix/store/w34xm2cj8zshgkr23dpp490d0mnr39hx-zsh-you-should-use-1.11.1
  /nix/store/zbnrmissrdmcsvdghafsl8rjc0c6mqcj-zstd-1.5.7
  /nix/store/sgpz2fxnhhxmwwr9cm1rfx9dwn3vgp82-zvbi-0.2.45
warning: ignoring the client-specified setting 'store', because it is a restricted setting and you are not a trusted user
error: dependency 'rl79whcl55qzlp3id7bypn9fn3zny5qf-etc.drv' failed
failed checks.aarch64-darwin."home-manager-enzime@hyperion-macos" 9m 54s
setup: 32ggfdn5cypnl8y8q2aijr9y3gh5q4c6-offline.drv: build02: error: Cannot build '/nix/store/32ggfdn5cypnl8y8q2aijr9y3gh5q4c6-offline.drv'., asking the schedul …
setup:
32ggfdn5cypnl8y8q2aijr9y3gh5q4c6-offline.drv: build02: error: Cannot build '/nix/store/32ggfdn5cypnl8y8q2aijr9y3gh5q4c6-offline.drv'., asking the scheduler again
32ggfdn5cypnl8y8q2aijr9y3gh5q4c6-offline.drv: build02: the build this call attached to did not finish, retry, asking the scheduler again
32ggfdn5cypnl8y8q2aijr9y3gh5q4c6-offline.drv: build02: error: Cannot build '/nix/store/32ggfdn5cypnl8y8q2aijr9y3gh5q4c6-offline.drv'., asking the scheduler again
32ggfdn5cypnl8y8q2aijr9y3gh5q4c6-offline.drv: build02: error: Cannot build '/nix/store/32ggfdn5cypnl8y8q2aijr9y3gh5q4c6-offline.drv'., asking the scheduler again
32ggfdn5cypnl8y8q2aijr9y3gh5q4c6-offline.drv: build02: error: Cannot build '/nix/store/32ggfdn5cypnl8y8q2aijr9y3gh5q4c6-offline.drv'., asking the scheduler again
32ggfdn5cypnl8y8q2aijr9y3gh5q4c6-offline.drv: build02: error: Cannot build '/nix/store/32ggfdn5cypnl8y8q2aijr9y3gh5q4c6-offline.drv'., asking the scheduler again
32ggfdn5cypnl8y8q2aijr9y3gh5q4c6-offline.drv: build02: error: Cannot build '/nix/store/32ggfdn5cypnl8y8q2aijr9y3gh5q4c6-offline.drv'., asking the scheduler again
error: dependency 'mndh71k5nq7x9pbj6kdinaww1w56phsg-home-manager-path.drv' failed
failed checks.aarch64-darwin.nix-darwin-hyperion-macos 9m 54s
setup: 32ggfdn5cypnl8y8q2aijr9y3gh5q4c6-offline.drv: build02: error: Cannot build '/nix/store/32ggfdn5cypnl8y8q2aijr9y3gh5q4c6-offline.drv'., asking the schedul …
setup:
32ggfdn5cypnl8y8q2aijr9y3gh5q4c6-offline.drv: build02: error: Cannot build '/nix/store/32ggfdn5cypnl8y8q2aijr9y3gh5q4c6-offline.drv'., asking the scheduler again
32ggfdn5cypnl8y8q2aijr9y3gh5q4c6-offline.drv: build02: the build this call attached to did not finish, retry, asking the scheduler again
32ggfdn5cypnl8y8q2aijr9y3gh5q4c6-offline.drv: build02: error: Cannot build '/nix/store/32ggfdn5cypnl8y8q2aijr9y3gh5q4c6-offline.drv'., asking the scheduler again
32ggfdn5cypnl8y8q2aijr9y3gh5q4c6-offline.drv: build02: the build this call attached to did not finish, retry, asking the scheduler again
32ggfdn5cypnl8y8q2aijr9y3gh5q4c6-offline.drv: build02: the build this call attached to did not finish, retry, asking the scheduler again
32ggfdn5cypnl8y8q2aijr9y3gh5q4c6-offline.drv: build02: the build this call attached to did not finish, retry, asking the scheduler again
32ggfdn5cypnl8y8q2aijr9y3gh5q4c6-offline.drv: build02: the build this call attached to did not finish, retry, asking the scheduler again
error: dependency '6m45ijcq7vk6ss81jf161pzhv2xpd85q-etc.drv' failed
failed checks.x86_64-linux."home-manager-enzime@phi-nixos" 5m 45s
setup: /nix/store/1q08ia29gsis7xcyb3r9sg51x69ml7ng-home-manager-generation.drv warning: ignoring the client-specified setting 'store', because it is a restric …
setup:
  /nix/store/1q08ia29gsis7xcyb3r9sg51x69ml7ng-home-manager-generation.drv
warning: ignoring the client-specified setting 'store', because it is a restricted setting and you are not a trusted user
bbc65d7vfb736vc945qakz95cwpllhxb-offline.drv: gi-build-x86-02: error: Cannot build '/nix/store/bbc65d7vfb736vc945qakz95cwpllhxb-offline.drv'., asking the scheduler again
bbc65d7vfb736vc945qakz95cwpllhxb-offline.drv: gi-build-x86-02: error: Cannot build '/nix/store/bbc65d7vfb736vc945qakz95cwpllhxb-offline.drv'., asking the scheduler again
bbc65d7vfb736vc945qakz95cwpllhxb-offline.drv: gi-build-x86-02: error: Cannot build '/nix/store/bbc65d7vfb736vc945qakz95cwpllhxb-offline.drv'., asking the scheduler again
bbc65d7vfb736vc945qakz95cwpllhxb-offline.drv: gi-build-x86-02: the build this call attached to did not finish, retry, asking the scheduler again
bbc65d7vfb736vc945qakz95cwpllhxb-offline.drv: gi-build-x86-02: error: Cannot build '/nix/store/bbc65d7vfb736vc945qakz95cwpllhxb-offline.drv'., asking the scheduler again
error: dependency '2amqmnx3fwv5n13khsvg8sz6h5fs2qaj-home-manager-path.drv' failed
failed checks.x86_64-linux."home-manager-enzime@sigma" 5m 45s
setup: don't know how to build these paths: /nix/store/7rr0bjbkd1rni9ds8y1c1s1ljf1q1vzg-home-manager-generation.drv warning: ignoring the client-specified set …
setup:
don't know how to build these paths:
  /nix/store/7rr0bjbkd1rni9ds8y1c1s1ljf1q1vzg-home-manager-generation.drv
warning: ignoring the client-specified setting 'store', because it is a restricted setting and you are not a trusted user
bbc65d7vfb736vc945qakz95cwpllhxb-offline.drv: gi-build-x86-02: the build this call attached to did not finish, retry, asking the scheduler again
bbc65d7vfb736vc945qakz95cwpllhxb-offline.drv: gi-build-x86-02: error: Cannot build '/nix/store/bbc65d7vfb736vc945qakz95cwpllhxb-offline.drv'., asking the scheduler again
bbc65d7vfb736vc945qakz95cwpllhxb-offline.drv: gi-build-x86-02: the build this call attached to did not finish, retry, asking the scheduler again
error: dependency 'k94d4s89lhi3rsl29j61xphmxng95a8s-home-manager-path.drv' failed
14 succeeded ⚠ 1
succeeded attributes
status attribute duration
succeeded checks.x86_64-linux.nixos-gaia
  • The option `nix.nixPath' defined in `/nix/store/5mp027jvlfspqkwra9bdsq0l82c7j763-source/flakeModules/clan.nix, via option flake.clan.machines.gaia' has been renamed to `nix.settings.nix-path'.
6m 48s
succeeded checks.aarch64-darwin.package-gaia-vm 5s
succeeded checks.aarch64-darwin.package-phi-nixos-vm 3s
succeeded checks.aarch64-darwin.package-sigma-vm 3s
succeeded checks.aarch64-darwin.treefmt 4s
succeeded checks.aarch64-linux.package-gaia-vm 4s
succeeded checks.aarch64-linux.package-phi-nixos-vm 5s
succeeded checks.aarch64-linux.package-sigma-vm 4s
succeeded checks.aarch64-linux.treefmt 8s
succeeded checks.x86_64-linux."home-manager-enzime@gaia" 6m 18s
succeeded checks.x86_64-linux.package-gaia-vm 4s
succeeded checks.x86_64-linux.package-phi-nixos-vm 11s
succeeded checks.x86_64-linux.package-sigma-vm 5s
succeeded checks.x86_64-linux.treefmt 5s
39 already built
skipped attributes
status attribute duration
loading…