nixbot

builds

Enzime/hyperconfig build #1048 failed

branch next · PR #1050 · commit c0382e9cd4 · · took 1m 53s · eval 21s

eval warnings 4 kinds · 5 occurrences
  • warn The option `nix.nixPath' defined in `/nix/store/…-source/flakeModules/clan.nix, via option flake.clan.machines.gaia' has been renamed to `nix.settings.nix-path'. ×1
  • warn The option `nix.nixPath' defined in `/nix/store/…-source/flakeModules/clan.nix, via option flake.clan.machines.sigma' has been renamed to `nix.settings.nix-path'. ×1
  • warn The option `nix.nixPath' defined in `/nix/store/…-source/flakeModules/clan.nix, via option flake.clan.machines.phi-nixos' has been renamed to `nix.settings.nix-path'. ×1
  • warn A legacy Nextcloud install (from before NixOS 26.11) may be installed. ×2

6 failed ⚠ 2
failed attributes
status attribute duration
failed checks.x86_64-linux.nixos-phi-nixos
  • The option `nix.nixPath' defined in `/nix/store/5mp027jvlfspqkwra9bdsq0l82c7j763-source/flakeModules/clan.nix, via option flake.clan.machines.phi-nixos' has been renamed to `nix.settings.nix-path'.
  • A legacy Nextcloud install (from before NixOS 26.11) may be installed. After nextcloud33 is installed successfully, you can safely upgrade to 34. The latest version available is Nextcloud35. Please note that Nextcloud doesn't support upgrades across multiple major versions (i.e. an upgrade from 16 is possible to 17, but not 16 to 18). The package can be upgraded by explicitly declaring the service-option `services.nextcloud.package`.
  • A legacy Nextcloud install (from before NixOS 26.11) may be installed. After nextcloud34 is installed successfully, you can safely upgrade to 35. The latest version available is Nextcloud35. Please note that Nextcloud doesn't support upgrades across multiple major versions (i.e. an upgrade from 16 is possible to 17, but not 16 to 18). The package can be upgraded by explicitly declaring the service-option `services.nextcloud.package`.
52s
setup: don't know how to build these paths: /nix/store/cqz2f9n3ni377ikzzqmn7rbkf0dah9ql-nixos-system-phi-nixos-26.11.20260929.b6c8664.drv warning: ignoring th …
setup:
don't know how to build these paths:
  /nix/store/cqz2f9n3ni377ikzzqmn7rbkf0dah9ql-nixos-system-phi-nixos-26.11.20260929.b6c8664.drv
warning: ignoring the client-specified setting 'store', because it is a restricted setting and you are not a trusted user
bbc65d7vfb736vc945qakz95cwpllhxb-offline.drv: gi-build-x86-02: error: Cannot build '/nix/store/bbc65d7vfb736vc945qakz95cwpllhxb-offline.drv'., asking the scheduler again
bbc65d7vfb736vc945qakz95cwpllhxb-offline.drv: gi-build-x86-02: the build this call attached to did not finish, retry, asking the scheduler again
bbc65d7vfb736vc945qakz95cwpllhxb-offline.drv: gi-build-x86-02: the build this call attached to did not finish, retry, asking the scheduler again
error: dependency 'q4hczswv0fvxrjipvn7akdzmmv3bbv4b-etc.drv' failed
failed checks.x86_64-linux.nixos-sigma
  • The option `nix.nixPath' defined in `/nix/store/5mp027jvlfspqkwra9bdsq0l82c7j763-source/flakeModules/clan.nix, via option flake.clan.machines.sigma' has been renamed to `nix.settings.nix-path'.
46s
setup: /nix/store/cxl0dm4qhs087wd25ddqq4cj4ppi8w8q-zlib-1.3.2-static /nix/store/w34xm2cj8zshgkr23dpp490d0mnr39hx-zsh-you-should-use-1.11.1 /nix/store/sgpz …
setup:
  /nix/store/cxl0dm4qhs087wd25ddqq4cj4ppi8w8q-zlib-1.3.2-static
  /nix/store/w34xm2cj8zshgkr23dpp490d0mnr39hx-zsh-you-should-use-1.11.1
  /nix/store/sgpz2fxnhhxmwwr9cm1rfx9dwn3vgp82-zvbi-0.2.45
warning: ignoring the client-specified setting 'store', because it is a restricted setting and you are not a trusted user
bbc65d7vfb736vc945qakz95cwpllhxb-offline.drv: gi-build-x86-02: the build this call attached to did not finish, retry, asking the scheduler again
bbc65d7vfb736vc945qakz95cwpllhxb-offline.drv: gi-build-x86-02: error: Cannot build '/nix/store/bbc65d7vfb736vc945qakz95cwpllhxb-offline.drv'., asking the scheduler again
bbc65d7vfb736vc945qakz95cwpllhxb-offline.drv: gi-build-x86-02: error: Cannot build '/nix/store/bbc65d7vfb736vc945qakz95cwpllhxb-offline.drv'., asking the scheduler again
error: dependency 'l141r1dmvkvp53cry4dzva1alywwflr7-etc.drv' failed
failed checks.aarch64-darwin."home-manager-enzime@hyperion-macos" 13s
setup: don't know how to build these paths: /nix/store/771lhyn5xrzrlibcihcd0qzk8mk2mx4w-home-manager-generation.drv warning: ignoring the client-specified set …
setup:
don't know how to build these paths:
  /nix/store/771lhyn5xrzrlibcihcd0qzk8mk2mx4w-home-manager-generation.drv
warning: ignoring the client-specified setting 'store', because it is a restricted setting and you are not a trusted user
error: dependency '2zpr6k5v23hyc6m06d1clkxz2g3i8cp3-home-manager-path.drv' failed
failed checks.aarch64-darwin.nix-darwin-hyperion-macos 37s
setup: don't know how to build these paths: /nix/store/n6swyz00hbbb554dzs2zm8gkwk304957-darwin-system-26.11.4cff07d.drv warning: ignoring the client-specified …
setup:
don't know how to build these paths:
  /nix/store/n6swyz00hbbb554dzs2zm8gkwk304957-darwin-system-26.11.4cff07d.drv
warning: ignoring the client-specified setting 'store', because it is a restricted setting and you are not a trusted user
error: dependency '9jwnzmqbxhq9qbl0kmybh9r2bsfzzzq3-activation-enzime.drv' failed
failed checks.x86_64-linux."home-manager-enzime@phi-nixos" 7s
setup: /nix/store/1m6ma3q09rb32n9l53wa3n50zghyyq2c-yarn-1.22.22 /nix/store/mns4r5fzawihl0q99z70qagbrwjv1azr-yarn-berry-config-hook /nix/store/0nq5fn8y47ga …
setup:
  /nix/store/1m6ma3q09rb32n9l53wa3n50zghyyq2c-yarn-1.22.22
  /nix/store/mns4r5fzawihl0q99z70qagbrwjv1azr-yarn-berry-config-hook
  /nix/store/0nq5fn8y47gaxpqlxx9k431ach4h38p0-yarn-berry-offline-4.18.0
  /nix/store/hszvd0wcgg1ili0hjl3vmgpdh2j6pah8-yt-dlp-2026.08.19
  /nix/store/0dbz8xm9vxcvl0zl2d4n1zf49n1xggmm-zellij-unwrapped-0.45.1
  /nix/store/w34xm2cj8zshgkr23dpp490d0mnr39hx-zsh-you-should-use-1.11.1
warning: ignoring the client-specified setting 'store', because it is a restricted setting and you are not a trusted user
error: dependency 'bpbfg847pr90bsr4385r4i2h9z8bbf2n-home-manager-path.drv' failed
failed checks.x86_64-linux."home-manager-enzime@sigma" 19s
setup: /nix/store/mns4r5fzawihl0q99z70qagbrwjv1azr-yarn-berry-config-hook /nix/store/0nq5fn8y47gaxpqlxx9k431ach4h38p0-yarn-berry-offline-4.18.0 /nix/store …
setup:
  /nix/store/mns4r5fzawihl0q99z70qagbrwjv1azr-yarn-berry-config-hook
  /nix/store/0nq5fn8y47gaxpqlxx9k431ach4h38p0-yarn-berry-offline-4.18.0
  /nix/store/hszvd0wcgg1ili0hjl3vmgpdh2j6pah8-yt-dlp-2026.08.19
  /nix/store/0dbz8xm9vxcvl0zl2d4n1zf49n1xggmm-zellij-unwrapped-0.45.1
  /nix/store/w34xm2cj8zshgkr23dpp490d0mnr39hx-zsh-you-should-use-1.11.1
warning: ignoring the client-specified setting 'store', because it is a restricted setting and you are not a trusted user
bbc65d7vfb736vc945qakz95cwpllhxb-offline.drv: gi-build-x86-02: the build this call attached to did not finish, retry, asking the scheduler again
error: dependency 'vzz0b0j4m90d9vhij0f9myj1wi283xi4-home-manager-path.drv' failed
17 succeeded ⚠ 1
succeeded attributes
status attribute duration
succeeded checks.x86_64-linux.nixos-gaia
  • The option `nix.nixPath' defined in `/nix/store/5mp027jvlfspqkwra9bdsq0l82c7j763-source/flakeModules/clan.nix, via option flake.clan.machines.gaia' has been renamed to `nix.settings.nix-path'.
1m 29s
succeeded checks.aarch64-darwin.devShell-default 10s
succeeded checks.aarch64-darwin.package-gaia-vm 7s
succeeded checks.aarch64-darwin.package-phi-nixos-vm 6s
succeeded checks.aarch64-darwin.package-sigma-vm 7s
succeeded checks.aarch64-darwin.treefmt 11s
succeeded checks.aarch64-linux.devShell-default 9s
succeeded checks.aarch64-linux.package-gaia-vm 6s
succeeded checks.aarch64-linux.package-phi-nixos-vm 6s
succeeded checks.aarch64-linux.package-sigma-vm 6s
succeeded checks.aarch64-linux.treefmt 9s
succeeded checks.x86_64-linux.devShell-default 13s
succeeded checks.x86_64-linux."home-manager-enzime@gaia" 1m 4s
succeeded checks.x86_64-linux.package-gaia-vm 9s
succeeded checks.x86_64-linux.package-phi-nixos-vm 8s
succeeded checks.x86_64-linux.package-sigma-vm 7s
succeeded checks.x86_64-linux.treefmt 8s
36 already built
skipped attributes
status attribute duration
loading…