nixbot

builds

Enzime/hyperconfig build #1054 failed

branch next · PR #1050 · commit 6954a4f8e0 · · took 5m 33s · eval 52s

eval warnings 4 kinds · 5 occurrences
  • warn The option `nix.nixPath' defined in `/nix/store/…-source/flakeModules/clan.nix, via option flake.clan.machines.gaia' has been renamed to `nix.settings.nix-path'. ×1
  • warn The option `nix.nixPath' defined in `/nix/store/…-source/flakeModules/clan.nix, via option flake.clan.machines.sigma' has been renamed to `nix.settings.nix-path'. ×1
  • warn The option `nix.nixPath' defined in `/nix/store/…-source/flakeModules/clan.nix, via option flake.clan.machines.phi-nixos' has been renamed to `nix.settings.nix-path'. ×1
  • warn A legacy Nextcloud install (from before NixOS 26.11) may be installed. ×2

6 failed ⚠ 2
failed attributes
status attribute duration
failed checks.x86_64-linux.nixos-phi-nixos
  • The option `nix.nixPath' defined in `/nix/store/iigqqr5hi294dgcpcjllyqnm0y2v81k2-source/flakeModules/clan.nix, via option flake.clan.machines.phi-nixos' has been renamed to `nix.settings.nix-path'.
  • A legacy Nextcloud install (from before NixOS 26.11) may be installed. After nextcloud33 is installed successfully, you can safely upgrade to 34. The latest version available is Nextcloud35. Please note that Nextcloud doesn't support upgrades across multiple major versions (i.e. an upgrade from 16 is possible to 17, but not 16 to 18). The package can be upgraded by explicitly declaring the service-option `services.nextcloud.package`.
  • A legacy Nextcloud install (from before NixOS 26.11) may be installed. After nextcloud34 is installed successfully, you can safely upgrade to 35. The latest version available is Nextcloud35. Please note that Nextcloud doesn't support upgrades across multiple major versions (i.e. an upgrade from 16 is possible to 17, but not 16 to 18). The package can be upgraded by explicitly declaring the service-option `services.nextcloud.package`.
2m 34s
setup: don't know how to build these paths: /nix/store/z6wvq512lplbd68rnhpblad5z1lz68wl-nixos-system-phi-nixos-26.11.20260930.c9fe7d1.drv warning: ignoring th …
setup:
don't know how to build these paths:
  /nix/store/z6wvq512lplbd68rnhpblad5z1lz68wl-nixos-system-phi-nixos-26.11.20260930.c9fe7d1.drv
warning: ignoring the client-specified setting 'store', because it is a restricted setting and you are not a trusted user
error: dependency '90cmsjck4zk1icyhf0wcdfg2lbfi6ljp-etc.drv' failed
failed checks.x86_64-linux.nixos-sigma
  • The option `nix.nixPath' defined in `/nix/store/iigqqr5hi294dgcpcjllyqnm0y2v81k2-source/flakeModules/clan.nix, via option flake.clan.machines.sigma' has been renamed to `nix.settings.nix-path'.
3m 19s
setup: bbc65d7vfb736vc945qakz95cwpllhxb-offline.drv: gi-build-x86-02: error: Cannot build '/nix/store/bbc65d7vfb736vc945qakz95cwpllhxb-offline.drv'., asking the …
setup:
bbc65d7vfb736vc945qakz95cwpllhxb-offline.drv: gi-build-x86-02: error: Cannot build '/nix/store/bbc65d7vfb736vc945qakz95cwpllhxb-offline.drv'., asking the scheduler again
bbc65d7vfb736vc945qakz95cwpllhxb-offline.drv: gi-build-x86-02: error: Cannot build '/nix/store/bbc65d7vfb736vc945qakz95cwpllhxb-offline.drv'., asking the scheduler again
bbc65d7vfb736vc945qakz95cwpllhxb-offline.drv: gi-build-x86-02: error: Cannot build '/nix/store/bbc65d7vfb736vc945qakz95cwpllhxb-offline.drv'., asking the scheduler again
bbc65d7vfb736vc945qakz95cwpllhxb-offline.drv: gi-build-x86-02: error: Cannot build '/nix/store/bbc65d7vfb736vc945qakz95cwpllhxb-offline.drv'., asking the scheduler again
bbc65d7vfb736vc945qakz95cwpllhxb-offline.drv: gi-build-x86-02: error: Cannot build '/nix/store/bbc65d7vfb736vc945qakz95cwpllhxb-offline.drv'., asking the scheduler again
bbc65d7vfb736vc945qakz95cwpllhxb-offline.drv: gi-build-x86-02: error: Cannot build '/nix/store/bbc65d7vfb736vc945qakz95cwpllhxb-offline.drv'., asking the scheduler again
bbc65d7vfb736vc945qakz95cwpllhxb-offline.drv: gi-build-x86-02: error: Cannot build '/nix/store/bbc65d7vfb736vc945qakz95cwpllhxb-offline.drv'., asking the scheduler again
error: dependency 'vfkh4sblh6f7z43vzyy3jc4zsjj65c81-etc.drv' failed
failed checks.aarch64-darwin."home-manager-enzime@hyperion-macos" 12s
setup: don't know how to build these paths: /nix/store/bn6a57492qz2hxpbva2lp7950yb7s15z-home-manager-generation.drv warning: ignoring the client-specified set …
setup:
don't know how to build these paths:
  /nix/store/bn6a57492qz2hxpbva2lp7950yb7s15z-home-manager-generation.drv
warning: ignoring the client-specified setting 'store', because it is a restricted setting and you are not a trusted user
error: dependency 'a174ixk5qkfzhwyfil3y9qaxz0ap4qkc-home-manager-path.drv' failed
failed checks.aarch64-darwin.nix-darwin-hyperion-macos 1m 33s
setup: don't know how to build these paths: /nix/store/fnkdxwpjcm9bhcd7wfd32kahj0bbz024-darwin-system-26.11.4cff07d.drv warning: ignoring the client-specified …
setup:
don't know how to build these paths:
  /nix/store/fnkdxwpjcm9bhcd7wfd32kahj0bbz024-darwin-system-26.11.4cff07d.drv
warning: ignoring the client-specified setting 'store', because it is a restricted setting and you are not a trusted user
error: dependency 'ran2c0hfvakv5sr8qg0dz58y7k0s4lql-activation-enzime.drv' failed
failed checks.x86_64-linux."home-manager-enzime@phi-nixos" 1m 27s
setup: don't know how to build these paths: /nix/store/ss5kmznybc61wrz36snzwwds8qgyg48c-home-manager-generation.drv warning: ignoring the client-specified set …
setup:
don't know how to build these paths:
  /nix/store/ss5kmznybc61wrz36snzwwds8qgyg48c-home-manager-generation.drv
warning: ignoring the client-specified setting 'store', because it is a restricted setting and you are not a trusted user
bbc65d7vfb736vc945qakz95cwpllhxb-offline.drv: gi-build-x86-02: error: Cannot build '/nix/store/bbc65d7vfb736vc945qakz95cwpllhxb-offline.drv'., asking the scheduler again
error: dependency 'sydmn0zj4dqa0cmff6s5620yqbng2b2k-home-manager-path.drv' failed
failed checks.x86_64-linux."home-manager-enzime@sigma" 1m 27s
setup: /nix/store/mns4r5fzawihl0q99z70qagbrwjv1azr-yarn-berry-config-hook /nix/store/0nq5fn8y47gaxpqlxx9k431ach4h38p0-yarn-berry-offline-4.18.0 /nix/store …
setup:
  /nix/store/mns4r5fzawihl0q99z70qagbrwjv1azr-yarn-berry-config-hook
  /nix/store/0nq5fn8y47gaxpqlxx9k431ach4h38p0-yarn-berry-offline-4.18.0
  /nix/store/0dbz8xm9vxcvl0zl2d4n1zf49n1xggmm-zellij-unwrapped-0.45.1
  /nix/store/w34xm2cj8zshgkr23dpp490d0mnr39hx-zsh-you-should-use-1.11.1
warning: ignoring the client-specified setting 'store', because it is a restricted setting and you are not a trusted user
bbc65d7vfb736vc945qakz95cwpllhxb-offline.drv: gi-build-x86-02: the build this call attached to did not finish, retry, asking the scheduler again
6wri8r629sf11wxl35hyjj024k3f2vbb-home-configuration-reference-manpage.drv: build-x86-01: not scheduled here: 6wri8r629sf11wxl35hyjj024k3f2vbb-home-configuration-reference-manpage.drv, asking the scheduler again
error: dependency 'yk10b3hshgr9n6ssczngmd8d3h2vizw1-home-manager-path.drv' failed
32 succeeded ⚠ 1
succeeded attributes
status attribute duration
succeeded checks.x86_64-linux.nixos-gaia
  • The option `nix.nixPath' defined in `/nix/store/iigqqr5hi294dgcpcjllyqnm0y2v81k2-source/flakeModules/clan.nix, via option flake.clan.machines.gaia' has been renamed to `nix.settings.nix-path'.
4m 38s
succeeded checks.aarch64-darwin.devShell-default 1m 18s
succeeded checks.aarch64-darwin.package-gaia-vm 2s
succeeded checks.aarch64-darwin.package-get-clan-secret 1m 20s
succeeded checks.aarch64-darwin.package-phi-nixos-vm 8s
succeeded checks.aarch64-darwin.package-provide-tf-passphrase 1m 19s
succeeded checks.aarch64-darwin.package-sigma-vm 2s
succeeded checks.aarch64-darwin.package-tf-apply 8s
succeeded checks.aarch64-darwin.package-tf-destroy 8s
succeeded checks.aarch64-darwin.package-tf-init 9s
succeeded checks.aarch64-darwin.treefmt 20s
succeeded checks.aarch64-linux.devShell-default 33s
succeeded checks.aarch64-linux.package-gaia-vm 4s
succeeded checks.aarch64-linux.package-get-clan-secret 32s
succeeded checks.aarch64-linux.package-phi-nixos-vm 3s
succeeded checks.aarch64-linux.package-provide-tf-passphrase 32s
succeeded checks.aarch64-linux.package-sigma-vm 3s
succeeded checks.aarch64-linux.package-tf-apply 7s
succeeded checks.aarch64-linux.package-tf-destroy 8s
succeeded checks.aarch64-linux.package-tf-init 15s
succeeded checks.aarch64-linux.treefmt 23s
succeeded checks.x86_64-linux.devShell-default 1m 47s
succeeded checks.x86_64-linux."home-manager-enzime@gaia" 2m 47s
succeeded checks.x86_64-linux.package-gaia-vm 48s
succeeded checks.x86_64-linux.package-get-clan-secret 1m 24s
succeeded checks.x86_64-linux.package-phi-nixos-vm 2s
succeeded checks.x86_64-linux.package-provide-tf-passphrase 1m 24s
succeeded checks.x86_64-linux.package-sigma-vm 16s
succeeded checks.x86_64-linux.package-tf-apply 54s
succeeded checks.x86_64-linux.package-tf-destroy 53s
succeeded checks.x86_64-linux.package-tf-init 54s
succeeded checks.x86_64-linux.treefmt 31s
21 already built
skipped attributes
status attribute duration
loading…