nixbot

builds

Enzime/hyperconfig build #1060 failed

branch next · PR #1050 · commit ba2999371f · · took 1m 55s · eval 26s

eval warnings 4 kinds · 5 occurrences
  • warn The option `nix.nixPath' defined in `/nix/store/…-source/flakeModules/clan.nix, via option flake.clan.machines.gaia' has been renamed to `nix.settings.nix-path'. ×1
  • warn The option `nix.nixPath' defined in `/nix/store/…-source/flakeModules/clan.nix, via option flake.clan.machines.phi-nixos' has been renamed to `nix.settings.nix-path'. ×1
  • warn A legacy Nextcloud install (from before NixOS 26.11) may be installed. ×2
  • warn The option `nix.nixPath' defined in `/nix/store/…-source/flakeModules/clan.nix, via option flake.clan.machines.sigma' has been renamed to `nix.settings.nix-path'. ×1

6 failed ⚠ 2
failed attributes
status attribute duration
failed checks.x86_64-linux.nixos-phi-nixos
  • The option `nix.nixPath' defined in `/nix/store/iigqqr5hi294dgcpcjllyqnm0y2v81k2-source/flakeModules/clan.nix, via option flake.clan.machines.phi-nixos' has been renamed to `nix.settings.nix-path'.
  • A legacy Nextcloud install (from before NixOS 26.11) may be installed. After nextcloud33 is installed successfully, you can safely upgrade to 34. The latest version available is Nextcloud35. Please note that Nextcloud doesn't support upgrades across multiple major versions (i.e. an upgrade from 16 is possible to 17, but not 16 to 18). The package can be upgraded by explicitly declaring the service-option `services.nextcloud.package`.
  • A legacy Nextcloud install (from before NixOS 26.11) may be installed. After nextcloud34 is installed successfully, you can safely upgrade to 35. The latest version available is Nextcloud35. Please note that Nextcloud doesn't support upgrades across multiple major versions (i.e. an upgrade from 16 is possible to 17, but not 16 to 18). The package can be upgraded by explicitly declaring the service-option `services.nextcloud.package`.
1m 14s
setup: /nix/store/0dbz8xm9vxcvl0zl2d4n1zf49n1xggmm-zellij-unwrapped-0.45.1 /nix/store/2bb4dqllicbqdgs07l1xgcqxs6bs1hy5-zimg-3.0.6 /nix/store/ivd3qx6dvhnx7 …
setup:
  /nix/store/0dbz8xm9vxcvl0zl2d4n1zf49n1xggmm-zellij-unwrapped-0.45.1
  /nix/store/2bb4dqllicbqdgs07l1xgcqxs6bs1hy5-zimg-3.0.6
  /nix/store/ivd3qx6dvhnx75jiwcgqw3762ybg8l15-zix-0.8.2
  /nix/store/cxl0dm4qhs087wd25ddqq4cj4ppi8w8q-zlib-1.3.2-static
  /nix/store/w34xm2cj8zshgkr23dpp490d0mnr39hx-zsh-you-should-use-1.11.1
  /nix/store/sgpz2fxnhhxmwwr9cm1rfx9dwn3vgp82-zvbi-0.2.45
warning: ignoring the client-specified setting 'store', because it is a restricted setting and you are not a trusted user
error: dependency 'cwiqsvcck5vxmqx3b78jb5sdsajddrsh-etc.drv' failed
failed checks.x86_64-linux.nixos-sigma
  • The option `nix.nixPath' defined in `/nix/store/iigqqr5hi294dgcpcjllyqnm0y2v81k2-source/flakeModules/clan.nix, via option flake.clan.machines.sigma' has been renamed to `nix.settings.nix-path'.
52s
setup: don't know how to build these paths: /nix/store/kl3vkkjhjd9zwwgfk120hw85z309nfx3-nixos-system-sigma-26.11.20260930.c9fe7d1.drv warning: ignoring the cl …
setup:
don't know how to build these paths:
  /nix/store/kl3vkkjhjd9zwwgfk120hw85z309nfx3-nixos-system-sigma-26.11.20260930.c9fe7d1.drv
warning: ignoring the client-specified setting 'store', because it is a restricted setting and you are not a trusted user
error: dependency '8cf5gbd3aqcj9qppd403k01yjjdf6lr0-etc.drv' failed
failed checks.aarch64-darwin."home-manager-enzime@hyperion-macos" 8s
setup: don't know how to build these paths: /nix/store/hy2zfnp858kpqi8ka59rrywl6d9dffws-home-manager-generation.drv warning: ignoring the client-specified set …
setup:
don't know how to build these paths:
  /nix/store/hy2zfnp858kpqi8ka59rrywl6d9dffws-home-manager-generation.drv
warning: ignoring the client-specified setting 'store', because it is a restricted setting and you are not a trusted user
error: dependency 'a174ixk5qkfzhwyfil3y9qaxz0ap4qkc-home-manager-path.drv' failed
failed checks.aarch64-darwin.nix-darwin-hyperion-macos 27s
setup: /nix/store/9108bscn7xqdvsrl25ic4ki2ip6jyd2z-zimg-3.0.6 /nix/store/dvawr36npnad4xa6dxi2ss0fw44aa82r-zip-3.0 /nix/store/kbhbv0l3xhxk5z9y93qm6nkbsk167 …
setup:
  /nix/store/9108bscn7xqdvsrl25ic4ki2ip6jyd2z-zimg-3.0.6
  /nix/store/dvawr36npnad4xa6dxi2ss0fw44aa82r-zip-3.0
  /nix/store/kbhbv0l3xhxk5z9y93qm6nkbsk167mqa-zlib-ng-2.3.3
  /nix/store/nyn817bda5qwwnjwxqjr1g4mykfdv8hs-zsh-prezto-0-unstable-2025-07-30
  /nix/store/hqhk73agzmpgb129yvmiw6vpv9yxr18w-zsh-you-should-use-1.11.1
  /nix/store/fbk115rn3nyd9dic8r88r6l45hqy9dq6-zvbi-0.2.45
warning: ignoring the client-specified setting 'store', because it is a restricted setting and you are not a trusted user
error: dependency '0ipxqgq7hnc4piw92haycqxd4i9yl29b-etc.drv' failed
failed checks.x86_64-linux."home-manager-enzime@phi-nixos" 17s
setup: don't know how to build these paths: /nix/store/fb3rnn3kz5zfqlbdrblb85yf6g3643zk-home-manager-generation.drv warning: ignoring the client-specified set …
setup:
don't know how to build these paths:
  /nix/store/fb3rnn3kz5zfqlbdrblb85yf6g3643zk-home-manager-generation.drv
warning: ignoring the client-specified setting 'store', because it is a restricted setting and you are not a trusted user
error: dependency 'sydmn0zj4dqa0cmff6s5620yqbng2b2k-home-manager-path.drv' failed
failed checks.x86_64-linux."home-manager-enzime@sigma" 32s
setup: /nix/store/0nq5fn8y47gaxpqlxx9k431ach4h38p0-yarn-berry-offline-4.18.0 /nix/store/0dbz8xm9vxcvl0zl2d4n1zf49n1xggmm-zellij-unwrapped-0.45.1 /nix/stor …
setup:
  /nix/store/0nq5fn8y47gaxpqlxx9k431ach4h38p0-yarn-berry-offline-4.18.0
  /nix/store/0dbz8xm9vxcvl0zl2d4n1zf49n1xggmm-zellij-unwrapped-0.45.1
  /nix/store/w34xm2cj8zshgkr23dpp490d0mnr39hx-zsh-you-should-use-1.11.1
warning: ignoring the client-specified setting 'store', because it is a restricted setting and you are not a trusted user
bbc65d7vfb736vc945qakz95cwpllhxb-offline.drv: gi-build-x86-02: error: Cannot build '/nix/store/bbc65d7vfb736vc945qakz95cwpllhxb-offline.drv'., asking the scheduler again
bbc65d7vfb736vc945qakz95cwpllhxb-offline.drv: gi-build-x86-02: error: Cannot build '/nix/store/bbc65d7vfb736vc945qakz95cwpllhxb-offline.drv'., asking the scheduler again
bbc65d7vfb736vc945qakz95cwpllhxb-offline.drv: gi-build-x86-02: error: Cannot build '/nix/store/bbc65d7vfb736vc945qakz95cwpllhxb-offline.drv'., asking the scheduler again
error: dependency 'yk10b3hshgr9n6ssczngmd8d3h2vizw1-home-manager-path.drv' failed
14 succeeded ⚠ 1
succeeded attributes
status attribute duration
succeeded checks.x86_64-linux.nixos-gaia
  • The option `nix.nixPath' defined in `/nix/store/iigqqr5hi294dgcpcjllyqnm0y2v81k2-source/flakeModules/clan.nix, via option flake.clan.machines.gaia' has been renamed to `nix.settings.nix-path'.
1m 26s
succeeded checks.aarch64-darwin.package-gaia-vm 4s
succeeded checks.aarch64-darwin.package-phi-nixos-vm 3s
succeeded checks.aarch64-darwin.package-sigma-vm 4s
succeeded checks.aarch64-darwin.treefmt 9s
succeeded checks.aarch64-linux.package-gaia-vm 7s
succeeded checks.aarch64-linux.package-phi-nixos-vm 6s
succeeded checks.aarch64-linux.package-sigma-vm 4s
succeeded checks.aarch64-linux.treefmt 8s
succeeded checks.x86_64-linux."home-manager-enzime@gaia" 14s
succeeded checks.x86_64-linux.package-gaia-vm 16s
succeeded checks.x86_64-linux.package-phi-nixos-vm 8s
succeeded checks.x86_64-linux.package-sigma-vm 18s
succeeded checks.x86_64-linux.treefmt 15s
39 already built
skipped attributes
status attribute duration
loading…