nixbot

builds

Enzime/hyperconfig build #1062 failed

branch next · PR #1050 · commit 749470de5d · · took 1m 49s · eval 26s

eval warnings 4 kinds · 5 occurrences
  • warn The option `nix.nixPath' defined in `/nix/store/…-source/flakeModules/clan.nix, via option flake.clan.machines.gaia' has been renamed to `nix.settings.nix-path'. ×1
  • warn The option `nix.nixPath' defined in `/nix/store/…-source/flakeModules/clan.nix, via option flake.clan.machines.phi-nixos' has been renamed to `nix.settings.nix-path'. ×1
  • warn A legacy Nextcloud install (from before NixOS 26.11) may be installed. ×2
  • warn The option `nix.nixPath' defined in `/nix/store/…-source/flakeModules/clan.nix, via option flake.clan.machines.sigma' has been renamed to `nix.settings.nix-path'. ×1

6 failed ⚠ 2
failed attributes
status attribute duration
failed checks.x86_64-linux.nixos-phi-nixos
  • The option `nix.nixPath' defined in `/nix/store/iigqqr5hi294dgcpcjllyqnm0y2v81k2-source/flakeModules/clan.nix, via option flake.clan.machines.phi-nixos' has been renamed to `nix.settings.nix-path'.
  • A legacy Nextcloud install (from before NixOS 26.11) may be installed. After nextcloud33 is installed successfully, you can safely upgrade to 34. The latest version available is Nextcloud35. Please note that Nextcloud doesn't support upgrades across multiple major versions (i.e. an upgrade from 16 is possible to 17, but not 16 to 18). The package can be upgraded by explicitly declaring the service-option `services.nextcloud.package`.
  • A legacy Nextcloud install (from before NixOS 26.11) may be installed. After nextcloud34 is installed successfully, you can safely upgrade to 35. The latest version available is Nextcloud35. Please note that Nextcloud doesn't support upgrades across multiple major versions (i.e. an upgrade from 16 is possible to 17, but not 16 to 18). The package can be upgraded by explicitly declaring the service-option `services.nextcloud.package`.
42s
setup: don't know how to build these paths: /nix/store/6ra4h74jszp016wqsn907y23ii04apgc-nixos-system-phi-nixos-26.11.20260930.c9fe7d1.drv warning: ignoring th …
setup:
don't know how to build these paths:
  /nix/store/6ra4h74jszp016wqsn907y23ii04apgc-nixos-system-phi-nixos-26.11.20260930.c9fe7d1.drv
warning: ignoring the client-specified setting 'store', because it is a restricted setting and you are not a trusted user
bbc65d7vfb736vc945qakz95cwpllhxb-offline.drv: gi-build-x86-02: the build this call attached to did not finish, retry, asking the scheduler again
bbc65d7vfb736vc945qakz95cwpllhxb-offline.drv: gi-build-x86-02: the build this call attached to did not finish, retry, asking the scheduler again
bbc65d7vfb736vc945qakz95cwpllhxb-offline.drv: gi-build-x86-02: error: Cannot build '/nix/store/bbc65d7vfb736vc945qakz95cwpllhxb-offline.drv'., asking the scheduler again
error: dependency '37kjrbidaf0biln23c45r6zphqpqvfvx-etc.drv' failed
failed checks.x86_64-linux.nixos-sigma
  • The option `nix.nixPath' defined in `/nix/store/iigqqr5hi294dgcpcjllyqnm0y2v81k2-source/flakeModules/clan.nix, via option flake.clan.machines.sigma' has been renamed to `nix.settings.nix-path'.
56s
setup: /nix/store/2bb4dqllicbqdgs07l1xgcqxs6bs1hy5-zimg-3.0.6 /nix/store/ivd3qx6dvhnx75jiwcgqw3762ybg8l15-zix-0.8.2 /nix/store/cxl0dm4qhs087wd25ddqq4cj4pp …
setup:
  /nix/store/2bb4dqllicbqdgs07l1xgcqxs6bs1hy5-zimg-3.0.6
  /nix/store/ivd3qx6dvhnx75jiwcgqw3762ybg8l15-zix-0.8.2
  /nix/store/cxl0dm4qhs087wd25ddqq4cj4ppi8w8q-zlib-1.3.2-static
  /nix/store/w34xm2cj8zshgkr23dpp490d0mnr39hx-zsh-you-should-use-1.11.1
  /nix/store/sgpz2fxnhhxmwwr9cm1rfx9dwn3vgp82-zvbi-0.2.45
warning: ignoring the client-specified setting 'store', because it is a restricted setting and you are not a trusted user
bbc65d7vfb736vc945qakz95cwpllhxb-offline.drv: gi-build-x86-02: error: Cannot build '/nix/store/bbc65d7vfb736vc945qakz95cwpllhxb-offline.drv'., asking the scheduler again
error: dependency 'z0bvk2ljbad53d5p5jivwcw1h89jk0r8-etc.drv' failed
failed checks.aarch64-darwin."home-manager-enzime@hyperion-macos" 13s
setup: don't know how to build these paths: /nix/store/27l9gm6h1rw6dm5bvfzfyf6dirxhq0pm-home-manager-generation.drv warning: ignoring the client-specified set …
setup:
don't know how to build these paths:
  /nix/store/27l9gm6h1rw6dm5bvfzfyf6dirxhq0pm-home-manager-generation.drv
warning: ignoring the client-specified setting 'store', because it is a restricted setting and you are not a trusted user
error: dependency '1661wzv4y1d39fld3iyc2c7hy02ckw5a-home-manager-path.drv' failed
failed checks.aarch64-darwin.nix-darwin-hyperion-macos 21s
setup: don't know how to build these paths: /nix/store/3lv8zvhl57m2hq12y02r5xsws0k11qql-darwin-system-26.11.4cff07d.drv warning: ignoring the client-specified …
setup:
don't know how to build these paths:
  /nix/store/3lv8zvhl57m2hq12y02r5xsws0k11qql-darwin-system-26.11.4cff07d.drv
warning: ignoring the client-specified setting 'store', because it is a restricted setting and you are not a trusted user
error: dependency 'yq0n9h0aa5nbf1g3zxfmlxbhll091w13-activation-enzime.drv' failed
failed checks.x86_64-linux."home-manager-enzime@phi-nixos" 15s
setup: bbc65d7vfb736vc945qakz95cwpllhxb-offline.drv: gi-build-x86-02: error: Cannot build '/nix/store/bbc65d7vfb736vc945qakz95cwpllhxb-offline.drv'., asking the …
setup:
bbc65d7vfb736vc945qakz95cwpllhxb-offline.drv: gi-build-x86-02: error: Cannot build '/nix/store/bbc65d7vfb736vc945qakz95cwpllhxb-offline.drv'., asking the scheduler again
bbc65d7vfb736vc945qakz95cwpllhxb-offline.drv: gi-build-x86-02: error: Cannot build '/nix/store/bbc65d7vfb736vc945qakz95cwpllhxb-offline.drv'., asking the scheduler again
bbc65d7vfb736vc945qakz95cwpllhxb-offline.drv: gi-build-x86-02: error: Cannot build '/nix/store/bbc65d7vfb736vc945qakz95cwpllhxb-offline.drv'., asking the scheduler again
bbc65d7vfb736vc945qakz95cwpllhxb-offline.drv: gi-build-x86-02: error: Cannot build '/nix/store/bbc65d7vfb736vc945qakz95cwpllhxb-offline.drv'., asking the scheduler again
bbc65d7vfb736vc945qakz95cwpllhxb-offline.drv: gi-build-x86-02: error: Cannot build '/nix/store/bbc65d7vfb736vc945qakz95cwpllhxb-offline.drv'., asking the scheduler again
bbc65d7vfb736vc945qakz95cwpllhxb-offline.drv: gi-build-x86-02: error: Cannot build '/nix/store/bbc65d7vfb736vc945qakz95cwpllhxb-offline.drv'., asking the scheduler again
bbc65d7vfb736vc945qakz95cwpllhxb-offline.drv: gi-build-x86-02: the build this call attached to did not finish, retry, asking the scheduler again
error: dependency 'gzdd5xb59ffmgixrq04bb8yml2ska3cc-home-manager-path.drv' failed
failed checks.x86_64-linux."home-manager-enzime@sigma" 12s
setup: don't know how to build these paths: /nix/store/0hf6bsd5mlg0ba34cl5q0x3yxrvcbrkp-home-manager-generation.drv warning: ignoring the client-specified set …
setup:
don't know how to build these paths:
  /nix/store/0hf6bsd5mlg0ba34cl5q0x3yxrvcbrkp-home-manager-generation.drv
warning: ignoring the client-specified setting 'store', because it is a restricted setting and you are not a trusted user
bbc65d7vfb736vc945qakz95cwpllhxb-offline.drv: gi-build-x86-02: the build this call attached to did not finish, retry, asking the scheduler again
bbc65d7vfb736vc945qakz95cwpllhxb-offline.drv: gi-build-x86-02: the build this call attached to did not finish, retry, asking the scheduler again
bbc65d7vfb736vc945qakz95cwpllhxb-offline.drv: gi-build-x86-02: the build this call attached to did not finish, retry, asking the scheduler again
error: dependency 'vv0wd91728rs6vi321h95fr8yvmv3vh1-home-manager-path.drv' failed
17 succeeded ⚠ 1
succeeded attributes
status attribute duration
succeeded checks.x86_64-linux.nixos-gaia
  • The option `nix.nixPath' defined in `/nix/store/iigqqr5hi294dgcpcjllyqnm0y2v81k2-source/flakeModules/clan.nix, via option flake.clan.machines.gaia' has been renamed to `nix.settings.nix-path'.
1m 20s
succeeded checks.aarch64-darwin.devShell-default 9s
succeeded checks.aarch64-darwin.package-gaia-vm 5s
succeeded checks.aarch64-darwin.package-phi-nixos-vm 4s
succeeded checks.aarch64-darwin.package-sigma-vm 4s
succeeded checks.aarch64-darwin.treefmt 7s
succeeded checks.aarch64-linux.devShell-default 6s
succeeded checks.aarch64-linux.package-gaia-vm 3s
succeeded checks.aarch64-linux.package-phi-nixos-vm 3s
succeeded checks.aarch64-linux.package-sigma-vm 3s
succeeded checks.aarch64-linux.treefmt 9s
succeeded checks.x86_64-linux.devShell-default 12s
succeeded checks.x86_64-linux."home-manager-enzime@gaia" 52s
succeeded checks.x86_64-linux.package-gaia-vm 5s
succeeded checks.x86_64-linux.package-phi-nixos-vm 9s
succeeded checks.x86_64-linux.package-sigma-vm 10s
succeeded checks.x86_64-linux.treefmt 7s
36 already built
skipped attributes
status attribute duration
loading…