nixbot

builds

Enzime/hyperconfig build #1154 failed

branch next · PR #1084 · commit ee5e8b56df · · took 2m 32s · eval 20s

eval warnings 1 kind · 2 occurrences
  • warn A legacy Nextcloud install (from before NixOS 26.11) may be installed. ×2

11 failed
failed attributes
status attribute duration
failed checks.aarch64-darwin.devShell-default 2m 1s
setup: don't know how to build these paths: /nix/store/q1ijlyrmm72v676px54q4vxryf0yqis3-nix-shell.drv warning: ignoring the client-specified setting 'store', …
setup:
don't know how to build these paths:
  /nix/store/q1ijlyrmm72v676px54q4vxryf0yqis3-nix-shell.drv
warning: ignoring the client-specified setting 'store', because it is a restricted setting and you are not a trusted user
warning: q1ijlyrmm72v676px54q4vxryf0yqis3-nix-shell.drv: no connected, non-draining worker for system 'aarch64-darwin' offers features {}, the workers offer {}, waiting up to 120s for a worker
q1ijlyrmm72v676px54q4vxryf0yqis3-nix-shell.drv: no connected, non-draining worker for system 'aarch64-darwin' offers features {}, the workers offer {}
error: no connected, non-draining worker for system 'aarch64-darwin' offers features {}, the workers offer {}
failed checks.aarch64-darwin."home-manager-enzime@hyperion-macos" 2m 3s
setup: warning: m1s7ava6msnw886wi58l9p31gabqqpq7-home-manager-fonts.drv: no connected, non-draining worker for system 'aarch64-darwin' offers features {}, the w …
setup:
warning: m1s7ava6msnw886wi58l9p31gabqqpq7-home-manager-fonts.drv: no connected, non-draining worker for system 'aarch64-darwin' offers features {}, the workers offer {}, waiting up to 120s for a worker
warning: nx9p4ykxwq34sl2smaikg9hxlxcv6zzk-home-manager-applications.drv: no connected, non-draining worker for system 'aarch64-darwin' offers features {}, the workers offer {}, waiting up to 120s for a worker
warning: z0j8jris347jf26gqz3xhxz8mkwrn2s2-onepassword-password-manager-8.12.41.1.drv: no connected, non-draining worker for system 'aarch64-darwin' offers features {}, the workers offer {}, waiting up to 120s for a worker
07wq8kb4l5k246bkgssli6xya6acajcz-home-manager-path.drv: no connected, non-draining worker for system 'aarch64-darwin' offers features {}, the workers offer {}
m1s7ava6msnw886wi58l9p31gabqqpq7-home-manager-fonts.drv: no connected, non-draining worker for system 'aarch64-darwin' offers features {}, the workers offer {}
nx9p4ykxwq34sl2smaikg9hxlxcv6zzk-home-manager-applications.drv: no connected, non-draining worker for system 'aarch64-darwin' offers features {}, the workers offer {}
z0j8jris347jf26gqz3xhxz8mkwrn2s2-onepassword-password-manager-8.12.41.1.drv: no connected, non-draining worker for system 'aarch64-darwin' offers features {}, the workers offer {}
error: dependency '07wq8kb4l5k246bkgssli6xya6acajcz-home-manager-path.drv' failed
failed checks.aarch64-darwin.nix-darwin-hyperion-macos 2m 12s
setup: warning: ignoring the client-specified setting 'store', because it is a restricted setting and you are not a trusted user warning: 036xwd6xb9i7ahi90y2fjn …
setup:
warning: ignoring the client-specified setting 'store', because it is a restricted setting and you are not a trusted user
warning: 036xwd6xb9i7ahi90y2fjnvvpimzgdha-etc-registry.json.drv: no connected, non-draining worker for system 'aarch64-darwin' offers features {}, the workers offer {}, waiting up to 120s for a worker
warning: a6zx0rk1fgl5f41kmaxkdc9ps4lw1fkx-darwin-version.json.drv: no connected, non-draining worker for system 'aarch64-darwin' offers features {}, the workers offer {}, waiting up to 120s for a worker
warning: z0j8jris347jf26gqz3xhxz8mkwrn2s2-onepassword-password-manager-8.12.41.1.drv: no connected, non-draining worker for system 'aarch64-darwin' offers features {}, the workers offer {}, waiting up to 120s for a worker
036xwd6xb9i7ahi90y2fjnvvpimzgdha-etc-registry.json.drv: no connected, non-draining worker for system 'aarch64-darwin' offers features {}, the workers offer {}
a6zx0rk1fgl5f41kmaxkdc9ps4lw1fkx-darwin-version.json.drv: no connected, non-draining worker for system 'aarch64-darwin' offers features {}, the workers offer {}
z0j8jris347jf26gqz3xhxz8mkwrn2s2-onepassword-password-manager-8.12.41.1.drv: no connected, non-draining worker for system 'aarch64-darwin' offers features {}, the workers offer {}
error: dependency 'a6zx0rk1fgl5f41kmaxkdc9ps4lw1fkx-darwin-version.json.drv' failed
failed checks.aarch64-darwin.package-gaia-vm 2m 0s
setup: don't know how to build these paths: /nix/store/jk2wr3pl0c13ndpwkcgq748bl5ia13i5-run-gaia-vm-on-aarch64-darwin.drv warning: ignoring the client-specifi …
setup:
don't know how to build these paths:
  /nix/store/jk2wr3pl0c13ndpwkcgq748bl5ia13i5-run-gaia-vm-on-aarch64-darwin.drv
warning: ignoring the client-specified setting 'store', because it is a restricted setting and you are not a trusted user
warning: jk2wr3pl0c13ndpwkcgq748bl5ia13i5-run-gaia-vm-on-aarch64-darwin.drv: no connected, non-draining worker for system 'aarch64-darwin' offers features {}, the workers offer {}, waiting up to 120s for a worker
jk2wr3pl0c13ndpwkcgq748bl5ia13i5-run-gaia-vm-on-aarch64-darwin.drv: no connected, non-draining worker for system 'aarch64-darwin' offers features {}, the workers offer {}
error: no connected, non-draining worker for system 'aarch64-darwin' offers features {}, the workers offer {}
failed checks.aarch64-darwin.package-phi-nixos-vm 2m 0s
setup: don't know how to build these paths: /nix/store/qqbmx5fm1x0psadi3kxfkq523cvj4c9f-run-phi-nixos-vm-on-aarch64-darwin.drv warning: ignoring the client-sp …
setup:
don't know how to build these paths:
  /nix/store/qqbmx5fm1x0psadi3kxfkq523cvj4c9f-run-phi-nixos-vm-on-aarch64-darwin.drv
warning: ignoring the client-specified setting 'store', because it is a restricted setting and you are not a trusted user
warning: qqbmx5fm1x0psadi3kxfkq523cvj4c9f-run-phi-nixos-vm-on-aarch64-darwin.drv: no connected, non-draining worker for system 'aarch64-darwin' offers features {}, the workers offer {}, waiting up to 120s for a worker
qqbmx5fm1x0psadi3kxfkq523cvj4c9f-run-phi-nixos-vm-on-aarch64-darwin.drv: no connected, non-draining worker for system 'aarch64-darwin' offers features {}, the workers offer {}
error: no connected, non-draining worker for system 'aarch64-darwin' offers features {}, the workers offer {}
failed checks.aarch64-darwin.package-sigma-vm 2m 1s
setup: don't know how to build these paths: /nix/store/ny0qvg0b83bfbzpr40mx80h4958l95b2-run-sigma-vm-on-aarch64-darwin.drv warning: ignoring the client-specif …
setup:
don't know how to build these paths:
  /nix/store/ny0qvg0b83bfbzpr40mx80h4958l95b2-run-sigma-vm-on-aarch64-darwin.drv
warning: ignoring the client-specified setting 'store', because it is a restricted setting and you are not a trusted user
warning: ny0qvg0b83bfbzpr40mx80h4958l95b2-run-sigma-vm-on-aarch64-darwin.drv: no connected, non-draining worker for system 'aarch64-darwin' offers features {}, the workers offer {}, waiting up to 120s for a worker
ny0qvg0b83bfbzpr40mx80h4958l95b2-run-sigma-vm-on-aarch64-darwin.drv: no connected, non-draining worker for system 'aarch64-darwin' offers features {}, the workers offer {}
error: no connected, non-draining worker for system 'aarch64-darwin' offers features {}, the workers offer {}
failed checks.aarch64-darwin.package-tf-apply 2m 0s
setup: don't know how to build these paths: /nix/store/pgl242q37zh417xv03xs1l2xlwny3pc3-tf-apply.drv warning: ignoring the client-specified setting 'store', b …
setup:
don't know how to build these paths:
  /nix/store/pgl242q37zh417xv03xs1l2xlwny3pc3-tf-apply.drv
warning: ignoring the client-specified setting 'store', because it is a restricted setting and you are not a trusted user
warning: wsz0j307svrcd6abx37n6hh27m051v8l-config.tf.json.drv: no connected, non-draining worker for system 'aarch64-darwin' offers features {}, the workers offer {}, waiting up to 120s for a worker
wsz0j307svrcd6abx37n6hh27m051v8l-config.tf.json.drv: no connected, non-draining worker for system 'aarch64-darwin' offers features {}, the workers offer {}
error: dependency 'wsz0j307svrcd6abx37n6hh27m051v8l-config.tf.json.drv' failed
failed checks.aarch64-darwin.treefmt 2m 2s
setup: don't know how to build these paths: /nix/store/z3b97qvavyza241r8306l26fig972ykv-treefmt-check.drv warning: ignoring the client-specified setting 'stor …
setup:
don't know how to build these paths:
  /nix/store/z3b97qvavyza241r8306l26fig972ykv-treefmt-check.drv
warning: ignoring the client-specified setting 'store', because it is a restricted setting and you are not a trusted user
warning: z3b97qvavyza241r8306l26fig972ykv-treefmt-check.drv: no connected, non-draining worker for system 'aarch64-darwin' offers features {}, the workers offer {}, waiting up to 120s for a worker
z3b97qvavyza241r8306l26fig972ykv-treefmt-check.drv: no connected, non-draining worker for system 'aarch64-darwin' offers features {}, the workers offer {}
error: no connected, non-draining worker for system 'aarch64-darwin' offers features {}, the workers offer {}
failed checks.aarch64-linux.package-tf 1s
setup: don't know how to build these paths: /nix/store/fi17140nscf5wcvwp0ix7d33cgpr6bgr-opentofu-1.13.1.drv warning: ignoring the client-specified setting 'st …
setup:
don't know how to build these paths:
  /nix/store/fi17140nscf5wcvwp0ix7d33cgpr6bgr-opentofu-1.13.1.drv
warning: ignoring the client-specified setting 'store', because it is a restricted setting and you are not a trusted user
fi17140nscf5wcvwp0ix7d33cgpr6bgr-opentofu-1.13.1.drv: error: gRPC AddMultipleToStore on 'nix-store.geninf.io:50051' failed: error: some references of path '/nix/store/1n1722ckpyr399w2w3bb74ad98n8z94f-terraform-provider-gitea-0.8.1.drv' could not be realised
error: error: gRPC AddMultipleToStore on 'nix-store.geninf.io:50051' failed: error: some references of path '/nix/store/1n1722ckpyr399w2w3bb74ad98n8z94f-terraform-provider-gitea-0.8.1.drv' could not be realised
failed checks.aarch64-linux.package-tf-apply 4s
setup: 25kss3zw4bm1rnyhl3nsj8wcpy8xs1sf-config.tf.json.drv: build01: build01: input not substitutable: error: path '/nix/store/3aw2mzjm25zdndvnynizc4dx8jvw51y2- …
setup:
25kss3zw4bm1rnyhl3nsj8wcpy8xs1sf-config.tf.json.drv: build01: build01: input not substitutable: error: path '/nix/store/3aw2mzjm25zdndvnynizc4dx8jvw51y2-opentofu-external-key-provider' is required, but there is no substituter that can build it, asking the scheduler again
25kss3zw4bm1rnyhl3nsj8wcpy8xs1sf-config.tf.json.drv: build01: build01: input not substitutable: error: path '/nix/store/3aw2mzjm25zdndvnynizc4dx8jvw51y2-opentofu-external-key-provider' is required, but there is no substituter that can build it, asking the scheduler again
25kss3zw4bm1rnyhl3nsj8wcpy8xs1sf-config.tf.json.drv: build01: build01: input not substitutable: error: path '/nix/store/3aw2mzjm25zdndvnynizc4dx8jvw51y2-opentofu-external-key-provider' is required, but there is no substituter that can build it, asking the scheduler again
25kss3zw4bm1rnyhl3nsj8wcpy8xs1sf-config.tf.json.drv: build01: build01: input not substitutable: error: path '/nix/store/3aw2mzjm25zdndvnynizc4dx8jvw51y2-opentofu-external-key-provider' is required, but there is no substituter that can build it, asking the scheduler again
25kss3zw4bm1rnyhl3nsj8wcpy8xs1sf-config.tf.json.drv: build01: build01: input not substitutable: error: path '/nix/store/3aw2mzjm25zdndvnynizc4dx8jvw51y2-opentofu-external-key-provider' is required, but there is no substituter that can build it, asking the scheduler again
25kss3zw4bm1rnyhl3nsj8wcpy8xs1sf-config.tf.json.drv: build01: build01: input not substitutable: error: path '/nix/store/3aw2mzjm25zdndvnynizc4dx8jvw51y2-opentofu-external-key-provider' is required, but there is no substituter that can build it, asking the scheduler again
25kss3zw4bm1rnyhl3nsj8wcpy8xs1sf-config.tf.json.drv: build01: build01: input not substitutable: error: path '/nix/store/3aw2mzjm25zdndvnynizc4dx8jvw51y2-opentofu-external-key-provider' is required, but there is no substituter that can build it, asking the scheduler again
error: dependency '25kss3zw4bm1rnyhl3nsj8wcpy8xs1sf-config.tf.json.drv' failed
failed checks.aarch64-linux.treefmt 3s
setup: don't know how to build these paths: /nix/store/r4scf6h29qb2jvp7gz3ndav63j8i8am4-treefmt-check.drv warning: ignoring the client-specified setting 'stor …
setup:
don't know how to build these paths:
  /nix/store/r4scf6h29qb2jvp7gz3ndav63j8i8am4-treefmt-check.drv
warning: ignoring the client-specified setting 'store', because it is a restricted setting and you are not a trusted user
r4scf6h29qb2jvp7gz3ndav63j8i8am4-treefmt-check.drv: error: gRPC AddMultipleToStore on 'nix-store.geninf.io:50051' failed: error: some references of path '/nix/store/rnbix0f1rip6cc9h99h2p6rw436y0v0x-actionlint-1.7.12.drv' could not be realised
error: error: gRPC AddMultipleToStore on 'nix-store.geninf.io:50051' failed: error: some references of path '/nix/store/rnbix0f1rip6cc9h99h2p6rw436y0v0x-actionlint-1.7.12.drv' could not be realised
13 succeeded ⚠ 1
succeeded attributes
status attribute duration
succeeded checks.x86_64-linux.nixos-phi-nixos
  • A legacy Nextcloud install (from before NixOS 26.11) may be installed. After nextcloud33 is installed successfully, you can safely upgrade to 34. The latest version available is Nextcloud35. Please note that Nextcloud doesn't support upgrades across multiple major versions (i.e. an upgrade from 16 is possible to 17, but not 16 to 18). The package can be upgraded by explicitly declaring the service-option `services.nextcloud.package`.
  • A legacy Nextcloud install (from before NixOS 26.11) may be installed. After nextcloud34 is installed successfully, you can safely upgrade to 35. The latest version available is Nextcloud35. Please note that Nextcloud doesn't support upgrades across multiple major versions (i.e. an upgrade from 16 is possible to 17, but not 16 to 18). The package can be upgraded by explicitly declaring the service-option `services.nextcloud.package`.
1m 15s
succeeded checks.aarch64-linux.package-gaia-vm 3s
succeeded checks.aarch64-linux.package-phi-nixos-vm 3s
succeeded checks.aarch64-linux.package-sigma-vm 3s
succeeded checks.x86_64-linux."home-manager-enzime@gaia" 26s
succeeded checks.x86_64-linux."home-manager-enzime@phi-nixos" 32s
succeeded checks.x86_64-linux."home-manager-enzime@sigma" 33s
succeeded checks.x86_64-linux.nixos-gaia 1m 18s
succeeded checks.x86_64-linux.nixos-sigma 1m 21s
succeeded checks.x86_64-linux.package-gaia-vm 2s
succeeded checks.x86_64-linux.package-phi-nixos-vm 3s
succeeded checks.x86_64-linux.package-sigma-vm 2s
succeeded checks.x86_64-linux.treefmt 2s
35 already built
skipped attributes
status attribute duration
loading…