nixbot

builds
1attached to the build already running on this worker2build04: building 4w2i78yaw494w035ylwp77f5sr60wjbb-python3.14-debugpy-1.8.22.drv3Sourcing python-remove-tests-dir-hook4Sourcing python-catch-conflicts-hook.sh5Sourcing python-remove-bin-bytecode-hook.sh6Sourcing pypa-build-hook7Using pypaBuildPhase8Sourcing python-runtime-deps-check-hook9Using pythonRuntimeDepsCheckHook10Sourcing pypa-install-hook11Using pypaInstallPhase12Sourcing python-imports-check-hook.sh13Using pythonImportsCheckPhase14Sourcing python-metadata-check-hook.sh15Using pythonMetadataCheckPhase16Sourcing python-namespaces-hook17Sourcing python-catch-conflicts-hook.sh18Sourcing pytest-check-hook19Using pytestCheckPhase
unpackPhase
20unpacking source archive /nix/store/x73cdvf671c483vwdf1c4pc80ff825qq-source21source root is source22setting SOURCE_DATE_EPOCH to timestamp 315619200 of file "source/versioneer.py"
patchPhase
23applying patch /nix/store/dd49clq24rw888pkmd4ys0dg7wm4c5vi-fix-test-pythonpath.patch24patching file tests/debug/session.py25Hunk #1 succeeded at 788 (offset 84 lines).26applying patch /nix/store/0438s8wxvj1jxz21p9b7676cdcrhry35-skip-attach-pid-tests.patch27patching file tests/debug/runners.py28patching file tests/debugpy/test_attach.py29Hunk #1 succeeded at 201 (offset 48 lines).30applying patch /nix/store/ifflbsdv8vrpn71v99y34sggi72894s0-hardcode-lldb.patch31patching file src/debugpy/_vendored/pydevd/pydevd_attach_to_process/add_code_to_python_process.py32Hunk #1 succeeded at 510 (offset 7 lines).
configurePhase
33no configure script, doing nothing
buildPhase
34Executing pypaBuildPhase35+++++ cd src/debugpy/_vendored/pydevd/pydevd_attach_to_process36+++++ clang++ linux_and_mac/attach.cpp -Ilinux_and_mac -std=c++11 -fPIC -nostartfiles -D_REENTRANT -dynamiclib -lc -o attach.dylib37In file included from linux_and_mac/attach.cpp:15:38In file included from linux_and_mac/../common/py_settrace.hpp:7:39In file included from linux_and_mac/../common/py_custom_pyeval_settrace.hpp:7:40linux_and_mac/../common/py_custom_pyeval_settrace_310.hpp:107:37: warning: comparison of function 'InternalTraceTrampoline310' not equal to a null pointer is always true [-Wtautological-pointer-compare]41 107 | tstate->cframe->use_tracing = ((InternalTraceTrampoline310 != NULL)42 | ^~~~~~~~~~~~~~~~~~~~~~~~~~ ~~~~43linux_and_mac/../common/py_custom_pyeval_settrace_310.hpp:107:37: note: prefix with the address-of operator to silence this warning44 107 | tstate->cframe->use_tracing = ((InternalTraceTrampoline310 != NULL)45 | ^46 | &47In file included from linux_and_mac/attach.cpp:15:48In file included from linux_and_mac/../common/py_settrace.hpp:7:49In file included from linux_and_mac/../common/py_custom_pyeval_settrace.hpp:8:50linux_and_mac/../common/py_custom_pyeval_settrace_311.hpp:111:21: warning: comparison of function 'InternalTraceTrampoline311' not equal to a null pointer is always true [-Wtautological-pointer-compare]51 111 | use_tracing = ((InternalTraceTrampoline311 != NULL)52 | ^~~~~~~~~~~~~~~~~~~~~~~~~~ ~~~~53linux_and_mac/../common/py_custom_pyeval_settrace_311.hpp:111:21: note: prefix with the address-of operator to silence this warning54 111 | use_tracing = ((InternalTraceTrampoline311 != NULL)55 | ^56 | &57In file included from linux_and_mac/attach.cpp:15:58In file included from linux_and_mac/../common/py_settrace.hpp:7:59linux_and_mac/../common/py_custom_pyeval_settrace.hpp:164:29: warning: comparison of function 'InternalTraceTrampoline' not equal to a null pointer is always true [-Wtautological-pointer-compare]60 164 | tstate->use_tracing = ((InternalTraceTrampoline != NULL)61 | ^~~~~~~~~~~~~~~~~~~~~~~ ~~~~62linux_and_mac/../common/py_custom_pyeval_settrace.hpp:164:29: note: prefix with the address-of operator to silence this warning63 164 | tstate->use_tracing = ((InternalTraceTrampoline != NULL)64 | ^65 | &66linux_and_mac/../common/py_custom_pyeval_settrace.hpp:164:29: warning: comparison of function 'InternalTraceTrampoline' not equal to a null pointer is always true [-Wtautological-pointer-compare]67 164 | tstate->use_tracing = ((InternalTraceTrampoline != NULL)68 | ^~~~~~~~~~~~~~~~~~~~~~~ ~~~~69linux_and_mac/../common/py_custom_pyeval_settrace.hpp:173:9: note: in instantiation of function template specialization 'InternalPySetTrace_Template<PyThreadState_25_27 *>' requested here70 173 | InternalPySetTrace_Template<PyThreadState_25_27*>(reinterpret_cast<PyThreadState_25_27*>(curThread), traceFunc, isDebug);71 | ^72linux_and_mac/../common/py_custom_pyeval_settrace.hpp:164:29: note: prefix with the address-of operator to silence this warning73 164 | tstate->use_tracing = ((InternalTraceTrampoline != NULL)74 | ^75 | &76linux_and_mac/../common/py_custom_pyeval_settrace.hpp:164:29: warning: comparison of function 'InternalTraceTrampoline' not equal to a null pointer is always true [-Wtautological-pointer-compare]77 164 | tstate->use_tracing = ((InternalTraceTrampoline != NULL)78 | ^~~~~~~~~~~~~~~~~~~~~~~ ~~~~79linux_and_mac/../common/py_custom_pyeval_settrace.hpp:175:9: note: in instantiation of function template specialization 'InternalPySetTrace_Template<PyThreadState_30_33 *>' requested here80 175 | InternalPySetTrace_Template<PyThreadState_30_33*>(reinterpret_cast<PyThreadState_30_33*>(curThread), traceFunc, isDebug);81 | ^82linux_and_mac/../common/py_custom_pyeval_settrace.hpp:164:29: note: prefix with the address-of operator to silence this warning83 164 | tstate->use_tracing = ((InternalTraceTrampoline != NULL)84 | ^85 | &86linux_and_mac/../common/py_custom_pyeval_settrace.hpp:164:29: warning: comparison of function 'InternalTraceTrampoline' not equal to a null pointer is always true [-Wtautological-pointer-compare]87 164 | tstate->use_tracing = ((InternalTraceTrampoline != NULL)88 | ^~~~~~~~~~~~~~~~~~~~~~~ ~~~~89linux_and_mac/../common/py_custom_pyeval_settrace.hpp:177:9: note: in instantiation of function template specialization 'InternalPySetTrace_Template<PyThreadState_34_36 *>' requested here90 177 | InternalPySetTrace_Template<PyThreadState_34_36*>(reinterpret_cast<PyThreadState_34_36*>(curThread), traceFunc, isDebug);91 | ^92linux_and_mac/../common/py_custom_pyeval_settrace.hpp:164:29: note: prefix with the address-of operator to silence this warning93 164 | tstate->use_tracing = ((InternalTraceTrampoline != NULL)94 | ^95 | &96linux_and_mac/../common/py_custom_pyeval_settrace.hpp:164:29: warning: comparison of function 'InternalTraceTrampoline' not equal to a null pointer is always true [-Wtautological-pointer-compare]97 164 | tstate->use_tracing = ((InternalTraceTrampoline != NULL)98 | ^~~~~~~~~~~~~~~~~~~~~~~ ~~~~99linux_and_mac/../common/py_custom_pyeval_settrace.hpp:179:9: note: in instantiation of function template specialization 'InternalPySetTrace_Template<PyThreadState_37_38 *>' requested here100 179 | InternalPySetTrace_Template<PyThreadState_37_38*>(reinterpret_cast<PyThreadState_37_38*>(curThread), traceFunc, isDebug);101 | ^102linux_and_mac/../common/py_custom_pyeval_settrace.hpp:164:29: note: prefix with the address-of operator to silence this warning103 164 | tstate->use_tracing = ((InternalTraceTrampoline != NULL)104 | ^105 | &106linux_and_mac/../common/py_custom_pyeval_settrace.hpp:164:29: warning: comparison of function 'InternalTraceTrampoline' not equal to a null pointer is always true [-Wtautological-pointer-compare]107 164 | tstate->use_tracing = ((InternalTraceTrampoline != NULL)108 | ^~~~~~~~~~~~~~~~~~~~~~~ ~~~~109linux_and_mac/../common/py_custom_pyeval_settrace.hpp:181:9: note: in instantiation of function template specialization 'InternalPySetTrace_Template<PyThreadState_39 *>' requested here110 181 | InternalPySetTrace_Template<PyThreadState_39*>(reinterpret_cast<PyThreadState_39*>(curThread), traceFunc, isDebug);111 | ^112linux_and_mac/../common/py_custom_pyeval_settrace.hpp:164:29: note: prefix with the address-of operator to silence this warning113 164 | tstate->use_tracing = ((InternalTraceTrampoline != NULL)114 | ^115 | &116In file included from linux_and_mac/attach.cpp:15:117In file included from linux_and_mac/../common/py_settrace.hpp:7:118In file included from linux_and_mac/../common/py_custom_pyeval_settrace.hpp:7:119linux_and_mac/../common/py_custom_pyeval_settrace_310.hpp:107:37: warning: comparison of function 'InternalTraceTrampoline310' not equal to a null pointer is always true [-Wtautological-pointer-compare]120 107 | tstate->cframe->use_tracing = ((InternalTraceTrampoline310 != NULL)121 | ^~~~~~~~~~~~~~~~~~~~~~~~~~ ~~~~122linux_and_mac/../common/py_custom_pyeval_settrace.hpp:184:9: note: in instantiation of function template specialization 'InternalPySetTrace_Template310<PyThreadState_310 *>' requested here123 184 | InternalPySetTrace_Template310<PyThreadState_310*>(reinterpret_cast<PyThreadState_310*>(curThread), traceFunc, isDebug);124 | ^125linux_and_mac/../common/py_custom_pyeval_settrace_310.hpp:107:37: note: prefix with the address-of operator to silence this warning126 107 | tstate->cframe->use_tracing = ((InternalTraceTrampoline310 != NULL)127 | ^128 | &129In file included from linux_and_mac/attach.cpp:15:130In file included from linux_and_mac/../common/py_settrace.hpp:7:131In file included from linux_and_mac/../common/py_custom_pyeval_settrace.hpp:8:132linux_and_mac/../common/py_custom_pyeval_settrace_311.hpp:111:21: warning: comparison of function 'InternalTraceTrampoline311' not equal to a null pointer is always true [-Wtautological-pointer-compare]133 111 | use_tracing = ((InternalTraceTrampoline311 != NULL)134 | ^~~~~~~~~~~~~~~~~~~~~~~~~~ ~~~~135linux_and_mac/../common/py_custom_pyeval_settrace.hpp:186:9: note: in instantiation of function template specialization 'InternalPySetTrace_Template311<PyThreadState_311 *>' requested here136 186 | InternalPySetTrace_Template311<PyThreadState_311*>(reinterpret_cast<PyThreadState_311*>(curThread), traceFunc, isDebug);137 | ^138linux_and_mac/../common/py_custom_pyeval_settrace_311.hpp:111:21: note: prefix with the address-of operator to silence this warning139 111 | use_tracing = ((InternalTraceTrampoline311 != NULL)140 | ^141 | &14210 warnings generated.143Creating a wheel...144pypa build flags: --no-isolation --outdir dist/ --wheel145* Getting build dependencies for wheel...146/nix/store/cp6vhcyg8bna8rrmnamn75ii070diafk-python3.14-setuptools-83.0.0/lib/python3.14/site-packages/setuptools/dist.py:765: SetuptoolsDeprecationWarning: License classifiers are deprecated.147!!148149 ********************************************************************************150 Please consider removing the following classifiers in favor of a SPDX license expression:151152 License :: OSI Approved :: MIT License153154 See https://packaging.python.org/en/latest/guides/writing-pyproject-toml/#license for details.155 ********************************************************************************156157!!158 self._finalize_license_expression()159running egg_info160creating src/debugpy.egg-info161writing src/debugpy.egg-info/PKG-INFO162writing dependency_links to src/debugpy.egg-info/dependency_links.txt163writing entry points to src/debugpy.egg-info/entry_points.txt164writing top-level names to src/debugpy.egg-info/top_level.txt165writing manifest file 'src/debugpy.egg-info/SOURCES.txt'166running build_ext167building '_pydevd_bundle.pydevd_cython' extension168creating build/temp.macosx-14.0-arm64-cpython-314/_pydevd_bundle169clang -fno-strict-overflow -Wsign-compare -Wunreachable-code -DNDEBUG -g -O3 -Wall -DPy_BUILD_CORE_MODULE=1 -I/nix/store/0kcws5blwbdyxqxjd1w8hjipz61xny3k-python3-3.14.7/include/python3.14 -c _pydevd_bundle/pydevd_cython.c -o build/temp.macosx-14.0-arm64-cpython-314/_pydevd_bundle/pydevd_cython.o170creating build/lib.macosx-14.0-arm64-cpython-314/_pydevd_bundle171clang -bundle -undefined dynamic_lookup -L/nix/store/eeeeeeeeeeeeeeeeeeeeeeeeeeeeeeee-bzip2-1.0.8/lib -L/nix/store/eeeeeeeeeeeeeeeeeeeeeeeeeeeeeeee-libffi-40/lib -L/nix/store/eeeeeeeeeeeeeeeeeeeeeeeeeeeeeeee-ncurses-6.6/lib -L/nix/store/eeeeeeeeeeeeeeeeeeeeeeeeeeeeeeee-xz-5.8.4/lib -L/nix/store/eeeeeeeeeeeeeeeeeeeeeeeeeeeeeeee-zlib-1.3.2/lib -L/nix/store/eeeeeeeeeeeeeeeeeeeeeeeeeeeeeeee-openssl-3.5.8/lib -L/nix/store/eeeeeeeeeeeeeeeeeeeeeeeeeeeeeeee-sqlite-3.53.3/lib -L/nix/store/eeeeeeeeeeeeeeeeeeeeeeeeeeeeeeee-mpdecimal-4.0.1/lib -L/nix/store/eeeeeeeeeeeeeeeeeeeeeeeeeeeeeeee-expat-2.8.5/lib -L/nix/store/eeeeeeeeeeeeeeeeeeeeeeeeeeeeeeee-zstd-1.5.7/lib -L/nix/store/rhri8qncla0wkx4wpl10a48lxai3ng5b-tzdata-2026d/lib -L/nix/store/eeeeeeeeeeeeeeeeeeeeeeeeeeeeeeee-gdbm-1.26-lib/lib -L/nix/store/eeeeeeeeeeeeeeeeeeeeeeeeeeeeeeee-readline-8.3p3/lib -L/nix/store/eeeeeeeeeeeeeeeeeeeeeeeeeeeeeeee-bzip2-1.0.8/lib -L/nix/store/eeeeeeeeeeeeeeeeeeeeeeeeeeeeeeee-libffi-40/lib -L/nix/store/eeeeeeeeeeeeeeeeeeeeeeeeeeeeeeee-ncurses-6.6/lib -L/nix/store/eeeeeeeeeeeeeeeeeeeeeeeeeeeeeeee-xz-5.8.4/lib -L/nix/store/eeeeeeeeeeeeeeeeeeeeeeeeeeeeeeee-zlib-1.3.2/lib -L/nix/store/eeeeeeeeeeeeeeeeeeeeeeeeeeeeeeee-openssl-3.5.8/lib -L/nix/store/eeeeeeeeeeeeeeeeeeeeeeeeeeeeeeee-sqlite-3.53.3/lib -L/nix/store/eeeeeeeeeeeeeeeeeeeeeeeeeeeeeeee-mpdecimal-4.0.1/lib -L/nix/store/eeeeeeeeeeeeeeeeeeeeeeeeeeeeeeee-expat-2.8.5/lib -L/nix/store/eeeeeeeeeeeeeeeeeeeeeeeeeeeeeeee-zstd-1.5.7/lib -L/nix/store/rhri8qncla0wkx4wpl10a48lxai3ng5b-tzdata-2026d/lib -L/nix/store/eeeeeeeeeeeeeeeeeeeeeeeeeeeeeeee-gdbm-1.26-lib/lib -L/nix/store/eeeeeeeeeeeeeeeeeeeeeeeeeeeeeeee-readline-8.3p3/lib build/temp.macosx-14.0-arm64-cpython-314/_pydevd_bundle/pydevd_cython.o -L/nix/store/0kcws5blwbdyxqxjd1w8hjipz61xny3k-python3-3.14.7/lib -o build/lib.macosx-14.0-arm64-cpython-314/_pydevd_bundle/pydevd_cython.cpython-314-darwin.so172ld: warning: directory not found for option '-L/nix/store/eeeeeeeeeeeeeeeeeeeeeeeeeeeeeeee-bzip2-1.0.8/lib'173ld: warning: directory not found for option '-L/nix/store/eeeeeeeeeeeeeeeeeeeeeeeeeeeeeeee-libffi-40/lib'174ld: warning: directory not found for option '-L/nix/store/eeeeeeeeeeeeeeeeeeeeeeeeeeeeeeee-ncurses-6.6/lib'175ld: warning: directory not found for option '-L/nix/store/eeeeeeeeeeeeeeeeeeeeeeeeeeeeeeee-xz-5.8.4/lib'176ld: warning: directory not found for option '-L/nix/store/eeeeeeeeeeeeeeeeeeeeeeeeeeeeeeee-zlib-1.3.2/lib'177ld: warning: directory not found for option '-L/nix/store/eeeeeeeeeeeeeeeeeeeeeeeeeeeeeeee-openssl-3.5.8/lib'178ld: warning: directory not found for option '-L/nix/store/eeeeeeeeeeeeeeeeeeeeeeeeeeeeeeee-sqlite-3.53.3/lib'179ld: warning: directory not found for option '-L/nix/store/eeeeeeeeeeeeeeeeeeeeeeeeeeeeeeee-mpdecimal-4.0.1/lib'180ld: warning: directory not found for option '-L/nix/store/eeeeeeeeeeeeeeeeeeeeeeeeeeeeeeee-expat-2.8.5/lib'181ld: warning: directory not found for option '-L/nix/store/eeeeeeeeeeeeeeeeeeeeeeeeeeeeeeee-zstd-1.5.7/lib'182ld: warning: directory not found for option '-L/nix/store/rhri8qncla0wkx4wpl10a48lxai3ng5b-tzdata-2026d/lib'183ld: warning: directory not found for option '-L/nix/store/eeeeeeeeeeeeeeeeeeeeeeeeeeeeeeee-gdbm-1.26-lib/lib'184ld: warning: directory not found for option '-L/nix/store/eeeeeeeeeeeeeeeeeeeeeeeeeeeeeeee-readline-8.3p3/lib'185ld: warning: directory not found for option '-L/nix/store/eeeeeeeeeeeeeeeeeeeeeeeeeeeeeeee-bzip2-1.0.8/lib'186ld: warning: directory not found for option '-L/nix/store/eeeeeeeeeeeeeeeeeeeeeeeeeeeeeeee-libffi-40/lib'187ld: warning: directory not found for option '-L/nix/store/eeeeeeeeeeeeeeeeeeeeeeeeeeeeeeee-ncurses-6.6/lib'188ld: warning: directory not found for option '-L/nix/store/eeeeeeeeeeeeeeeeeeeeeeeeeeeeeeee-xz-5.8.4/lib'189ld: warning: directory not found for option '-L/nix/store/eeeeeeeeeeeeeeeeeeeeeeeeeeeeeeee-zlib-1.3.2/lib'190ld: warning: directory not found for option '-L/nix/store/eeeeeeeeeeeeeeeeeeeeeeeeeeeeeeee-openssl-3.5.8/lib'191ld: warning: directory not found for option '-L/nix/store/eeeeeeeeeeeeeeeeeeeeeeeeeeeeeeee-sqlite-3.53.3/lib'192ld: warning: directory not found for option '-L/nix/store/eeeeeeeeeeeeeeeeeeeeeeeeeeeeeeee-mpdecimal-4.0.1/lib'193ld: warning: directory not found for option '-L/nix/store/eeeeeeeeeeeeeeeeeeeeeeeeeeeeeeee-expat-2.8.5/lib'194ld: warning: directory not found for option '-L/nix/store/eeeeeeeeeeeeeeeeeeeeeeeeeeeeeeee-zstd-1.5.7/lib'195ld: warning: directory not found for option '-L/nix/store/rhri8qncla0wkx4wpl10a48lxai3ng5b-tzdata-2026d/lib'196ld: warning: directory not found for option '-L/nix/store/eeeeeeeeeeeeeeeeeeeeeeeeeeeeeeee-gdbm-1.26-lib/lib'197ld: warning: directory not found for option '-L/nix/store/eeeeeeeeeeeeeeeeeeeeeeeeeeeeeeee-readline-8.3p3/lib'198copying build/lib.macosx-14.0-arm64-cpython-314/_pydevd_bundle/pydevd_cython.cpython-314-darwin.so -> _pydevd_bundle199running build_ext200building '_pydevd_sys_monitoring._pydevd_sys_monitoring_cython' extension201creating build/temp.macosx-14.0-arm64-cpython-314/_pydevd_sys_monitoring202clang -fno-strict-overflow -Wsign-compare -Wunreachable-code -DNDEBUG -g -O3 -Wall -DPy_BUILD_CORE_MODULE=1 -I/nix/store/0kcws5blwbdyxqxjd1w8hjipz61xny3k-python3-3.14.7/include/python3.14 -c _pydevd_sys_monitoring/_pydevd_sys_monitoring_cython.c -o build/temp.macosx-14.0-arm64-cpython-314/_pydevd_sys_monitoring/_pydevd_sys_monitoring_cython.o203_pydevd_sys_monitoring/_pydevd_sys_monitoring_cython.c:17817:18: warning: unused function '__pyx_f_29_pydevd_sys_monitoring_cython__remove_return_values' [-Wunused-function]204 17817 | static PyObject *__pyx_f_29_pydevd_sys_monitoring_cython__remove_return_values(CYTHON_UNUSED PyObject *__pyx_v_py_db, PyObject *__pyx_v_frame) {205 | ^~~~~~~~~~~~~~~~~~~~~~~~~~~~~~~~~~~~~~~~~~~~~~~~~~~~~~~~~~~~~2061 warning generated.207creating build/lib.macosx-14.0-arm64-cpython-314/_pydevd_sys_monitoring208clang -bundle -undefined dynamic_lookup -L/nix/store/eeeeeeeeeeeeeeeeeeeeeeeeeeeeeeee-bzip2-1.0.8/lib -L/nix/store/eeeeeeeeeeeeeeeeeeeeeeeeeeeeeeee-libffi-40/lib -L/nix/store/eeeeeeeeeeeeeeeeeeeeeeeeeeeeeeee-ncurses-6.6/lib -L/nix/store/eeeeeeeeeeeeeeeeeeeeeeeeeeeeeeee-xz-5.8.4/lib -L/nix/store/eeeeeeeeeeeeeeeeeeeeeeeeeeeeeeee-zlib-1.3.2/lib -L/nix/store/eeeeeeeeeeeeeeeeeeeeeeeeeeeeeeee-openssl-3.5.8/lib -L/nix/store/eeeeeeeeeeeeeeeeeeeeeeeeeeeeeeee-sqlite-3.53.3/lib -L/nix/store/eeeeeeeeeeeeeeeeeeeeeeeeeeeeeeee-mpdecimal-4.0.1/lib -L/nix/store/eeeeeeeeeeeeeeeeeeeeeeeeeeeeeeee-expat-2.8.5/lib -L/nix/store/eeeeeeeeeeeeeeeeeeeeeeeeeeeeeeee-zstd-1.5.7/lib -L/nix/store/rhri8qncla0wkx4wpl10a48lxai3ng5b-tzdata-2026d/lib -L/nix/store/eeeeeeeeeeeeeeeeeeeeeeeeeeeeeeee-gdbm-1.26-lib/lib -L/nix/store/eeeeeeeeeeeeeeeeeeeeeeeeeeeeeeee-readline-8.3p3/lib -L/nix/store/eeeeeeeeeeeeeeeeeeeeeeeeeeeeeeee-bzip2-1.0.8/lib -L/nix/store/eeeeeeeeeeeeeeeeeeeeeeeeeeeeeeee-libffi-40/lib -L/nix/store/eeeeeeeeeeeeeeeeeeeeeeeeeeeeeeee-ncurses-6.6/lib -L/nix/store/eeeeeeeeeeeeeeeeeeeeeeeeeeeeeeee-xz-5.8.4/lib -L/nix/store/eeeeeeeeeeeeeeeeeeeeeeeeeeeeeeee-zlib-1.3.2/lib -L/nix/store/eeeeeeeeeeeeeeeeeeeeeeeeeeeeeeee-openssl-3.5.8/lib -L/nix/store/eeeeeeeeeeeeeeeeeeeeeeeeeeeeeeee-sqlite-3.53.3/lib -L/nix/store/eeeeeeeeeeeeeeeeeeeeeeeeeeeeeeee-mpdecimal-4.0.1/lib -L/nix/store/eeeeeeeeeeeeeeeeeeeeeeeeeeeeeeee-expat-2.8.5/lib -L/nix/store/eeeeeeeeeeeeeeeeeeeeeeeeeeeeeeee-zstd-1.5.7/lib -L/nix/store/rhri8qncla0wkx4wpl10a48lxai3ng5b-tzdata-2026d/lib -L/nix/store/eeeeeeeeeeeeeeeeeeeeeeeeeeeeeeee-gdbm-1.26-lib/lib -L/nix/store/eeeeeeeeeeeeeeeeeeeeeeeeeeeeeeee-readline-8.3p3/lib build/temp.macosx-14.0-arm64-cpython-314/_pydevd_sys_monitoring/_pydevd_sys_monitoring_cython.o -L/nix/store/0kcws5blwbdyxqxjd1w8hjipz61xny3k-python3-3.14.7/lib -o build/lib.macosx-14.0-arm64-cpython-314/_pydevd_sys_monitoring/_pydevd_sys_monitoring_cython.cpython-314-darwin.so209ld: warning: directory not found for option '-L/nix/store/eeeeeeeeeeeeeeeeeeeeeeeeeeeeeeee-bzip2-1.0.8/lib'210ld: warning: directory not found for option '-L/nix/store/eeeeeeeeeeeeeeeeeeeeeeeeeeeeeeee-libffi-40/lib'211ld: warning: directory not found for option '-L/nix/store/eeeeeeeeeeeeeeeeeeeeeeeeeeeeeeee-ncurses-6.6/lib'212ld: warning: directory not found for option '-L/nix/store/eeeeeeeeeeeeeeeeeeeeeeeeeeeeeeee-xz-5.8.4/lib'213ld: warning: directory not found for option '-L/nix/store/eeeeeeeeeeeeeeeeeeeeeeeeeeeeeeee-zlib-1.3.2/lib'214ld: warning: directory not found for option '-L/nix/store/eeeeeeeeeeeeeeeeeeeeeeeeeeeeeeee-openssl-3.5.8/lib'215ld: warning: directory not found for option '-L/nix/store/eeeeeeeeeeeeeeeeeeeeeeeeeeeeeeee-sqlite-3.53.3/lib'216ld: warning: directory not found for option '-L/nix/store/eeeeeeeeeeeeeeeeeeeeeeeeeeeeeeee-mpdecimal-4.0.1/lib'217ld: warning: directory not found for option '-L/nix/store/eeeeeeeeeeeeeeeeeeeeeeeeeeeeeeee-expat-2.8.5/lib'218ld: warning: directory not found for option '-L/nix/store/eeeeeeeeeeeeeeeeeeeeeeeeeeeeeeee-zstd-1.5.7/lib'219ld: warning: directory not found for option '-L/nix/store/rhri8qncla0wkx4wpl10a48lxai3ng5b-tzdata-2026d/lib'220ld: warning: directory not found for option '-L/nix/store/eeeeeeeeeeeeeeeeeeeeeeeeeeeeeeee-gdbm-1.26-lib/lib'221ld: warning: directory not found for option '-L/nix/store/eeeeeeeeeeeeeeeeeeeeeeeeeeeeeeee-readline-8.3p3/lib'222ld: warning: directory not found for option '-L/nix/store/eeeeeeeeeeeeeeeeeeeeeeeeeeeeeeee-bzip2-1.0.8/lib'223ld: warning: directory not found for option '-L/nix/store/eeeeeeeeeeeeeeeeeeeeeeeeeeeeeeee-libffi-40/lib'224ld: warning: directory not found for option '-L/nix/store/eeeeeeeeeeeeeeeeeeeeeeeeeeeeeeee-ncurses-6.6/lib'225ld: warning: directory not found for option '-L/nix/store/eeeeeeeeeeeeeeeeeeeeeeeeeeeeeeee-xz-5.8.4/lib'226ld: warning: directory not found for option '-L/nix/store/eeeeeeeeeeeeeeeeeeeeeeeeeeeeeeee-zlib-1.3.2/lib'227ld: warning: directory not found for option '-L/nix/store/eeeeeeeeeeeeeeeeeeeeeeeeeeeeeeee-openssl-3.5.8/lib'228ld: warning: directory not found for option '-L/nix/store/eeeeeeeeeeeeeeeeeeeeeeeeeeeeeeee-sqlite-3.53.3/lib'229ld: warning: directory not found for option '-L/nix/store/eeeeeeeeeeeeeeeeeeeeeeeeeeeeeeee-mpdecimal-4.0.1/lib'230ld: warning: directory not found for option '-L/nix/store/eeeeeeeeeeeeeeeeeeeeeeeeeeeeeeee-expat-2.8.5/lib'231ld: warning: directory not found for option '-L/nix/store/eeeeeeeeeeeeeeeeeeeeeeeeeeeeeeee-zstd-1.5.7/lib'232ld: warning: directory not found for option '-L/nix/store/rhri8qncla0wkx4wpl10a48lxai3ng5b-tzdata-2026d/lib'233ld: warning: directory not found for option '-L/nix/store/eeeeeeeeeeeeeeeeeeeeeeeeeeeeeeee-gdbm-1.26-lib/lib'234ld: warning: directory not found for option '-L/nix/store/eeeeeeeeeeeeeeeeeeeeeeeeeeeeeeee-readline-8.3p3/lib'235copying build/lib.macosx-14.0-arm64-cpython-314/_pydevd_sys_monitoring/_pydevd_sys_monitoring_cython.cpython-314-darwin.so -> _pydevd_sys_monitoring236reading manifest file 'src/debugpy.egg-info/SOURCES.txt'237reading manifest template 'MANIFEST.in'238warning: no previously-included files matching '*.py[cdo]' found anywhere in distribution239adding license file 'LICENSE'240writing manifest file 'src/debugpy.egg-info/SOURCES.txt'241* Building wheel...242/nix/store/cp6vhcyg8bna8rrmnamn75ii070diafk-python3.14-setuptools-83.0.0/lib/python3.14/site-packages/setuptools/dist.py:765: SetuptoolsDeprecationWarning: License classifiers are deprecated.243!!244245 ********************************************************************************246 Please consider removing the following classifiers in favor of a SPDX license expression:247248 License :: OSI Approved :: MIT License249250 See https://packaging.python.org/en/latest/guides/writing-pyproject-toml/#license for details.251 ********************************************************************************252253!!254 self._finalize_license_expression()255running bdist_wheel256running build257running build_py258running build_ext259copying build/lib.macosx-14.0-arm64-cpython-314/_pydevd_bundle/pydevd_cython.cpython-314-darwin.so -> _pydevd_bundle260running build_ext261copying build/lib.macosx-14.0-arm64-cpython-314/_pydevd_sys_monitoring/_pydevd_sys_monitoring_cython.cpython-314-darwin.so -> _pydevd_sys_monitoring262creating build/lib.macosx-14.0-arm64-cpython-314/debugpy263copying src/debugpy/public_api.py -> build/lib.macosx-14.0-arm64-cpython-314/debugpy264copying src/debugpy/_version.py -> build/lib.macosx-14.0-arm64-cpython-314/debugpy265copying src/debugpy/__init__.py -> build/lib.macosx-14.0-arm64-cpython-314/debugpy266copying src/debugpy/__main__.py -> build/lib.macosx-14.0-arm64-cpython-314/debugpy267creating build/lib.macosx-14.0-arm64-cpython-314/debugpy/adapter268copying src/debugpy/adapter/sessions.py -> build/lib.macosx-14.0-arm64-cpython-314/debugpy/adapter269copying src/debugpy/adapter/__init__.py -> build/lib.macosx-14.0-arm64-cpython-314/debugpy/adapter270copying src/debugpy/adapter/launchers.py -> build/lib.macosx-14.0-arm64-cpython-314/debugpy/adapter271copying src/debugpy/adapter/servers.py -> build/lib.macosx-14.0-arm64-cpython-314/debugpy/adapter272copying src/debugpy/adapter/clients.py -> build/lib.macosx-14.0-arm64-cpython-314/debugpy/adapter273copying src/debugpy/adapter/components.py -> build/lib.macosx-14.0-arm64-cpython-314/debugpy/adapter274copying src/debugpy/adapter/__main__.py -> build/lib.macosx-14.0-arm64-cpython-314/debugpy/adapter275creating build/lib.macosx-14.0-arm64-cpython-314/debugpy/common276copying src/debugpy/common/log.py -> build/lib.macosx-14.0-arm64-cpython-314/debugpy/common277copying src/debugpy/common/util.py -> build/lib.macosx-14.0-arm64-cpython-314/debugpy/common278copying src/debugpy/common/__init__.py -> build/lib.macosx-14.0-arm64-cpython-314/debugpy/common279copying src/debugpy/common/singleton.py -> build/lib.macosx-14.0-arm64-cpython-314/debugpy/common280copying src/debugpy/common/sockets.py -> build/lib.macosx-14.0-arm64-cpython-314/debugpy/common281copying src/debugpy/common/timestamp.py -> build/lib.macosx-14.0-arm64-cpython-314/debugpy/common282copying src/debugpy/common/json.py -> build/lib.macosx-14.0-arm64-cpython-314/debugpy/common283copying src/debugpy/common/stacks.py -> build/lib.macosx-14.0-arm64-cpython-314/debugpy/common284copying src/debugpy/common/messaging.py -> build/lib.macosx-14.0-arm64-cpython-314/debugpy/common285creating build/lib.macosx-14.0-arm64-cpython-314/debugpy/launcher286copying src/debugpy/launcher/handlers.py -> build/lib.macosx-14.0-arm64-cpython-314/debugpy/launcher287copying src/debugpy/launcher/__init__.py -> build/lib.macosx-14.0-arm64-cpython-314/debugpy/launcher288copying src/debugpy/launcher/winapi.py -> build/lib.macosx-14.0-arm64-cpython-314/debugpy/launcher289copying src/debugpy/launcher/__main__.py -> build/lib.macosx-14.0-arm64-cpython-314/debugpy/launcher290copying src/debugpy/launcher/debuggee.py -> build/lib.macosx-14.0-arm64-cpython-314/debugpy/launcher291copying src/debugpy/launcher/output.py -> build/lib.macosx-14.0-arm64-cpython-314/debugpy/launcher292creating build/lib.macosx-14.0-arm64-cpython-314/debugpy/server293copying src/debugpy/server/__init__.py -> build/lib.macosx-14.0-arm64-cpython-314/debugpy/server294copying src/debugpy/server/api.py -> build/lib.macosx-14.0-arm64-cpython-314/debugpy/server295copying src/debugpy/server/cli.py -> build/lib.macosx-14.0-arm64-cpython-314/debugpy/server296copying src/debugpy/server/attach_pid_injected.py -> build/lib.macosx-14.0-arm64-cpython-314/debugpy/server297creating build/lib.macosx-14.0-arm64-cpython-314/debugpy/_vendored298copying src/debugpy/_vendored/force_pydevd.py -> build/lib.macosx-14.0-arm64-cpython-314/debugpy/_vendored299copying src/debugpy/_vendored/__init__.py -> build/lib.macosx-14.0-arm64-cpython-314/debugpy/_vendored300copying src/debugpy/_vendored/_util.py -> build/lib.macosx-14.0-arm64-cpython-314/debugpy/_vendored301copying src/debugpy/_vendored/_pydevd_packaging.py -> build/lib.macosx-14.0-arm64-cpython-314/debugpy/_vendored302copying src/debugpy/py.typed -> build/lib.macosx-14.0-arm64-cpython-314/debugpy303copying src/debugpy/ThirdPartyNotices.txt -> build/lib.macosx-14.0-arm64-cpython-314/debugpy304creating build/lib.macosx-14.0-arm64-cpython-314/debugpy/_vendored/pydevd305copying src/debugpy/_vendored/pydevd/pydevd_file_utils.py -> build/lib.macosx-14.0-arm64-cpython-314/debugpy/_vendored/pydevd306copying src/debugpy/_vendored/pydevd/pydevd_tracing.py -> build/lib.macosx-14.0-arm64-cpython-314/debugpy/_vendored/pydevd307copying src/debugpy/_vendored/pydevd/pydev_app_engine_debug_startup.py -> build/lib.macosx-14.0-arm64-cpython-314/debugpy/_vendored/pydevd308copying src/debugpy/_vendored/pydevd/pydev_coverage.py -> build/lib.macosx-14.0-arm64-cpython-314/debugpy/_vendored/pydevd309copying src/debugpy/_vendored/pydevd/pydevconsole.py -> build/lib.macosx-14.0-arm64-cpython-314/debugpy/_vendored/pydevd310copying src/debugpy/_vendored/pydevd/pydev_run_in_console.py -> build/lib.macosx-14.0-arm64-cpython-314/debugpy/_vendored/pydevd311copying src/debugpy/_vendored/pydevd/pydevd.py -> build/lib.macosx-14.0-arm64-cpython-314/debugpy/_vendored/pydevd312copying src/debugpy/_vendored/pydevd/setup_pydevd_cython.py -> build/lib.macosx-14.0-arm64-cpython-314/debugpy/_vendored/pydevd313copying src/debugpy/_vendored/pydevd/pydev_pysrc.py -> build/lib.macosx-14.0-arm64-cpython-314/debugpy/_vendored/pydevd314creating build/lib.macosx-14.0-arm64-cpython-314/debugpy/_vendored/pydevd/_pydev_runfiles315copying src/debugpy/_vendored/pydevd/_pydev_runfiles/pydev_runfiles.py -> build/lib.macosx-14.0-arm64-cpython-314/debugpy/_vendored/pydevd/_pydev_runfiles316copying src/debugpy/_vendored/pydevd/_pydev_runfiles/pydev_runfiles_unittest.py -> build/lib.macosx-14.0-arm64-cpython-314/debugpy/_vendored/pydevd/_pydev_runfiles317copying src/debugpy/_vendored/pydevd/_pydev_runfiles/pydev_runfiles_coverage.py -> build/lib.macosx-14.0-arm64-cpython-314/debugpy/_vendored/pydevd/_pydev_runfiles318copying src/debugpy/_vendored/pydevd/_pydev_runfiles/__init__.py -> build/lib.macosx-14.0-arm64-cpython-314/debugpy/_vendored/pydevd/_pydev_runfiles319copying src/debugpy/_vendored/pydevd/_pydev_runfiles/pydev_runfiles_nose.py -> build/lib.macosx-14.0-arm64-cpython-314/debugpy/_vendored/pydevd/_pydev_runfiles320copying src/debugpy/_vendored/pydevd/_pydev_runfiles/pydev_runfiles_pytest2.py -> build/lib.macosx-14.0-arm64-cpython-314/debugpy/_vendored/pydevd/_pydev_runfiles321copying src/debugpy/_vendored/pydevd/_pydev_runfiles/pydev_runfiles_parallel_client.py -> build/lib.macosx-14.0-arm64-cpython-314/debugpy/_vendored/pydevd/_pydev_runfiles322copying src/debugpy/_vendored/pydevd/_pydev_runfiles/pydev_runfiles_xml_rpc.py -> build/lib.macosx-14.0-arm64-cpython-314/debugpy/_vendored/pydevd/_pydev_runfiles323copying src/debugpy/_vendored/pydevd/_pydev_runfiles/pydev_runfiles_parallel.py -> build/lib.macosx-14.0-arm64-cpython-314/debugpy/_vendored/pydevd/_pydev_runfiles324creating build/lib.macosx-14.0-arm64-cpython-314/debugpy/_vendored/pydevd/_pydevd_sys_monitoring325copying src/debugpy/_vendored/pydevd/_pydevd_sys_monitoring/_pydevd_sys_monitoring.py -> build/lib.macosx-14.0-arm64-cpython-314/debugpy/_vendored/pydevd/_pydevd_sys_monitoring326copying src/debugpy/_vendored/pydevd/_pydevd_sys_monitoring/_pydevd_sys_monitoring_cython.pxd -> build/lib.macosx-14.0-arm64-cpython-314/debugpy/_vendored/pydevd/_pydevd_sys_monitoring327copying src/debugpy/_vendored/pydevd/_pydevd_sys_monitoring/_pydevd_sys_monitoring_cython.c -> build/lib.macosx-14.0-arm64-cpython-314/debugpy/_vendored/pydevd/_pydevd_sys_monitoring328copying src/debugpy/_vendored/pydevd/_pydevd_sys_monitoring/_pydevd_sys_monitoring_cython.cpython-314-darwin.so -> build/lib.macosx-14.0-arm64-cpython-314/debugpy/_vendored/pydevd/_pydevd_sys_monitoring329copying src/debugpy/_vendored/pydevd/_pydevd_sys_monitoring/pydevd_sys_monitoring.py -> build/lib.macosx-14.0-arm64-cpython-314/debugpy/_vendored/pydevd/_pydevd_sys_monitoring330copying src/debugpy/_vendored/pydevd/_pydevd_sys_monitoring/_pydevd_sys_monitoring_cython.pyx -> build/lib.macosx-14.0-arm64-cpython-314/debugpy/_vendored/pydevd/_pydevd_sys_monitoring331creating build/lib.macosx-14.0-arm64-cpython-314/debugpy/_vendored/pydevd/_pydevd_bundle332copying src/debugpy/_vendored/pydevd/_pydevd_bundle/pydevd_vars.py -> build/lib.macosx-14.0-arm64-cpython-314/debugpy/_vendored/pydevd/_pydevd_bundle333copying src/debugpy/_vendored/pydevd/_pydevd_bundle/pydevd_command_line_handling.py -> build/lib.macosx-14.0-arm64-cpython-314/debugpy/_vendored/pydevd/_pydevd_bundle334copying src/debugpy/_vendored/pydevd/_pydevd_bundle/pydevd_frame_utils.py -> build/lib.macosx-14.0-arm64-cpython-314/debugpy/_vendored/pydevd/_pydevd_bundle335copying src/debugpy/_vendored/pydevd/_pydevd_bundle/pydevd_breakpoints.py -> build/lib.macosx-14.0-arm64-cpython-314/debugpy/_vendored/pydevd/_pydevd_bundle336copying src/debugpy/_vendored/pydevd/_pydevd_bundle/pydevd_plugin_utils.py -> build/lib.macosx-14.0-arm64-cpython-314/debugpy/_vendored/pydevd/_pydevd_bundle337copying src/debugpy/_vendored/pydevd/_pydevd_bundle/pydevd_cython.pyx -> build/lib.macosx-14.0-arm64-cpython-314/debugpy/_vendored/pydevd/_pydevd_bundle338copying src/debugpy/_vendored/pydevd/_pydevd_bundle/pydevd_process_net_command_json.py -> build/lib.macosx-14.0-arm64-cpython-314/debugpy/_vendored/pydevd/_pydevd_bundle339copying src/debugpy/_vendored/pydevd/_pydevd_bundle/pydevd_timeout.py -> build/lib.macosx-14.0-arm64-cpython-314/debugpy/_vendored/pydevd/_pydevd_bundle340copying src/debugpy/_vendored/pydevd/_pydevd_bundle/pydevd_reload.py -> build/lib.macosx-14.0-arm64-cpython-314/debugpy/_vendored/pydevd/_pydevd_bundle341copying src/debugpy/_vendored/pydevd/_pydevd_bundle/pydevd_io.py -> build/lib.macosx-14.0-arm64-cpython-314/debugpy/_vendored/pydevd/_pydevd_bundle342copying src/debugpy/_vendored/pydevd/_pydevd_bundle/pydevd_daemon_thread.py -> build/lib.macosx-14.0-arm64-cpython-314/debugpy/_vendored/pydevd/_pydevd_bundle343copying src/debugpy/_vendored/pydevd/_pydevd_bundle/pydevd_net_command_factory_json.py -> build/lib.macosx-14.0-arm64-cpython-314/debugpy/_vendored/pydevd/_pydevd_bundle344copying src/debugpy/_vendored/pydevd/_pydevd_bundle/pydevd_comm.py -> build/lib.macosx-14.0-arm64-cpython-314/debugpy/_vendored/pydevd/_pydevd_bundle345copying src/debugpy/_vendored/pydevd/_pydevd_bundle/pydevd_net_command_factory_xml.py -> build/lib.macosx-14.0-arm64-cpython-314/debugpy/_vendored/pydevd/_pydevd_bundle346copying src/debugpy/_vendored/pydevd/_pydevd_bundle/pydevd_xml.py -> build/lib.macosx-14.0-arm64-cpython-314/debugpy/_vendored/pydevd/_pydevd_bundle347copying src/debugpy/_vendored/pydevd/_pydevd_bundle/pydevd_constants.py -> build/lib.macosx-14.0-arm64-cpython-314/debugpy/_vendored/pydevd/_pydevd_bundle348copying src/debugpy/_vendored/pydevd/_pydevd_bundle/pydevd_trace_dispatch.py -> build/lib.macosx-14.0-arm64-cpython-314/debugpy/_vendored/pydevd/_pydevd_bundle349copying src/debugpy/_vendored/pydevd/_pydevd_bundle/pydevd_extension_utils.py -> build/lib.macosx-14.0-arm64-cpython-314/debugpy/_vendored/pydevd/_pydevd_bundle350copying src/debugpy/_vendored/pydevd/_pydevd_bundle/pydevd_dont_trace_files.py -> build/lib.macosx-14.0-arm64-cpython-314/debugpy/_vendored/pydevd/_pydevd_bundle351copying src/debugpy/_vendored/pydevd/_pydevd_bundle/pydevd_custom_frames.py -> build/lib.macosx-14.0-arm64-cpython-314/debugpy/_vendored/pydevd/_pydevd_bundle352copying src/debugpy/_vendored/pydevd/_pydevd_bundle/pydevd_console.py -> build/lib.macosx-14.0-arm64-cpython-314/debugpy/_vendored/pydevd/_pydevd_bundle353copying src/debugpy/_vendored/pydevd/_pydevd_bundle/pydevd_filtering.py -> build/lib.macosx-14.0-arm64-cpython-314/debugpy/_vendored/pydevd/_pydevd_bundle354copying src/debugpy/_vendored/pydevd/_pydevd_bundle/pydevconsole_code.py -> build/lib.macosx-14.0-arm64-cpython-314/debugpy/_vendored/pydevd/_pydevd_bundle355copying src/debugpy/_vendored/pydevd/_pydevd_bundle/pydevd_referrers.py -> build/lib.macosx-14.0-arm64-cpython-314/debugpy/_vendored/pydevd/_pydevd_bundle356copying src/debugpy/_vendored/pydevd/_pydevd_bundle/pydevd_extension_api.py -> build/lib.macosx-14.0-arm64-cpython-314/debugpy/_vendored/pydevd/_pydevd_bundle357copying src/debugpy/_vendored/pydevd/_pydevd_bundle/__init__.py -> build/lib.macosx-14.0-arm64-cpython-314/debugpy/_vendored/pydevd/_pydevd_bundle358copying src/debugpy/_vendored/pydevd/_pydevd_bundle/pydevd_stackless.py -> build/lib.macosx-14.0-arm64-cpython-314/debugpy/_vendored/pydevd/_pydevd_bundle359copying src/debugpy/_vendored/pydevd/_pydevd_bundle/pydevd_collect_bytecode_info.py -> build/lib.macosx-14.0-arm64-cpython-314/debugpy/_vendored/pydevd/_pydevd_bundle360copying src/debugpy/_vendored/pydevd/_pydevd_bundle/pydevd_bytecode_utils.py -> build/lib.macosx-14.0-arm64-cpython-314/debugpy/_vendored/pydevd/_pydevd_bundle361copying src/debugpy/_vendored/pydevd/_pydevd_bundle/pydevd_trace_dispatch_regular.py -> build/lib.macosx-14.0-arm64-cpython-314/debugpy/_vendored/pydevd/_pydevd_bundle362copying src/debugpy/_vendored/pydevd/_pydevd_bundle/pydevd_save_locals.py -> build/lib.macosx-14.0-arm64-cpython-314/debugpy/_vendored/pydevd/_pydevd_bundle363copying src/debugpy/_vendored/pydevd/_pydevd_bundle/pydevd_additional_thread_info_regular.py -> build/lib.macosx-14.0-arm64-cpython-314/debugpy/_vendored/pydevd/_pydevd_bundle364copying src/debugpy/_vendored/pydevd/_pydevd_bundle/pydevd_suspended_frames.py -> build/lib.macosx-14.0-arm64-cpython-314/debugpy/_vendored/pydevd/_pydevd_bundle365copying src/debugpy/_vendored/pydevd/_pydevd_bundle/pydevd_thread_lifecycle.py -> build/lib.macosx-14.0-arm64-cpython-314/debugpy/_vendored/pydevd/_pydevd_bundle366copying src/debugpy/_vendored/pydevd/_pydevd_bundle/pydevd_json_debug_options.py -> build/lib.macosx-14.0-arm64-cpython-314/debugpy/_vendored/pydevd/_pydevd_bundle367copying src/debugpy/_vendored/pydevd/_pydevd_bundle/pydevd_safe_repr.py -> build/lib.macosx-14.0-arm64-cpython-314/debugpy/_vendored/pydevd/_pydevd_bundle368copying src/debugpy/_vendored/pydevd/_pydevd_bundle/pydevd_traceproperty.py -> build/lib.macosx-14.0-arm64-cpython-314/debugpy/_vendored/pydevd/_pydevd_bundle369copying src/debugpy/_vendored/pydevd/_pydevd_bundle/pydevd_import_class.py -> build/lib.macosx-14.0-arm64-cpython-314/debugpy/_vendored/pydevd/_pydevd_bundle370copying src/debugpy/_vendored/pydevd/_pydevd_bundle/pydevd_runpy.py -> build/lib.macosx-14.0-arm64-cpython-314/debugpy/_vendored/pydevd/_pydevd_bundle371copying src/debugpy/_vendored/pydevd/_pydevd_bundle/pydevd_bytecode_utils_py311.py -> build/lib.macosx-14.0-arm64-cpython-314/debugpy/_vendored/pydevd/_pydevd_bundle372copying src/debugpy/_vendored/pydevd/_pydevd_bundle/pydevd_cython_wrapper.py -> build/lib.macosx-14.0-arm64-cpython-314/debugpy/_vendored/pydevd/_pydevd_bundle373copying src/debugpy/_vendored/pydevd/_pydevd_bundle/pydevd_additional_thread_info.py -> build/lib.macosx-14.0-arm64-cpython-314/debugpy/_vendored/pydevd/_pydevd_bundle374copying src/debugpy/_vendored/pydevd/_pydevd_bundle/pydevd_api.py -> build/lib.macosx-14.0-arm64-cpython-314/debugpy/_vendored/pydevd/_pydevd_bundle375copying src/debugpy/_vendored/pydevd/_pydevd_bundle/pydevd_dont_trace.py -> build/lib.macosx-14.0-arm64-cpython-314/debugpy/_vendored/pydevd/_pydevd_bundle376copying src/debugpy/_vendored/pydevd/_pydevd_bundle/pydevd_utils.py -> build/lib.macosx-14.0-arm64-cpython-314/debugpy/_vendored/pydevd/_pydevd_bundle377copying src/debugpy/_vendored/pydevd/_pydevd_bundle/pydevd_net_command.py -> build/lib.macosx-14.0-arm64-cpython-314/debugpy/_vendored/pydevd/_pydevd_bundle378copying src/debugpy/_vendored/pydevd/_pydevd_bundle/pydevd_signature.py -> build/lib.macosx-14.0-arm64-cpython-314/debugpy/_vendored/pydevd/_pydevd_bundle379copying src/debugpy/_vendored/pydevd/_pydevd_bundle/pydevd_vm_type.py -> build/lib.macosx-14.0-arm64-cpython-314/debugpy/_vendored/pydevd/_pydevd_bundle380copying src/debugpy/_vendored/pydevd/_pydevd_bundle/pydevd_cython.c -> build/lib.macosx-14.0-arm64-cpython-314/debugpy/_vendored/pydevd/_pydevd_bundle381copying src/debugpy/_vendored/pydevd/_pydevd_bundle/pydevd_cython.cpython-314-darwin.so -> build/lib.macosx-14.0-arm64-cpython-314/debugpy/_vendored/pydevd/_pydevd_bundle382copying src/debugpy/_vendored/pydevd/_pydevd_bundle/pydevd_gevent_integration.py -> build/lib.macosx-14.0-arm64-cpython-314/debugpy/_vendored/pydevd/_pydevd_bundle383copying src/debugpy/_vendored/pydevd/_pydevd_bundle/pydevd_comm_constants.py -> build/lib.macosx-14.0-arm64-cpython-314/debugpy/_vendored/pydevd/_pydevd_bundle384copying src/debugpy/_vendored/pydevd/_pydevd_bundle/pydevd_defaults.py -> build/lib.macosx-14.0-arm64-cpython-314/debugpy/_vendored/pydevd/_pydevd_bundle385copying src/debugpy/_vendored/pydevd/_pydevd_bundle/pydevd_process_net_command.py -> build/lib.macosx-14.0-arm64-cpython-314/debugpy/_vendored/pydevd/_pydevd_bundle386copying src/debugpy/_vendored/pydevd/_pydevd_bundle/pydevd_cython.pxd -> build/lib.macosx-14.0-arm64-cpython-314/debugpy/_vendored/pydevd/_pydevd_bundle387copying src/debugpy/_vendored/pydevd/_pydevd_bundle/pydevd_source_mapping.py -> build/lib.macosx-14.0-arm64-cpython-314/debugpy/_vendored/pydevd/_pydevd_bundle388copying src/debugpy/_vendored/pydevd/_pydevd_bundle/pydevd_resolver.py -> build/lib.macosx-14.0-arm64-cpython-314/debugpy/_vendored/pydevd/_pydevd_bundle389copying src/debugpy/_vendored/pydevd/_pydevd_bundle/pydevd_frame.py -> build/lib.macosx-14.0-arm64-cpython-314/debugpy/_vendored/pydevd/_pydevd_bundle390copying src/debugpy/_vendored/pydevd/_pydevd_bundle/pydevd_exec2.py -> build/lib.macosx-14.0-arm64-cpython-314/debugpy/_vendored/pydevd/_pydevd_bundle391copying src/debugpy/_vendored/pydevd/_pydevd_bundle/pydevd_code_to_source.py -> build/lib.macosx-14.0-arm64-cpython-314/debugpy/_vendored/pydevd/_pydevd_bundle392creating build/lib.macosx-14.0-arm64-cpython-314/debugpy/_vendored/pydevd/_pydev_bundle393copying src/debugpy/_vendored/pydevd/_pydev_bundle/_pydev_calltip_util.py -> build/lib.macosx-14.0-arm64-cpython-314/debugpy/_vendored/pydevd/_pydev_bundle394copying src/debugpy/_vendored/pydevd/_pydev_bundle/_pydev_saved_modules.py -> build/lib.macosx-14.0-arm64-cpython-314/debugpy/_vendored/pydevd/_pydev_bundle395copying src/debugpy/_vendored/pydevd/_pydev_bundle/_pydev_filesystem_encoding.py -> build/lib.macosx-14.0-arm64-cpython-314/debugpy/_vendored/pydevd/_pydev_bundle396copying src/debugpy/_vendored/pydevd/_pydev_bundle/pydev_monkey.py -> build/lib.macosx-14.0-arm64-cpython-314/debugpy/_vendored/pydevd/_pydev_bundle397copying src/debugpy/_vendored/pydevd/_pydev_bundle/_pydev_tipper_common.py -> build/lib.macosx-14.0-arm64-cpython-314/debugpy/_vendored/pydevd/_pydev_bundle398copying src/debugpy/_vendored/pydevd/_pydev_bundle/_pydev_imports_tipper.py -> build/lib.macosx-14.0-arm64-cpython-314/debugpy/_vendored/pydevd/_pydev_bundle399copying src/debugpy/_vendored/pydevd/_pydev_bundle/pydev_log.py -> build/lib.macosx-14.0-arm64-cpython-314/debugpy/_vendored/pydevd/_pydev_bundle400copying src/debugpy/_vendored/pydevd/_pydev_bundle/pydev_monkey_qt.py -> build/lib.macosx-14.0-arm64-cpython-314/debugpy/_vendored/pydevd/_pydev_bundle401copying src/debugpy/_vendored/pydevd/_pydev_bundle/_pydev_completer.py -> build/lib.macosx-14.0-arm64-cpython-314/debugpy/_vendored/pydevd/_pydev_bundle402copying src/debugpy/_vendored/pydevd/_pydev_bundle/pydev_is_thread_alive.py -> build/lib.macosx-14.0-arm64-cpython-314/debugpy/_vendored/pydevd/_pydev_bundle403copying src/debugpy/_vendored/pydevd/_pydev_bundle/pydev_versioncheck.py -> build/lib.macosx-14.0-arm64-cpython-314/debugpy/_vendored/pydevd/_pydev_bundle404copying src/debugpy/_vendored/pydevd/_pydev_bundle/_pydev_jy_imports_tipper.py -> build/lib.macosx-14.0-arm64-cpython-314/debugpy/_vendored/pydevd/_pydev_bundle405copying src/debugpy/_vendored/pydevd/_pydev_bundle/pydev_ipython_console.py -> build/lib.macosx-14.0-arm64-cpython-314/debugpy/_vendored/pydevd/_pydev_bundle406copying src/debugpy/_vendored/pydevd/_pydev_bundle/_pydev_log.py -> build/lib.macosx-14.0-arm64-cpython-314/debugpy/_vendored/pydevd/_pydev_bundle407copying src/debugpy/_vendored/pydevd/_pydev_bundle/__init__.py -> build/lib.macosx-14.0-arm64-cpython-314/debugpy/_vendored/pydevd/_pydev_bundle408copying src/debugpy/_vendored/pydevd/_pydev_bundle/pydev_imports.py -> build/lib.macosx-14.0-arm64-cpython-314/debugpy/_vendored/pydevd/_pydev_bundle409copying src/debugpy/_vendored/pydevd/_pydev_bundle/pydev_console_utils.py -> build/lib.macosx-14.0-arm64-cpython-314/debugpy/_vendored/pydevd/_pydev_bundle410copying src/debugpy/_vendored/pydevd/_pydev_bundle/pydev_ipython_console_011.py -> build/lib.macosx-14.0-arm64-cpython-314/debugpy/_vendored/pydevd/_pydev_bundle411copying src/debugpy/_vendored/pydevd/_pydev_bundle/pydev_import_hook.py -> build/lib.macosx-14.0-arm64-cpython-314/debugpy/_vendored/pydevd/_pydev_bundle412copying src/debugpy/_vendored/pydevd/_pydev_bundle/pydev_override.py -> build/lib.macosx-14.0-arm64-cpython-314/debugpy/_vendored/pydevd/_pydev_bundle413copying src/debugpy/_vendored/pydevd/_pydev_bundle/_pydev_execfile.py -> build/lib.macosx-14.0-arm64-cpython-314/debugpy/_vendored/pydevd/_pydev_bundle414copying src/debugpy/_vendored/pydevd/_pydev_bundle/pydev_umd.py -> build/lib.macosx-14.0-arm64-cpython-314/debugpy/_vendored/pydevd/_pydev_bundle415copying src/debugpy/_vendored/pydevd/_pydev_bundle/pydev_localhost.py -> build/lib.macosx-14.0-arm64-cpython-314/debugpy/_vendored/pydevd/_pydev_bundle416copying src/debugpy/_vendored/pydevd/_pydev_bundle/_pydev_sys_patch.py -> build/lib.macosx-14.0-arm64-cpython-314/debugpy/_vendored/pydevd/_pydev_bundle417copying src/debugpy/_vendored/pydevd/_pydev_bundle/_pydev_getopt.py -> build/lib.macosx-14.0-arm64-cpython-314/debugpy/_vendored/pydevd/_pydev_bundle418creating build/lib.macosx-14.0-arm64-cpython-314/debugpy/_vendored/pydevd/pydevd_plugins419copying src/debugpy/_vendored/pydevd/pydevd_plugins/django_debug.py -> build/lib.macosx-14.0-arm64-cpython-314/debugpy/_vendored/pydevd/pydevd_plugins420copying src/debugpy/_vendored/pydevd/pydevd_plugins/__init__.py -> build/lib.macosx-14.0-arm64-cpython-314/debugpy/_vendored/pydevd/pydevd_plugins421copying src/debugpy/_vendored/pydevd/pydevd_plugins/pydevd_line_validation.py -> build/lib.macosx-14.0-arm64-cpython-314/debugpy/_vendored/pydevd/pydevd_plugins422copying src/debugpy/_vendored/pydevd/pydevd_plugins/jinja2_debug.py -> build/lib.macosx-14.0-arm64-cpython-314/debugpy/_vendored/pydevd/pydevd_plugins423creating build/lib.macosx-14.0-arm64-cpython-314/debugpy/_vendored/pydevd/pydev_ipython424copying src/debugpy/_vendored/pydevd/pydev_ipython/inputhookpyglet.py -> build/lib.macosx-14.0-arm64-cpython-314/debugpy/_vendored/pydevd/pydev_ipython425copying src/debugpy/_vendored/pydevd/pydev_ipython/inputhookgtk.py -> build/lib.macosx-14.0-arm64-cpython-314/debugpy/_vendored/pydevd/pydev_ipython426copying src/debugpy/_vendored/pydevd/pydev_ipython/inputhooktk.py -> build/lib.macosx-14.0-arm64-cpython-314/debugpy/_vendored/pydevd/pydev_ipython427copying src/debugpy/_vendored/pydevd/pydev_ipython/inputhookglut.py -> build/lib.macosx-14.0-arm64-cpython-314/debugpy/_vendored/pydevd/pydev_ipython428copying src/debugpy/_vendored/pydevd/pydev_ipython/version.py -> build/lib.macosx-14.0-arm64-cpython-314/debugpy/_vendored/pydevd/pydev_ipython429copying src/debugpy/_vendored/pydevd/pydev_ipython/matplotlibtools.py -> build/lib.macosx-14.0-arm64-cpython-314/debugpy/_vendored/pydevd/pydev_ipython430copying src/debugpy/_vendored/pydevd/pydev_ipython/inputhookwx.py -> build/lib.macosx-14.0-arm64-cpython-314/debugpy/_vendored/pydevd/pydev_ipython431copying src/debugpy/_vendored/pydevd/pydev_ipython/inputhookqt5.py -> build/lib.macosx-14.0-arm64-cpython-314/debugpy/_vendored/pydevd/pydev_ipython432copying src/debugpy/_vendored/pydevd/pydev_ipython/inputhookgtk3.py -> build/lib.macosx-14.0-arm64-cpython-314/debugpy/_vendored/pydevd/pydev_ipython433copying src/debugpy/_vendored/pydevd/pydev_ipython/qt.py -> build/lib.macosx-14.0-arm64-cpython-314/debugpy/_vendored/pydevd/pydev_ipython434copying src/debugpy/_vendored/pydevd/pydev_ipython/__init__.py -> build/lib.macosx-14.0-arm64-cpython-314/debugpy/_vendored/pydevd/pydev_ipython435copying src/debugpy/_vendored/pydevd/pydev_ipython/inputhookqt4.py -> build/lib.macosx-14.0-arm64-cpython-314/debugpy/_vendored/pydevd/pydev_ipython436copying src/debugpy/_vendored/pydevd/pydev_ipython/README -> build/lib.macosx-14.0-arm64-cpython-314/debugpy/_vendored/pydevd/pydev_ipython437copying src/debugpy/_vendored/pydevd/pydev_ipython/inputhookqt6.py -> build/lib.macosx-14.0-arm64-cpython-314/debugpy/_vendored/pydevd/pydev_ipython438copying src/debugpy/_vendored/pydevd/pydev_ipython/inputhook.py -> build/lib.macosx-14.0-arm64-cpython-314/debugpy/_vendored/pydevd/pydev_ipython439copying src/debugpy/_vendored/pydevd/pydev_ipython/qt_loaders.py -> build/lib.macosx-14.0-arm64-cpython-314/debugpy/_vendored/pydevd/pydev_ipython440copying src/debugpy/_vendored/pydevd/pydev_ipython/qt_for_kernel.py -> build/lib.macosx-14.0-arm64-cpython-314/debugpy/_vendored/pydevd/pydev_ipython441creating build/lib.macosx-14.0-arm64-cpython-314/debugpy/_vendored/pydevd/pydevd_attach_to_process442copying src/debugpy/_vendored/pydevd/pydevd_attach_to_process/_test_attach_to_process.py -> build/lib.macosx-14.0-arm64-cpython-314/debugpy/_vendored/pydevd/pydevd_attach_to_process443copying src/debugpy/_vendored/pydevd/pydevd_attach_to_process/_check.py -> build/lib.macosx-14.0-arm64-cpython-314/debugpy/_vendored/pydevd/pydevd_attach_to_process444copying src/debugpy/_vendored/pydevd/pydevd_attach_to_process/add_code_to_python_process.py -> build/lib.macosx-14.0-arm64-cpython-314/debugpy/_vendored/pydevd/pydevd_attach_to_process445copying src/debugpy/_vendored/pydevd/pydevd_attach_to_process/attach_script.py -> build/lib.macosx-14.0-arm64-cpython-314/debugpy/_vendored/pydevd/pydevd_attach_to_process446copying src/debugpy/_vendored/pydevd/pydevd_attach_to_process/README.txt -> build/lib.macosx-14.0-arm64-cpython-314/debugpy/_vendored/pydevd/pydevd_attach_to_process447copying src/debugpy/_vendored/pydevd/pydevd_attach_to_process/attach_pydevd.py -> build/lib.macosx-14.0-arm64-cpython-314/debugpy/_vendored/pydevd/pydevd_attach_to_process448copying src/debugpy/_vendored/pydevd/pydevd_attach_to_process/attach.dylib -> build/lib.macosx-14.0-arm64-cpython-314/debugpy/_vendored/pydevd/pydevd_attach_to_process449copying src/debugpy/_vendored/pydevd/pydevd_attach_to_process/_test_attach_to_process_linux.py -> build/lib.macosx-14.0-arm64-cpython-314/debugpy/_vendored/pydevd/pydevd_attach_to_process450copying src/debugpy/_vendored/pydevd/pydevd_attach_to_process/add_code_to_python_process.py.orig -> build/lib.macosx-14.0-arm64-cpython-314/debugpy/_vendored/pydevd/pydevd_attach_to_process451copying src/debugpy/_vendored/pydevd/pydevd_attach_to_process/_always_live_program.py -> build/lib.macosx-14.0-arm64-cpython-314/debugpy/_vendored/pydevd/pydevd_attach_to_process452creating build/lib.macosx-14.0-arm64-cpython-314/debugpy/_vendored/pydevd/_pydevd_frame_eval453copying src/debugpy/_vendored/pydevd/_pydevd_frame_eval/pydevd_frame_eval_cython_wrapper.py -> build/lib.macosx-14.0-arm64-cpython-314/debugpy/_vendored/pydevd/_pydevd_frame_eval454copying src/debugpy/_vendored/pydevd/_pydevd_frame_eval/pydevd_frame_evaluator.c -> build/lib.macosx-14.0-arm64-cpython-314/debugpy/_vendored/pydevd/_pydevd_frame_eval455copying src/debugpy/_vendored/pydevd/_pydevd_frame_eval/pydevd_frame_eval_main.py -> build/lib.macosx-14.0-arm64-cpython-314/debugpy/_vendored/pydevd/_pydevd_frame_eval456copying src/debugpy/_vendored/pydevd/_pydevd_frame_eval/pydevd_frame_evaluator.template.pyx -> build/lib.macosx-14.0-arm64-cpython-314/debugpy/_vendored/pydevd/_pydevd_frame_eval457copying src/debugpy/_vendored/pydevd/_pydevd_frame_eval/__init__.py -> build/lib.macosx-14.0-arm64-cpython-314/debugpy/_vendored/pydevd/_pydevd_frame_eval458copying src/debugpy/_vendored/pydevd/_pydevd_frame_eval/release_mem.h -> build/lib.macosx-14.0-arm64-cpython-314/debugpy/_vendored/pydevd/_pydevd_frame_eval459copying src/debugpy/_vendored/pydevd/_pydevd_frame_eval/pydevd_modify_bytecode.py -> build/lib.macosx-14.0-arm64-cpython-314/debugpy/_vendored/pydevd/_pydevd_frame_eval460copying src/debugpy/_vendored/pydevd/_pydevd_frame_eval/pydevd_frame_tracing.py -> build/lib.macosx-14.0-arm64-cpython-314/debugpy/_vendored/pydevd/_pydevd_frame_eval461copying src/debugpy/_vendored/pydevd/_pydevd_frame_eval/.gitignore -> build/lib.macosx-14.0-arm64-cpython-314/debugpy/_vendored/pydevd/_pydevd_frame_eval462copying src/debugpy/_vendored/pydevd/_pydevd_frame_eval/pydevd_frame_evaluator.pxd -> build/lib.macosx-14.0-arm64-cpython-314/debugpy/_vendored/pydevd/_pydevd_frame_eval463creating build/lib.macosx-14.0-arm64-cpython-314/debugpy/_vendored/pydevd/pydev_sitecustomize464copying src/debugpy/_vendored/pydevd/pydev_sitecustomize/__not_in_default_pythonpath.txt -> build/lib.macosx-14.0-arm64-cpython-314/debugpy/_vendored/pydevd/pydev_sitecustomize465copying src/debugpy/_vendored/pydevd/pydev_sitecustomize/sitecustomize.py -> build/lib.macosx-14.0-arm64-cpython-314/debugpy/_vendored/pydevd/pydev_sitecustomize466creating build/lib.macosx-14.0-arm64-cpython-314/debugpy/_vendored/pydevd/_pydevd_bundle/_debug_adapter467copying src/debugpy/_vendored/pydevd/_pydevd_bundle/_debug_adapter/pydevd_base_schema.py -> build/lib.macosx-14.0-arm64-cpython-314/debugpy/_vendored/pydevd/_pydevd_bundle/_debug_adapter468copying src/debugpy/_vendored/pydevd/_pydevd_bundle/_debug_adapter/pydevd_schema_log.py -> build/lib.macosx-14.0-arm64-cpython-314/debugpy/_vendored/pydevd/_pydevd_bundle/_debug_adapter469copying src/debugpy/_vendored/pydevd/_pydevd_bundle/_debug_adapter/__main__pydevd_gen_debug_adapter_protocol.py -> build/lib.macosx-14.0-arm64-cpython-314/debugpy/_vendored/pydevd/_pydevd_bundle/_debug_adapter470copying src/debugpy/_vendored/pydevd/_pydevd_bundle/_debug_adapter/__init__.py -> build/lib.macosx-14.0-arm64-cpython-314/debugpy/_vendored/pydevd/_pydevd_bundle/_debug_adapter471copying src/debugpy/_vendored/pydevd/_pydevd_bundle/_debug_adapter/debugProtocol.json -> build/lib.macosx-14.0-arm64-cpython-314/debugpy/_vendored/pydevd/_pydevd_bundle/_debug_adapter472copying src/debugpy/_vendored/pydevd/_pydevd_bundle/_debug_adapter/debugProtocolCustom.json -> build/lib.macosx-14.0-arm64-cpython-314/debugpy/_vendored/pydevd/_pydevd_bundle/_debug_adapter473copying src/debugpy/_vendored/pydevd/_pydevd_bundle/_debug_adapter/pydevd_schema.py -> build/lib.macosx-14.0-arm64-cpython-314/debugpy/_vendored/pydevd/_pydevd_bundle/_debug_adapter474creating build/lib.macosx-14.0-arm64-cpython-314/debugpy/_vendored/pydevd/_pydevd_bundle/pydevd_concurrency_analyser475copying src/debugpy/_vendored/pydevd/_pydevd_bundle/pydevd_concurrency_analyser/__init__.py -> build/lib.macosx-14.0-arm64-cpython-314/debugpy/_vendored/pydevd/_pydevd_bundle/pydevd_concurrency_analyser476copying src/debugpy/_vendored/pydevd/_pydevd_bundle/pydevd_concurrency_analyser/pydevd_thread_wrappers.py -> build/lib.macosx-14.0-arm64-cpython-314/debugpy/_vendored/pydevd/_pydevd_bundle/pydevd_concurrency_analyser477copying src/debugpy/_vendored/pydevd/_pydevd_bundle/pydevd_concurrency_analyser/pydevd_concurrency_logger.py -> build/lib.macosx-14.0-arm64-cpython-314/debugpy/_vendored/pydevd/_pydevd_bundle/pydevd_concurrency_analyser478creating build/lib.macosx-14.0-arm64-cpython-314/debugpy/_vendored/pydevd/_pydev_bundle/fsnotify479copying src/debugpy/_vendored/pydevd/_pydev_bundle/fsnotify/__init__.py -> build/lib.macosx-14.0-arm64-cpython-314/debugpy/_vendored/pydevd/_pydev_bundle/fsnotify480creating build/lib.macosx-14.0-arm64-cpython-314/debugpy/_vendored/pydevd/pydevd_plugins/extensions481copying src/debugpy/_vendored/pydevd/pydevd_plugins/extensions/__init__.py -> build/lib.macosx-14.0-arm64-cpython-314/debugpy/_vendored/pydevd/pydevd_plugins/extensions482copying src/debugpy/_vendored/pydevd/pydevd_plugins/extensions/README.md -> build/lib.macosx-14.0-arm64-cpython-314/debugpy/_vendored/pydevd/pydevd_plugins/extensions483creating build/lib.macosx-14.0-arm64-cpython-314/debugpy/_vendored/pydevd/pydevd_attach_to_process/common484copying src/debugpy/_vendored/pydevd/pydevd_attach_to_process/common/ref_utils.hpp -> build/lib.macosx-14.0-arm64-cpython-314/debugpy/_vendored/pydevd/pydevd_attach_to_process/common485copying src/debugpy/_vendored/pydevd/pydevd_attach_to_process/common/py_version.hpp -> build/lib.macosx-14.0-arm64-cpython-314/debugpy/_vendored/pydevd/pydevd_attach_to_process/common486copying src/debugpy/_vendored/pydevd/pydevd_attach_to_process/common/py_custom_pyeval_settrace_310.hpp -> build/lib.macosx-14.0-arm64-cpython-314/debugpy/_vendored/pydevd/pydevd_attach_to_process/common487copying src/debugpy/_vendored/pydevd/pydevd_attach_to_process/common/py_custom_pyeval_settrace_311.hpp -> build/lib.macosx-14.0-arm64-cpython-314/debugpy/_vendored/pydevd/pydevd_attach_to_process/common488copying src/debugpy/_vendored/pydevd/pydevd_attach_to_process/common/py_settrace.hpp -> build/lib.macosx-14.0-arm64-cpython-314/debugpy/_vendored/pydevd/pydevd_attach_to_process/common489copying src/debugpy/_vendored/pydevd/pydevd_attach_to_process/common/py_custom_pyeval_settrace_common.hpp -> build/lib.macosx-14.0-arm64-cpython-314/debugpy/_vendored/pydevd/pydevd_attach_to_process/common490copying src/debugpy/_vendored/pydevd/pydevd_attach_to_process/common/python.h -> build/lib.macosx-14.0-arm64-cpython-314/debugpy/_vendored/pydevd/pydevd_attach_to_process/common491copying src/debugpy/_vendored/pydevd/pydevd_attach_to_process/common/py_custom_pyeval_settrace.hpp -> build/lib.macosx-14.0-arm64-cpython-314/debugpy/_vendored/pydevd/pydevd_attach_to_process/common492copying src/debugpy/_vendored/pydevd/pydevd_attach_to_process/common/py_utils.hpp -> build/lib.macosx-14.0-arm64-cpython-314/debugpy/_vendored/pydevd/pydevd_attach_to_process/common493creating build/lib.macosx-14.0-arm64-cpython-314/debugpy/_vendored/pydevd/pydevd_attach_to_process/winappdbg494copying src/debugpy/_vendored/pydevd/pydevd_attach_to_process/winappdbg/system.py -> build/lib.macosx-14.0-arm64-cpython-314/debugpy/_vendored/pydevd/pydevd_attach_to_process/winappdbg495copying src/debugpy/_vendored/pydevd/pydevd_attach_to_process/winappdbg/event.py -> build/lib.macosx-14.0-arm64-cpython-314/debugpy/_vendored/pydevd/pydevd_attach_to_process/winappdbg496copying src/debugpy/_vendored/pydevd/pydevd_attach_to_process/winappdbg/disasm.py -> build/lib.macosx-14.0-arm64-cpython-314/debugpy/_vendored/pydevd/pydevd_attach_to_process/winappdbg497copying src/debugpy/_vendored/pydevd/pydevd_attach_to_process/winappdbg/thread.py -> build/lib.macosx-14.0-arm64-cpython-314/debugpy/_vendored/pydevd/pydevd_attach_to_process/winappdbg498copying src/debugpy/_vendored/pydevd/pydevd_attach_to_process/winappdbg/compat.py -> build/lib.macosx-14.0-arm64-cpython-314/debugpy/_vendored/pydevd/pydevd_attach_to_process/winappdbg499copying src/debugpy/_vendored/pydevd/pydevd_attach_to_process/winappdbg/crash.py -> build/lib.macosx-14.0-arm64-cpython-314/debugpy/_vendored/pydevd/pydevd_attach_to_process/winappdbg500copying src/debugpy/_vendored/pydevd/pydevd_attach_to_process/winappdbg/window.py -> build/lib.macosx-14.0-arm64-cpython-314/debugpy/_vendored/pydevd/pydevd_attach_to_process/winappdbg501copying src/debugpy/_vendored/pydevd/pydevd_attach_to_process/winappdbg/registry.py -> build/lib.macosx-14.0-arm64-cpython-314/debugpy/_vendored/pydevd/pydevd_attach_to_process/winappdbg502copying src/debugpy/_vendored/pydevd/pydevd_attach_to_process/winappdbg/util.py -> build/lib.macosx-14.0-arm64-cpython-314/debugpy/_vendored/pydevd/pydevd_attach_to_process/winappdbg503copying src/debugpy/_vendored/pydevd/pydevd_attach_to_process/winappdbg/textio.py -> build/lib.macosx-14.0-arm64-cpython-314/debugpy/_vendored/pydevd/pydevd_attach_to_process/winappdbg504copying src/debugpy/_vendored/pydevd/pydevd_attach_to_process/winappdbg/__init__.py -> build/lib.macosx-14.0-arm64-cpython-314/debugpy/_vendored/pydevd/pydevd_attach_to_process/winappdbg505copying src/debugpy/_vendored/pydevd/pydevd_attach_to_process/winappdbg/debug.py -> build/lib.macosx-14.0-arm64-cpython-314/debugpy/_vendored/pydevd/pydevd_attach_to_process/winappdbg506copying src/debugpy/_vendored/pydevd/pydevd_attach_to_process/winappdbg/interactive.py -> build/lib.macosx-14.0-arm64-cpython-314/debugpy/_vendored/pydevd/pydevd_attach_to_process/winappdbg507copying src/debugpy/_vendored/pydevd/pydevd_attach_to_process/winappdbg/search.py -> build/lib.macosx-14.0-arm64-cpython-314/debugpy/_vendored/pydevd/pydevd_attach_to_process/winappdbg508copying src/debugpy/_vendored/pydevd/pydevd_attach_to_process/winappdbg/breakpoint.py -> build/lib.macosx-14.0-arm64-cpython-314/debugpy/_vendored/pydevd/pydevd_attach_to_process/winappdbg509copying src/debugpy/_vendored/pydevd/pydevd_attach_to_process/winappdbg/process.py -> build/lib.macosx-14.0-arm64-cpython-314/debugpy/_vendored/pydevd/pydevd_attach_to_process/winappdbg510copying src/debugpy/_vendored/pydevd/pydevd_attach_to_process/winappdbg/module.py -> build/lib.macosx-14.0-arm64-cpython-314/debugpy/_vendored/pydevd/pydevd_attach_to_process/winappdbg511copying src/debugpy/_vendored/pydevd/pydevd_attach_to_process/winappdbg/sql.py -> build/lib.macosx-14.0-arm64-cpython-314/debugpy/_vendored/pydevd/pydevd_attach_to_process/winappdbg512creating build/lib.macosx-14.0-arm64-cpython-314/debugpy/_vendored/pydevd/pydevd_attach_to_process/windows513copying src/debugpy/_vendored/pydevd/pydevd_attach_to_process/windows/stdafx.h -> build/lib.macosx-14.0-arm64-cpython-314/debugpy/_vendored/pydevd/pydevd_attach_to_process/windows514copying src/debugpy/_vendored/pydevd/pydevd_attach_to_process/windows/inject_dll.cpp -> build/lib.macosx-14.0-arm64-cpython-314/debugpy/_vendored/pydevd/pydevd_attach_to_process/windows515copying src/debugpy/_vendored/pydevd/pydevd_attach_to_process/windows/attach.h -> build/lib.macosx-14.0-arm64-cpython-314/debugpy/_vendored/pydevd/pydevd_attach_to_process/windows516copying src/debugpy/_vendored/pydevd/pydevd_attach_to_process/windows/py_win_helpers.hpp -> build/lib.macosx-14.0-arm64-cpython-314/debugpy/_vendored/pydevd/pydevd_attach_to_process/windows517copying src/debugpy/_vendored/pydevd/pydevd_attach_to_process/windows/attach.cpp -> build/lib.macosx-14.0-arm64-cpython-314/debugpy/_vendored/pydevd/pydevd_attach_to_process/windows518copying src/debugpy/_vendored/pydevd/pydevd_attach_to_process/windows/targetver.h -> build/lib.macosx-14.0-arm64-cpython-314/debugpy/_vendored/pydevd/pydevd_attach_to_process/windows519copying src/debugpy/_vendored/pydevd/pydevd_attach_to_process/windows/run_code_in_memory.hpp -> build/lib.macosx-14.0-arm64-cpython-314/debugpy/_vendored/pydevd/pydevd_attach_to_process/windows520copying src/debugpy/_vendored/pydevd/pydevd_attach_to_process/windows/run_code_on_dllmain.cpp -> build/lib.macosx-14.0-arm64-cpython-314/debugpy/_vendored/pydevd/pydevd_attach_to_process/windows521copying src/debugpy/_vendored/pydevd/pydevd_attach_to_process/windows/stdafx.cpp -> build/lib.macosx-14.0-arm64-cpython-314/debugpy/_vendored/pydevd/pydevd_attach_to_process/windows522copying src/debugpy/_vendored/pydevd/pydevd_attach_to_process/windows/compile_windows.bat -> build/lib.macosx-14.0-arm64-cpython-314/debugpy/_vendored/pydevd/pydevd_attach_to_process/windows523creating build/lib.macosx-14.0-arm64-cpython-314/debugpy/_vendored/pydevd/pydevd_attach_to_process/linux_and_mac524copying src/debugpy/_vendored/pydevd/pydevd_attach_to_process/linux_and_mac/compile_mac.sh -> build/lib.macosx-14.0-arm64-cpython-314/debugpy/_vendored/pydevd/pydevd_attach_to_process/linux_and_mac525copying src/debugpy/_vendored/pydevd/pydevd_attach_to_process/linux_and_mac/attach.cpp -> build/lib.macosx-14.0-arm64-cpython-314/debugpy/_vendored/pydevd/pydevd_attach_to_process/linux_and_mac526copying src/debugpy/_vendored/pydevd/pydevd_attach_to_process/linux_and_mac/.gitignore -> build/lib.macosx-14.0-arm64-cpython-314/debugpy/_vendored/pydevd/pydevd_attach_to_process/linux_and_mac527copying src/debugpy/_vendored/pydevd/pydevd_attach_to_process/linux_and_mac/lldb_prepare.py -> build/lib.macosx-14.0-arm64-cpython-314/debugpy/_vendored/pydevd/pydevd_attach_to_process/linux_and_mac528copying src/debugpy/_vendored/pydevd/pydevd_attach_to_process/linux_and_mac/compile_linux.sh -> build/lib.macosx-14.0-arm64-cpython-314/debugpy/_vendored/pydevd/pydevd_attach_to_process/linux_and_mac529copying src/debugpy/_vendored/pydevd/pydevd_attach_to_process/linux_and_mac/compile_manylinux.cmd -> build/lib.macosx-14.0-arm64-cpython-314/debugpy/_vendored/pydevd/pydevd_attach_to_process/linux_and_mac530creating build/lib.macosx-14.0-arm64-cpython-314/debugpy/_vendored/pydevd/_pydevd_frame_eval/vendored531copying src/debugpy/_vendored/pydevd/_pydevd_frame_eval/vendored/__init__.py -> build/lib.macosx-14.0-arm64-cpython-314/debugpy/_vendored/pydevd/_pydevd_frame_eval/vendored532copying src/debugpy/_vendored/pydevd/_pydevd_frame_eval/vendored/pydevd_fix_code.py -> build/lib.macosx-14.0-arm64-cpython-314/debugpy/_vendored/pydevd/_pydevd_frame_eval/vendored533copying src/debugpy/_vendored/pydevd/_pydevd_frame_eval/vendored/README.txt -> build/lib.macosx-14.0-arm64-cpython-314/debugpy/_vendored/pydevd/_pydevd_frame_eval/vendored534creating build/lib.macosx-14.0-arm64-cpython-314/debugpy/_vendored/pydevd/pydevd_plugins/extensions/types535copying src/debugpy/_vendored/pydevd/pydevd_plugins/extensions/types/pydevd_plugin_numpy_types.py -> build/lib.macosx-14.0-arm64-cpython-314/debugpy/_vendored/pydevd/pydevd_plugins/extensions/types536copying src/debugpy/_vendored/pydevd/pydevd_plugins/extensions/types/__init__.py -> build/lib.macosx-14.0-arm64-cpython-314/debugpy/_vendored/pydevd/pydevd_plugins/extensions/types537copying src/debugpy/_vendored/pydevd/pydevd_plugins/extensions/types/pydevd_plugin_pandas_types.py -> build/lib.macosx-14.0-arm64-cpython-314/debugpy/_vendored/pydevd/pydevd_plugins/extensions/types538copying src/debugpy/_vendored/pydevd/pydevd_plugins/extensions/types/pydevd_helpers.py -> build/lib.macosx-14.0-arm64-cpython-314/debugpy/_vendored/pydevd/pydevd_plugins/extensions/types539copying src/debugpy/_vendored/pydevd/pydevd_plugins/extensions/types/pydevd_plugins_django_form_str.py -> build/lib.macosx-14.0-arm64-cpython-314/debugpy/_vendored/pydevd/pydevd_plugins/extensions/types540creating build/lib.macosx-14.0-arm64-cpython-314/debugpy/_vendored/pydevd/pydevd_attach_to_process/winappdbg/win32541copying src/debugpy/_vendored/pydevd/pydevd_attach_to_process/winappdbg/win32/context_amd64.py -> build/lib.macosx-14.0-arm64-cpython-314/debugpy/_vendored/pydevd/pydevd_attach_to_process/winappdbg/win32542copying src/debugpy/_vendored/pydevd/pydevd_attach_to_process/winappdbg/win32/advapi32.py -> build/lib.macosx-14.0-arm64-cpython-314/debugpy/_vendored/pydevd/pydevd_attach_to_process/winappdbg/win32543copying src/debugpy/_vendored/pydevd/pydevd_attach_to_process/winappdbg/win32/peb_teb.py -> build/lib.macosx-14.0-arm64-cpython-314/debugpy/_vendored/pydevd/pydevd_attach_to_process/winappdbg/win32544copying src/debugpy/_vendored/pydevd/pydevd_attach_to_process/winappdbg/win32/version.py -> build/lib.macosx-14.0-arm64-cpython-314/debugpy/_vendored/pydevd/pydevd_attach_to_process/winappdbg/win32545copying src/debugpy/_vendored/pydevd/pydevd_attach_to_process/winappdbg/win32/kernel32.py -> build/lib.macosx-14.0-arm64-cpython-314/debugpy/_vendored/pydevd/pydevd_attach_to_process/winappdbg/win32546copying src/debugpy/_vendored/pydevd/pydevd_attach_to_process/winappdbg/win32/__init__.py -> build/lib.macosx-14.0-arm64-cpython-314/debugpy/_vendored/pydevd/pydevd_attach_to_process/winappdbg/win32547copying src/debugpy/_vendored/pydevd/pydevd_attach_to_process/winappdbg/win32/user32.py -> build/lib.macosx-14.0-arm64-cpython-314/debugpy/_vendored/pydevd/pydevd_attach_to_process/winappdbg/win32548copying src/debugpy/_vendored/pydevd/pydevd_attach_to_process/winappdbg/win32/psapi.py -> build/lib.macosx-14.0-arm64-cpython-314/debugpy/_vendored/pydevd/pydevd_attach_to_process/winappdbg/win32549copying src/debugpy/_vendored/pydevd/pydevd_attach_to_process/winappdbg/win32/dbghelp.py -> build/lib.macosx-14.0-arm64-cpython-314/debugpy/_vendored/pydevd/pydevd_attach_to_process/winappdbg/win32550copying src/debugpy/_vendored/pydevd/pydevd_attach_to_process/winappdbg/win32/defines.py -> build/lib.macosx-14.0-arm64-cpython-314/debugpy/_vendored/pydevd/pydevd_attach_to_process/winappdbg/win32551copying src/debugpy/_vendored/pydevd/pydevd_attach_to_process/winappdbg/win32/shell32.py -> build/lib.macosx-14.0-arm64-cpython-314/debugpy/_vendored/pydevd/pydevd_attach_to_process/winappdbg/win32552copying src/debugpy/_vendored/pydevd/pydevd_attach_to_process/winappdbg/win32/gdi32.py -> build/lib.macosx-14.0-arm64-cpython-314/debugpy/_vendored/pydevd/pydevd_attach_to_process/winappdbg/win32553copying src/debugpy/_vendored/pydevd/pydevd_attach_to_process/winappdbg/win32/context_i386.py -> build/lib.macosx-14.0-arm64-cpython-314/debugpy/_vendored/pydevd/pydevd_attach_to_process/winappdbg/win32554copying src/debugpy/_vendored/pydevd/pydevd_attach_to_process/winappdbg/win32/wtsapi32.py -> build/lib.macosx-14.0-arm64-cpython-314/debugpy/_vendored/pydevd/pydevd_attach_to_process/winappdbg/win32555copying src/debugpy/_vendored/pydevd/pydevd_attach_to_process/winappdbg/win32/ntdll.py -> build/lib.macosx-14.0-arm64-cpython-314/debugpy/_vendored/pydevd/pydevd_attach_to_process/winappdbg/win32556copying src/debugpy/_vendored/pydevd/pydevd_attach_to_process/winappdbg/win32/shlwapi.py -> build/lib.macosx-14.0-arm64-cpython-314/debugpy/_vendored/pydevd/pydevd_attach_to_process/winappdbg/win32557creating build/lib.macosx-14.0-arm64-cpython-314/debugpy/_vendored/pydevd/_pydevd_frame_eval/vendored/bytecode558copying src/debugpy/_vendored/pydevd/_pydevd_frame_eval/vendored/bytecode/cfg.py -> build/lib.macosx-14.0-arm64-cpython-314/debugpy/_vendored/pydevd/_pydevd_frame_eval/vendored/bytecode559copying src/debugpy/_vendored/pydevd/_pydevd_frame_eval/vendored/bytecode/concrete.py -> build/lib.macosx-14.0-arm64-cpython-314/debugpy/_vendored/pydevd/_pydevd_frame_eval/vendored/bytecode560copying src/debugpy/_vendored/pydevd/_pydevd_frame_eval/vendored/bytecode/flags.py -> build/lib.macosx-14.0-arm64-cpython-314/debugpy/_vendored/pydevd/_pydevd_frame_eval/vendored/bytecode561copying src/debugpy/_vendored/pydevd/_pydevd_frame_eval/vendored/bytecode/__init__.py -> build/lib.macosx-14.0-arm64-cpython-314/debugpy/_vendored/pydevd/_pydevd_frame_eval/vendored/bytecode562copying src/debugpy/_vendored/pydevd/_pydevd_frame_eval/vendored/bytecode/instr.py -> build/lib.macosx-14.0-arm64-cpython-314/debugpy/_vendored/pydevd/_pydevd_frame_eval/vendored/bytecode563copying src/debugpy/_vendored/pydevd/_pydevd_frame_eval/vendored/bytecode/peephole_opt.py -> build/lib.macosx-14.0-arm64-cpython-314/debugpy/_vendored/pydevd/_pydevd_frame_eval/vendored/bytecode564copying src/debugpy/_vendored/pydevd/_pydevd_frame_eval/vendored/bytecode/bytecode.py -> build/lib.macosx-14.0-arm64-cpython-314/debugpy/_vendored/pydevd/_pydevd_frame_eval/vendored/bytecode565creating build/lib.macosx-14.0-arm64-cpython-314/debugpy/_vendored/pydevd/_pydevd_frame_eval/vendored/bytecode/tests566copying src/debugpy/_vendored/pydevd/_pydevd_frame_eval/vendored/bytecode/tests/test_concrete.py -> build/lib.macosx-14.0-arm64-cpython-314/debugpy/_vendored/pydevd/_pydevd_frame_eval/vendored/bytecode/tests567copying src/debugpy/_vendored/pydevd/_pydevd_frame_eval/vendored/bytecode/tests/test_instr.py -> build/lib.macosx-14.0-arm64-cpython-314/debugpy/_vendored/pydevd/_pydevd_frame_eval/vendored/bytecode/tests568copying src/debugpy/_vendored/pydevd/_pydevd_frame_eval/vendored/bytecode/tests/test_misc.py -> build/lib.macosx-14.0-arm64-cpython-314/debugpy/_vendored/pydevd/_pydevd_frame_eval/vendored/bytecode/tests569copying src/debugpy/_vendored/pydevd/_pydevd_frame_eval/vendored/bytecode/tests/test_peephole_opt.py -> build/lib.macosx-14.0-arm64-cpython-314/debugpy/_vendored/pydevd/_pydevd_frame_eval/vendored/bytecode/tests570copying src/debugpy/_vendored/pydevd/_pydevd_frame_eval/vendored/bytecode/tests/test_code.py -> build/lib.macosx-14.0-arm64-cpython-314/debugpy/_vendored/pydevd/_pydevd_frame_eval/vendored/bytecode/tests571copying src/debugpy/_vendored/pydevd/_pydevd_frame_eval/vendored/bytecode/tests/test_cfg.py -> build/lib.macosx-14.0-arm64-cpython-314/debugpy/_vendored/pydevd/_pydevd_frame_eval/vendored/bytecode/tests572copying src/debugpy/_vendored/pydevd/_pydevd_frame_eval/vendored/bytecode/tests/__init__.py -> build/lib.macosx-14.0-arm64-cpython-314/debugpy/_vendored/pydevd/_pydevd_frame_eval/vendored/bytecode/tests573copying src/debugpy/_vendored/pydevd/_pydevd_frame_eval/vendored/bytecode/tests/test_bytecode.py -> build/lib.macosx-14.0-arm64-cpython-314/debugpy/_vendored/pydevd/_pydevd_frame_eval/vendored/bytecode/tests574copying src/debugpy/_vendored/pydevd/_pydevd_frame_eval/vendored/bytecode/tests/util_annotation.py -> build/lib.macosx-14.0-arm64-cpython-314/debugpy/_vendored/pydevd/_pydevd_frame_eval/vendored/bytecode/tests575copying src/debugpy/_vendored/pydevd/_pydevd_frame_eval/vendored/bytecode/tests/test_flags.py -> build/lib.macosx-14.0-arm64-cpython-314/debugpy/_vendored/pydevd/_pydevd_frame_eval/vendored/bytecode/tests576UPDATING build/lib.macosx-14.0-arm64-cpython-314/debugpy/_version.py577set build/lib.macosx-14.0-arm64-cpython-314/debugpy/_version.py to '1.8.22'578running build_ext579UPDATING build/lib.macosx-14.0-arm64-cpython-314/debugpy/_version.py580set build/lib.macosx-14.0-arm64-cpython-314/debugpy/_version.py to '1.8.22'581installing to build/bdist.macosx-14.0-arm64/wheel582running install583running install_lib584creating build/bdist.macosx-14.0-arm64/wheel585creating build/bdist.macosx-14.0-arm64/wheel/debugpy586copying build/lib.macosx-14.0-arm64-cpython-314/debugpy/public_api.py -> build/bdist.macosx-14.0-arm64/wheel/./debugpy587creating build/bdist.macosx-14.0-arm64/wheel/debugpy/launcher588copying build/lib.macosx-14.0-arm64-cpython-314/debugpy/launcher/handlers.py -> build/bdist.macosx-14.0-arm64/wheel/./debugpy/launcher589copying build/lib.macosx-14.0-arm64-cpython-314/debugpy/launcher/__init__.py -> build/bdist.macosx-14.0-arm64/wheel/./debugpy/launcher590copying build/lib.macosx-14.0-arm64-cpython-314/debugpy/launcher/winapi.py -> build/bdist.macosx-14.0-arm64/wheel/./debugpy/launcher591copying build/lib.macosx-14.0-arm64-cpython-314/debugpy/launcher/__main__.py -> build/bdist.macosx-14.0-arm64/wheel/./debugpy/launcher592copying build/lib.macosx-14.0-arm64-cpython-314/debugpy/launcher/debuggee.py -> build/bdist.macosx-14.0-arm64/wheel/./debugpy/launcher593copying build/lib.macosx-14.0-arm64-cpython-314/debugpy/launcher/output.py -> build/bdist.macosx-14.0-arm64/wheel/./debugpy/launcher594copying build/lib.macosx-14.0-arm64-cpython-314/debugpy/ThirdPartyNotices.txt -> build/bdist.macosx-14.0-arm64/wheel/./debugpy595copying build/lib.macosx-14.0-arm64-cpython-314/debugpy/_version.py -> build/bdist.macosx-14.0-arm64/wheel/./debugpy596copying build/lib.macosx-14.0-arm64-cpython-314/debugpy/__init__.py -> build/bdist.macosx-14.0-arm64/wheel/./debugpy597creating build/bdist.macosx-14.0-arm64/wheel/debugpy/server598copying build/lib.macosx-14.0-arm64-cpython-314/debugpy/server/__init__.py -> build/bdist.macosx-14.0-arm64/wheel/./debugpy/server599copying build/lib.macosx-14.0-arm64-cpython-314/debugpy/server/api.py -> build/bdist.macosx-14.0-arm64/wheel/./debugpy/server600copying build/lib.macosx-14.0-arm64-cpython-314/debugpy/server/cli.py -> build/bdist.macosx-14.0-arm64/wheel/./debugpy/server601copying build/lib.macosx-14.0-arm64-cpython-314/debugpy/server/attach_pid_injected.py -> build/bdist.macosx-14.0-arm64/wheel/./debugpy/server602creating build/bdist.macosx-14.0-arm64/wheel/debugpy/adapter603copying build/lib.macosx-14.0-arm64-cpython-314/debugpy/adapter/sessions.py -> build/bdist.macosx-14.0-arm64/wheel/./debugpy/adapter604copying build/lib.macosx-14.0-arm64-cpython-314/debugpy/adapter/__init__.py -> build/bdist.macosx-14.0-arm64/wheel/./debugpy/adapter605copying build/lib.macosx-14.0-arm64-cpython-314/debugpy/adapter/launchers.py -> build/bdist.macosx-14.0-arm64/wheel/./debugpy/adapter606copying build/lib.macosx-14.0-arm64-cpython-314/debugpy/adapter/servers.py -> build/bdist.macosx-14.0-arm64/wheel/./debugpy/adapter607copying build/lib.macosx-14.0-arm64-cpython-314/debugpy/adapter/clients.py -> build/bdist.macosx-14.0-arm64/wheel/./debugpy/adapter608copying build/lib.macosx-14.0-arm64-cpython-314/debugpy/adapter/components.py -> build/bdist.macosx-14.0-arm64/wheel/./debugpy/adapter609copying build/lib.macosx-14.0-arm64-cpython-314/debugpy/adapter/__main__.py -> build/bdist.macosx-14.0-arm64/wheel/./debugpy/adapter610creating build/bdist.macosx-14.0-arm64/wheel/debugpy/common611copying build/lib.macosx-14.0-arm64-cpython-314/debugpy/common/log.py -> build/bdist.macosx-14.0-arm64/wheel/./debugpy/common612copying build/lib.macosx-14.0-arm64-cpython-314/debugpy/common/util.py -> build/bdist.macosx-14.0-arm64/wheel/./debugpy/common613copying build/lib.macosx-14.0-arm64-cpython-314/debugpy/common/__init__.py -> build/bdist.macosx-14.0-arm64/wheel/./debugpy/common614copying build/lib.macosx-14.0-arm64-cpython-314/debugpy/common/singleton.py -> build/bdist.macosx-14.0-arm64/wheel/./debugpy/common615copying build/lib.macosx-14.0-arm64-cpython-314/debugpy/common/sockets.py -> build/bdist.macosx-14.0-arm64/wheel/./debugpy/common616copying build/lib.macosx-14.0-arm64-cpython-314/debugpy/common/timestamp.py -> build/bdist.macosx-14.0-arm64/wheel/./debugpy/common617copying build/lib.macosx-14.0-arm64-cpython-314/debugpy/common/json.py -> build/bdist.macosx-14.0-arm64/wheel/./debugpy/common618copying build/lib.macosx-14.0-arm64-cpython-314/debugpy/common/stacks.py -> build/bdist.macosx-14.0-arm64/wheel/./debugpy/common619copying build/lib.macosx-14.0-arm64-cpython-314/debugpy/common/messaging.py -> build/bdist.macosx-14.0-arm64/wheel/./debugpy/common620copying build/lib.macosx-14.0-arm64-cpython-314/debugpy/py.typed -> build/bdist.macosx-14.0-arm64/wheel/./debugpy621creating build/bdist.macosx-14.0-arm64/wheel/debugpy/_vendored622copying build/lib.macosx-14.0-arm64-cpython-314/debugpy/_vendored/force_pydevd.py -> build/bdist.macosx-14.0-arm64/wheel/./debugpy/_vendored623copying build/lib.macosx-14.0-arm64-cpython-314/debugpy/_vendored/__init__.py -> build/bdist.macosx-14.0-arm64/wheel/./debugpy/_vendored624copying build/lib.macosx-14.0-arm64-cpython-314/debugpy/_vendored/_util.py -> build/bdist.macosx-14.0-arm64/wheel/./debugpy/_vendored625creating build/bdist.macosx-14.0-arm64/wheel/debugpy/_vendored/pydevd626creating build/bdist.macosx-14.0-arm64/wheel/debugpy/_vendored/pydevd/_pydev_runfiles627copying build/lib.macosx-14.0-arm64-cpython-314/debugpy/_vendored/pydevd/_pydev_runfiles/pydev_runfiles.py -> build/bdist.macosx-14.0-arm64/wheel/./debugpy/_vendored/pydevd/_pydev_runfiles628copying build/lib.macosx-14.0-arm64-cpython-314/debugpy/_vendored/pydevd/_pydev_runfiles/pydev_runfiles_unittest.py -> build/bdist.macosx-14.0-arm64/wheel/./debugpy/_vendored/pydevd/_pydev_runfiles629copying build/lib.macosx-14.0-arm64-cpython-314/debugpy/_vendored/pydevd/_pydev_runfiles/pydev_runfiles_coverage.py -> build/bdist.macosx-14.0-arm64/wheel/./debugpy/_vendored/pydevd/_pydev_runfiles630copying build/lib.macosx-14.0-arm64-cpython-314/debugpy/_vendored/pydevd/_pydev_runfiles/__init__.py -> build/bdist.macosx-14.0-arm64/wheel/./debugpy/_vendored/pydevd/_pydev_runfiles631copying build/lib.macosx-14.0-arm64-cpython-314/debugpy/_vendored/pydevd/_pydev_runfiles/pydev_runfiles_nose.py -> build/bdist.macosx-14.0-arm64/wheel/./debugpy/_vendored/pydevd/_pydev_runfiles632copying build/lib.macosx-14.0-arm64-cpython-314/debugpy/_vendored/pydevd/_pydev_runfiles/pydev_runfiles_pytest2.py -> build/bdist.macosx-14.0-arm64/wheel/./debugpy/_vendored/pydevd/_pydev_runfiles633copying build/lib.macosx-14.0-arm64-cpython-314/debugpy/_vendored/pydevd/_pydev_runfiles/pydev_runfiles_parallel_client.py -> build/bdist.macosx-14.0-arm64/wheel/./debugpy/_vendored/pydevd/_pydev_runfiles634copying build/lib.macosx-14.0-arm64-cpython-314/debugpy/_vendored/pydevd/_pydev_runfiles/pydev_runfiles_xml_rpc.py -> build/bdist.macosx-14.0-arm64/wheel/./debugpy/_vendored/pydevd/_pydev_runfiles635copying build/lib.macosx-14.0-arm64-cpython-314/debugpy/_vendored/pydevd/_pydev_runfiles/pydev_runfiles_parallel.py -> build/bdist.macosx-14.0-arm64/wheel/./debugpy/_vendored/pydevd/_pydev_runfiles636creating build/bdist.macosx-14.0-arm64/wheel/debugpy/_vendored/pydevd/_pydevd_sys_monitoring637copying build/lib.macosx-14.0-arm64-cpython-314/debugpy/_vendored/pydevd/_pydevd_sys_monitoring/_pydevd_sys_monitoring.py -> build/bdist.macosx-14.0-arm64/wheel/./debugpy/_vendored/pydevd/_pydevd_sys_monitoring638copying build/lib.macosx-14.0-arm64-cpython-314/debugpy/_vendored/pydevd/_pydevd_sys_monitoring/_pydevd_sys_monitoring_cython.pxd -> build/bdist.macosx-14.0-arm64/wheel/./debugpy/_vendored/pydevd/_pydevd_sys_monitoring639copying build/lib.macosx-14.0-arm64-cpython-314/debugpy/_vendored/pydevd/_pydevd_sys_monitoring/_pydevd_sys_monitoring_cython.c -> build/bdist.macosx-14.0-arm64/wheel/./debugpy/_vendored/pydevd/_pydevd_sys_monitoring640copying build/lib.macosx-14.0-arm64-cpython-314/debugpy/_vendored/pydevd/_pydevd_sys_monitoring/_pydevd_sys_monitoring_cython.cpython-314-darwin.so -> build/bdist.macosx-14.0-arm64/wheel/./debugpy/_vendored/pydevd/_pydevd_sys_monitoring641copying build/lib.macosx-14.0-arm64-cpython-314/debugpy/_vendored/pydevd/_pydevd_sys_monitoring/pydevd_sys_monitoring.py -> build/bdist.macosx-14.0-arm64/wheel/./debugpy/_vendored/pydevd/_pydevd_sys_monitoring642copying build/lib.macosx-14.0-arm64-cpython-314/debugpy/_vendored/pydevd/_pydevd_sys_monitoring/_pydevd_sys_monitoring_cython.pyx -> build/bdist.macosx-14.0-arm64/wheel/./debugpy/_vendored/pydevd/_pydevd_sys_monitoring643creating build/bdist.macosx-14.0-arm64/wheel/debugpy/_vendored/pydevd/_pydevd_bundle644copying build/lib.macosx-14.0-arm64-cpython-314/debugpy/_vendored/pydevd/_pydevd_bundle/pydevd_vars.py -> build/bdist.macosx-14.0-arm64/wheel/./debugpy/_vendored/pydevd/_pydevd_bundle645copying build/lib.macosx-14.0-arm64-cpython-314/debugpy/_vendored/pydevd/_pydevd_bundle/pydevd_command_line_handling.py -> build/bdist.macosx-14.0-arm64/wheel/./debugpy/_vendored/pydevd/_pydevd_bundle646copying build/lib.macosx-14.0-arm64-cpython-314/debugpy/_vendored/pydevd/_pydevd_bundle/pydevd_frame_utils.py -> build/bdist.macosx-14.0-arm64/wheel/./debugpy/_vendored/pydevd/_pydevd_bundle647copying build/lib.macosx-14.0-arm64-cpython-314/debugpy/_vendored/pydevd/_pydevd_bundle/pydevd_breakpoints.py -> build/bdist.macosx-14.0-arm64/wheel/./debugpy/_vendored/pydevd/_pydevd_bundle648copying build/lib.macosx-14.0-arm64-cpython-314/debugpy/_vendored/pydevd/_pydevd_bundle/pydevd_plugin_utils.py -> build/bdist.macosx-14.0-arm64/wheel/./debugpy/_vendored/pydevd/_pydevd_bundle649copying build/lib.macosx-14.0-arm64-cpython-314/debugpy/_vendored/pydevd/_pydevd_bundle/pydevd_cython.pyx -> build/bdist.macosx-14.0-arm64/wheel/./debugpy/_vendored/pydevd/_pydevd_bundle650copying build/lib.macosx-14.0-arm64-cpython-314/debugpy/_vendored/pydevd/_pydevd_bundle/pydevd_process_net_command_json.py -> build/bdist.macosx-14.0-arm64/wheel/./debugpy/_vendored/pydevd/_pydevd_bundle651copying build/lib.macosx-14.0-arm64-cpython-314/debugpy/_vendored/pydevd/_pydevd_bundle/pydevd_timeout.py -> build/bdist.macosx-14.0-arm64/wheel/./debugpy/_vendored/pydevd/_pydevd_bundle652copying build/lib.macosx-14.0-arm64-cpython-314/debugpy/_vendored/pydevd/_pydevd_bundle/pydevd_reload.py -> build/bdist.macosx-14.0-arm64/wheel/./debugpy/_vendored/pydevd/_pydevd_bundle653copying build/lib.macosx-14.0-arm64-cpython-314/debugpy/_vendored/pydevd/_pydevd_bundle/pydevd_io.py -> build/bdist.macosx-14.0-arm64/wheel/./debugpy/_vendored/pydevd/_pydevd_bundle654copying build/lib.macosx-14.0-arm64-cpython-314/debugpy/_vendored/pydevd/_pydevd_bundle/pydevd_daemon_thread.py -> build/bdist.macosx-14.0-arm64/wheel/./debugpy/_vendored/pydevd/_pydevd_bundle655copying build/lib.macosx-14.0-arm64-cpython-314/debugpy/_vendored/pydevd/_pydevd_bundle/pydevd_net_command_factory_json.py -> build/bdist.macosx-14.0-arm64/wheel/./debugpy/_vendored/pydevd/_pydevd_bundle656copying build/lib.macosx-14.0-arm64-cpython-314/debugpy/_vendored/pydevd/_pydevd_bundle/pydevd_comm.py -> build/bdist.macosx-14.0-arm64/wheel/./debugpy/_vendored/pydevd/_pydevd_bundle657copying build/lib.macosx-14.0-arm64-cpython-314/debugpy/_vendored/pydevd/_pydevd_bundle/pydevd_net_command_factory_xml.py -> build/bdist.macosx-14.0-arm64/wheel/./debugpy/_vendored/pydevd/_pydevd_bundle658copying build/lib.macosx-14.0-arm64-cpython-314/debugpy/_vendored/pydevd/_pydevd_bundle/pydevd_xml.py -> build/bdist.macosx-14.0-arm64/wheel/./debugpy/_vendored/pydevd/_pydevd_bundle659copying build/lib.macosx-14.0-arm64-cpython-314/debugpy/_vendored/pydevd/_pydevd_bundle/pydevd_constants.py -> build/bdist.macosx-14.0-arm64/wheel/./debugpy/_vendored/pydevd/_pydevd_bundle660copying build/lib.macosx-14.0-arm64-cpython-314/debugpy/_vendored/pydevd/_pydevd_bundle/pydevd_trace_dispatch.py -> build/bdist.macosx-14.0-arm64/wheel/./debugpy/_vendored/pydevd/_pydevd_bundle661copying build/lib.macosx-14.0-arm64-cpython-314/debugpy/_vendored/pydevd/_pydevd_bundle/pydevd_extension_utils.py -> build/bdist.macosx-14.0-arm64/wheel/./debugpy/_vendored/pydevd/_pydevd_bundle662copying build/lib.macosx-14.0-arm64-cpython-314/debugpy/_vendored/pydevd/_pydevd_bundle/pydevd_dont_trace_files.py -> build/bdist.macosx-14.0-arm64/wheel/./debugpy/_vendored/pydevd/_pydevd_bundle663copying build/lib.macosx-14.0-arm64-cpython-314/debugpy/_vendored/pydevd/_pydevd_bundle/pydevd_custom_frames.py -> build/bdist.macosx-14.0-arm64/wheel/./debugpy/_vendored/pydevd/_pydevd_bundle664copying build/lib.macosx-14.0-arm64-cpython-314/debugpy/_vendored/pydevd/_pydevd_bundle/pydevd_console.py -> build/bdist.macosx-14.0-arm64/wheel/./debugpy/_vendored/pydevd/_pydevd_bundle665copying build/lib.macosx-14.0-arm64-cpython-314/debugpy/_vendored/pydevd/_pydevd_bundle/pydevd_filtering.py -> build/bdist.macosx-14.0-arm64/wheel/./debugpy/_vendored/pydevd/_pydevd_bundle666copying build/lib.macosx-14.0-arm64-cpython-314/debugpy/_vendored/pydevd/_pydevd_bundle/pydevconsole_code.py -> build/bdist.macosx-14.0-arm64/wheel/./debugpy/_vendored/pydevd/_pydevd_bundle667copying build/lib.macosx-14.0-arm64-cpython-314/debugpy/_vendored/pydevd/_pydevd_bundle/pydevd_referrers.py -> build/bdist.macosx-14.0-arm64/wheel/./debugpy/_vendored/pydevd/_pydevd_bundle668copying build/lib.macosx-14.0-arm64-cpython-314/debugpy/_vendored/pydevd/_pydevd_bundle/pydevd_extension_api.py -> build/bdist.macosx-14.0-arm64/wheel/./debugpy/_vendored/pydevd/_pydevd_bundle669copying build/lib.macosx-14.0-arm64-cpython-314/debugpy/_vendored/pydevd/_pydevd_bundle/__init__.py -> build/bdist.macosx-14.0-arm64/wheel/./debugpy/_vendored/pydevd/_pydevd_bundle670copying build/lib.macosx-14.0-arm64-cpython-314/debugpy/_vendored/pydevd/_pydevd_bundle/pydevd_stackless.py -> build/bdist.macosx-14.0-arm64/wheel/./debugpy/_vendored/pydevd/_pydevd_bundle671copying build/lib.macosx-14.0-arm64-cpython-314/debugpy/_vendored/pydevd/_pydevd_bundle/pydevd_collect_bytecode_info.py -> build/bdist.macosx-14.0-arm64/wheel/./debugpy/_vendored/pydevd/_pydevd_bundle672copying build/lib.macosx-14.0-arm64-cpython-314/debugpy/_vendored/pydevd/_pydevd_bundle/pydevd_bytecode_utils.py -> build/bdist.macosx-14.0-arm64/wheel/./debugpy/_vendored/pydevd/_pydevd_bundle673copying build/lib.macosx-14.0-arm64-cpython-314/debugpy/_vendored/pydevd/_pydevd_bundle/pydevd_trace_dispatch_regular.py -> build/bdist.macosx-14.0-arm64/wheel/./debugpy/_vendored/pydevd/_pydevd_bundle674copying build/lib.macosx-14.0-arm64-cpython-314/debugpy/_vendored/pydevd/_pydevd_bundle/pydevd_save_locals.py -> build/bdist.macosx-14.0-arm64/wheel/./debugpy/_vendored/pydevd/_pydevd_bundle675copying build/lib.macosx-14.0-arm64-cpython-314/debugpy/_vendored/pydevd/_pydevd_bundle/pydevd_additional_thread_info_regular.py -> build/bdist.macosx-14.0-arm64/wheel/./debugpy/_vendored/pydevd/_pydevd_bundle676copying build/lib.macosx-14.0-arm64-cpython-314/debugpy/_vendored/pydevd/_pydevd_bundle/pydevd_suspended_frames.py -> build/bdist.macosx-14.0-arm64/wheel/./debugpy/_vendored/pydevd/_pydevd_bundle677copying build/lib.macosx-14.0-arm64-cpython-314/debugpy/_vendored/pydevd/_pydevd_bundle/pydevd_thread_lifecycle.py -> build/bdist.macosx-14.0-arm64/wheel/./debugpy/_vendored/pydevd/_pydevd_bundle678copying build/lib.macosx-14.0-arm64-cpython-314/debugpy/_vendored/pydevd/_pydevd_bundle/pydevd_json_debug_options.py -> build/bdist.macosx-14.0-arm64/wheel/./debugpy/_vendored/pydevd/_pydevd_bundle679copying build/lib.macosx-14.0-arm64-cpython-314/debugpy/_vendored/pydevd/_pydevd_bundle/pydevd_safe_repr.py -> build/bdist.macosx-14.0-arm64/wheel/./debugpy/_vendored/pydevd/_pydevd_bundle680copying build/lib.macosx-14.0-arm64-cpython-314/debugpy/_vendored/pydevd/_pydevd_bundle/pydevd_traceproperty.py -> build/bdist.macosx-14.0-arm64/wheel/./debugpy/_vendored/pydevd/_pydevd_bundle681copying build/lib.macosx-14.0-arm64-cpython-314/debugpy/_vendored/pydevd/_pydevd_bundle/pydevd_import_class.py -> build/bdist.macosx-14.0-arm64/wheel/./debugpy/_vendored/pydevd/_pydevd_bundle682copying build/lib.macosx-14.0-arm64-cpython-314/debugpy/_vendored/pydevd/_pydevd_bundle/pydevd_runpy.py -> build/bdist.macosx-14.0-arm64/wheel/./debugpy/_vendored/pydevd/_pydevd_bundle683copying build/lib.macosx-14.0-arm64-cpython-314/debugpy/_vendored/pydevd/_pydevd_bundle/pydevd_bytecode_utils_py311.py -> build/bdist.macosx-14.0-arm64/wheel/./debugpy/_vendored/pydevd/_pydevd_bundle684copying build/lib.macosx-14.0-arm64-cpython-314/debugpy/_vendored/pydevd/_pydevd_bundle/pydevd_cython_wrapper.py -> build/bdist.macosx-14.0-arm64/wheel/./debugpy/_vendored/pydevd/_pydevd_bundle685creating build/bdist.macosx-14.0-arm64/wheel/debugpy/_vendored/pydevd/_pydevd_bundle/_debug_adapter686copying build/lib.macosx-14.0-arm64-cpython-314/debugpy/_vendored/pydevd/_pydevd_bundle/_debug_adapter/pydevd_base_schema.py -> build/bdist.macosx-14.0-arm64/wheel/./debugpy/_vendored/pydevd/_pydevd_bundle/_debug_adapter687copying build/lib.macosx-14.0-arm64-cpython-314/debugpy/_vendored/pydevd/_pydevd_bundle/_debug_adapter/pydevd_schema_log.py -> build/bdist.macosx-14.0-arm64/wheel/./debugpy/_vendored/pydevd/_pydevd_bundle/_debug_adapter688copying build/lib.macosx-14.0-arm64-cpython-314/debugpy/_vendored/pydevd/_pydevd_bundle/_debug_adapter/__main__pydevd_gen_debug_adapter_protocol.py -> build/bdist.macosx-14.0-arm64/wheel/./debugpy/_vendored/pydevd/_pydevd_bundle/_debug_adapter689copying build/lib.macosx-14.0-arm64-cpython-314/debugpy/_vendored/pydevd/_pydevd_bundle/_debug_adapter/__init__.py -> build/bdist.macosx-14.0-arm64/wheel/./debugpy/_vendored/pydevd/_pydevd_bundle/_debug_adapter690copying build/lib.macosx-14.0-arm64-cpython-314/debugpy/_vendored/pydevd/_pydevd_bundle/_debug_adapter/debugProtocol.json -> build/bdist.macosx-14.0-arm64/wheel/./debugpy/_vendored/pydevd/_pydevd_bundle/_debug_adapter691copying build/lib.macosx-14.0-arm64-cpython-314/debugpy/_vendored/pydevd/_pydevd_bundle/_debug_adapter/debugProtocolCustom.json -> build/bdist.macosx-14.0-arm64/wheel/./debugpy/_vendored/pydevd/_pydevd_bundle/_debug_adapter692copying build/lib.macosx-14.0-arm64-cpython-314/debugpy/_vendored/pydevd/_pydevd_bundle/_debug_adapter/pydevd_schema.py -> build/bdist.macosx-14.0-arm64/wheel/./debugpy/_vendored/pydevd/_pydevd_bundle/_debug_adapter693copying build/lib.macosx-14.0-arm64-cpython-314/debugpy/_vendored/pydevd/_pydevd_bundle/pydevd_additional_thread_info.py -> build/bdist.macosx-14.0-arm64/wheel/./debugpy/_vendored/pydevd/_pydevd_bundle694copying build/lib.macosx-14.0-arm64-cpython-314/debugpy/_vendored/pydevd/_pydevd_bundle/pydevd_api.py -> build/bdist.macosx-14.0-arm64/wheel/./debugpy/_vendored/pydevd/_pydevd_bundle695copying build/lib.macosx-14.0-arm64-cpython-314/debugpy/_vendored/pydevd/_pydevd_bundle/pydevd_dont_trace.py -> build/bdist.macosx-14.0-arm64/wheel/./debugpy/_vendored/pydevd/_pydevd_bundle696copying build/lib.macosx-14.0-arm64-cpython-314/debugpy/_vendored/pydevd/_pydevd_bundle/pydevd_utils.py -> build/bdist.macosx-14.0-arm64/wheel/./debugpy/_vendored/pydevd/_pydevd_bundle697copying build/lib.macosx-14.0-arm64-cpython-314/debugpy/_vendored/pydevd/_pydevd_bundle/pydevd_net_command.py -> build/bdist.macosx-14.0-arm64/wheel/./debugpy/_vendored/pydevd/_pydevd_bundle698copying build/lib.macosx-14.0-arm64-cpython-314/debugpy/_vendored/pydevd/_pydevd_bundle/pydevd_signature.py -> build/bdist.macosx-14.0-arm64/wheel/./debugpy/_vendored/pydevd/_pydevd_bundle699copying build/lib.macosx-14.0-arm64-cpython-314/debugpy/_vendored/pydevd/_pydevd_bundle/pydevd_vm_type.py -> build/bdist.macosx-14.0-arm64/wheel/./debugpy/_vendored/pydevd/_pydevd_bundle700copying build/lib.macosx-14.0-arm64-cpython-314/debugpy/_vendored/pydevd/_pydevd_bundle/pydevd_cython.c -> build/bdist.macosx-14.0-arm64/wheel/./debugpy/_vendored/pydevd/_pydevd_bundle701copying build/lib.macosx-14.0-arm64-cpython-314/debugpy/_vendored/pydevd/_pydevd_bundle/pydevd_cython.cpython-314-darwin.so -> build/bdist.macosx-14.0-arm64/wheel/./debugpy/_vendored/pydevd/_pydevd_bundle702copying build/lib.macosx-14.0-arm64-cpython-314/debugpy/_vendored/pydevd/_pydevd_bundle/pydevd_gevent_integration.py -> build/bdist.macosx-14.0-arm64/wheel/./debugpy/_vendored/pydevd/_pydevd_bundle703copying build/lib.macosx-14.0-arm64-cpython-314/debugpy/_vendored/pydevd/_pydevd_bundle/pydevd_comm_constants.py -> build/bdist.macosx-14.0-arm64/wheel/./debugpy/_vendored/pydevd/_pydevd_bundle704copying build/lib.macosx-14.0-arm64-cpython-314/debugpy/_vendored/pydevd/_pydevd_bundle/pydevd_defaults.py -> build/bdist.macosx-14.0-arm64/wheel/./debugpy/_vendored/pydevd/_pydevd_bundle705copying build/lib.macosx-14.0-arm64-cpython-314/debugpy/_vendored/pydevd/_pydevd_bundle/pydevd_process_net_command.py -> build/bdist.macosx-14.0-arm64/wheel/./debugpy/_vendored/pydevd/_pydevd_bundle706copying build/lib.macosx-14.0-arm64-cpython-314/debugpy/_vendored/pydevd/_pydevd_bundle/pydevd_cython.pxd -> build/bdist.macosx-14.0-arm64/wheel/./debugpy/_vendored/pydevd/_pydevd_bundle707copying build/lib.macosx-14.0-arm64-cpython-314/debugpy/_vendored/pydevd/_pydevd_bundle/pydevd_source_mapping.py -> build/bdist.macosx-14.0-arm64/wheel/./debugpy/_vendored/pydevd/_pydevd_bundle708copying build/lib.macosx-14.0-arm64-cpython-314/debugpy/_vendored/pydevd/_pydevd_bundle/pydevd_resolver.py -> build/bdist.macosx-14.0-arm64/wheel/./debugpy/_vendored/pydevd/_pydevd_bundle709copying build/lib.macosx-14.0-arm64-cpython-314/debugpy/_vendored/pydevd/_pydevd_bundle/pydevd_frame.py -> build/bdist.macosx-14.0-arm64/wheel/./debugpy/_vendored/pydevd/_pydevd_bundle710copying build/lib.macosx-14.0-arm64-cpython-314/debugpy/_vendored/pydevd/_pydevd_bundle/pydevd_exec2.py -> build/bdist.macosx-14.0-arm64/wheel/./debugpy/_vendored/pydevd/_pydevd_bundle711creating build/bdist.macosx-14.0-arm64/wheel/debugpy/_vendored/pydevd/_pydevd_bundle/pydevd_concurrency_analyser712copying build/lib.macosx-14.0-arm64-cpython-314/debugpy/_vendored/pydevd/_pydevd_bundle/pydevd_concurrency_analyser/__init__.py -> build/bdist.macosx-14.0-arm64/wheel/./debugpy/_vendored/pydevd/_pydevd_bundle/pydevd_concurrency_analyser713copying build/lib.macosx-14.0-arm64-cpython-314/debugpy/_vendored/pydevd/_pydevd_bundle/pydevd_concurrency_analyser/pydevd_thread_wrappers.py -> build/bdist.macosx-14.0-arm64/wheel/./debugpy/_vendored/pydevd/_pydevd_bundle/pydevd_concurrency_analyser714copying build/lib.macosx-14.0-arm64-cpython-314/debugpy/_vendored/pydevd/_pydevd_bundle/pydevd_concurrency_analyser/pydevd_concurrency_logger.py -> build/bdist.macosx-14.0-arm64/wheel/./debugpy/_vendored/pydevd/_pydevd_bundle/pydevd_concurrency_analyser715copying build/lib.macosx-14.0-arm64-cpython-314/debugpy/_vendored/pydevd/_pydevd_bundle/pydevd_code_to_source.py -> build/bdist.macosx-14.0-arm64/wheel/./debugpy/_vendored/pydevd/_pydevd_bundle716creating build/bdist.macosx-14.0-arm64/wheel/debugpy/_vendored/pydevd/_pydev_bundle717copying build/lib.macosx-14.0-arm64-cpython-314/debugpy/_vendored/pydevd/_pydev_bundle/_pydev_calltip_util.py -> build/bdist.macosx-14.0-arm64/wheel/./debugpy/_vendored/pydevd/_pydev_bundle718copying build/lib.macosx-14.0-arm64-cpython-314/debugpy/_vendored/pydevd/_pydev_bundle/_pydev_saved_modules.py -> build/bdist.macosx-14.0-arm64/wheel/./debugpy/_vendored/pydevd/_pydev_bundle719copying build/lib.macosx-14.0-arm64-cpython-314/debugpy/_vendored/pydevd/_pydev_bundle/_pydev_filesystem_encoding.py -> build/bdist.macosx-14.0-arm64/wheel/./debugpy/_vendored/pydevd/_pydev_bundle720copying build/lib.macosx-14.0-arm64-cpython-314/debugpy/_vendored/pydevd/_pydev_bundle/pydev_monkey.py -> build/bdist.macosx-14.0-arm64/wheel/./debugpy/_vendored/pydevd/_pydev_bundle721copying build/lib.macosx-14.0-arm64-cpython-314/debugpy/_vendored/pydevd/_pydev_bundle/_pydev_tipper_common.py -> build/bdist.macosx-14.0-arm64/wheel/./debugpy/_vendored/pydevd/_pydev_bundle722creating build/bdist.macosx-14.0-arm64/wheel/debugpy/_vendored/pydevd/_pydev_bundle/fsnotify723copying build/lib.macosx-14.0-arm64-cpython-314/debugpy/_vendored/pydevd/_pydev_bundle/fsnotify/__init__.py -> build/bdist.macosx-14.0-arm64/wheel/./debugpy/_vendored/pydevd/_pydev_bundle/fsnotify724copying build/lib.macosx-14.0-arm64-cpython-314/debugpy/_vendored/pydevd/_pydev_bundle/_pydev_imports_tipper.py -> build/bdist.macosx-14.0-arm64/wheel/./debugpy/_vendored/pydevd/_pydev_bundle725copying build/lib.macosx-14.0-arm64-cpython-314/debugpy/_vendored/pydevd/_pydev_bundle/pydev_log.py -> build/bdist.macosx-14.0-arm64/wheel/./debugpy/_vendored/pydevd/_pydev_bundle726copying build/lib.macosx-14.0-arm64-cpython-314/debugpy/_vendored/pydevd/_pydev_bundle/pydev_monkey_qt.py -> build/bdist.macosx-14.0-arm64/wheel/./debugpy/_vendored/pydevd/_pydev_bundle727copying build/lib.macosx-14.0-arm64-cpython-314/debugpy/_vendored/pydevd/_pydev_bundle/_pydev_completer.py -> build/bdist.macosx-14.0-arm64/wheel/./debugpy/_vendored/pydevd/_pydev_bundle728copying build/lib.macosx-14.0-arm64-cpython-314/debugpy/_vendored/pydevd/_pydev_bundle/pydev_is_thread_alive.py -> build/bdist.macosx-14.0-arm64/wheel/./debugpy/_vendored/pydevd/_pydev_bundle729copying build/lib.macosx-14.0-arm64-cpython-314/debugpy/_vendored/pydevd/_pydev_bundle/pydev_versioncheck.py -> build/bdist.macosx-14.0-arm64/wheel/./debugpy/_vendored/pydevd/_pydev_bundle730copying build/lib.macosx-14.0-arm64-cpython-314/debugpy/_vendored/pydevd/_pydev_bundle/_pydev_jy_imports_tipper.py -> build/bdist.macosx-14.0-arm64/wheel/./debugpy/_vendored/pydevd/_pydev_bundle731copying build/lib.macosx-14.0-arm64-cpython-314/debugpy/_vendored/pydevd/_pydev_bundle/pydev_ipython_console.py -> build/bdist.macosx-14.0-arm64/wheel/./debugpy/_vendored/pydevd/_pydev_bundle732copying build/lib.macosx-14.0-arm64-cpython-314/debugpy/_vendored/pydevd/_pydev_bundle/_pydev_log.py -> build/bdist.macosx-14.0-arm64/wheel/./debugpy/_vendored/pydevd/_pydev_bundle733copying build/lib.macosx-14.0-arm64-cpython-314/debugpy/_vendored/pydevd/_pydev_bundle/__init__.py -> build/bdist.macosx-14.0-arm64/wheel/./debugpy/_vendored/pydevd/_pydev_bundle734copying build/lib.macosx-14.0-arm64-cpython-314/debugpy/_vendored/pydevd/_pydev_bundle/pydev_imports.py -> build/bdist.macosx-14.0-arm64/wheel/./debugpy/_vendored/pydevd/_pydev_bundle735copying build/lib.macosx-14.0-arm64-cpython-314/debugpy/_vendored/pydevd/_pydev_bundle/pydev_console_utils.py -> build/bdist.macosx-14.0-arm64/wheel/./debugpy/_vendored/pydevd/_pydev_bundle736copying build/lib.macosx-14.0-arm64-cpython-314/debugpy/_vendored/pydevd/_pydev_bundle/pydev_ipython_console_011.py -> build/bdist.macosx-14.0-arm64/wheel/./debugpy/_vendored/pydevd/_pydev_bundle737copying build/lib.macosx-14.0-arm64-cpython-314/debugpy/_vendored/pydevd/_pydev_bundle/pydev_import_hook.py -> build/bdist.macosx-14.0-arm64/wheel/./debugpy/_vendored/pydevd/_pydev_bundle738copying build/lib.macosx-14.0-arm64-cpython-314/debugpy/_vendored/pydevd/_pydev_bundle/pydev_override.py -> build/bdist.macosx-14.0-arm64/wheel/./debugpy/_vendored/pydevd/_pydev_bundle739copying build/lib.macosx-14.0-arm64-cpython-314/debugpy/_vendored/pydevd/_pydev_bundle/_pydev_execfile.py -> build/bdist.macosx-14.0-arm64/wheel/./debugpy/_vendored/pydevd/_pydev_bundle740copying build/lib.macosx-14.0-arm64-cpython-314/debugpy/_vendored/pydevd/_pydev_bundle/pydev_umd.py -> build/bdist.macosx-14.0-arm64/wheel/./debugpy/_vendored/pydevd/_pydev_bundle741copying build/lib.macosx-14.0-arm64-cpython-314/debugpy/_vendored/pydevd/_pydev_bundle/pydev_localhost.py -> build/bdist.macosx-14.0-arm64/wheel/./debugpy/_vendored/pydevd/_pydev_bundle742copying build/lib.macosx-14.0-arm64-cpython-314/debugpy/_vendored/pydevd/_pydev_bundle/_pydev_sys_patch.py -> build/bdist.macosx-14.0-arm64/wheel/./debugpy/_vendored/pydevd/_pydev_bundle743copying build/lib.macosx-14.0-arm64-cpython-314/debugpy/_vendored/pydevd/_pydev_bundle/_pydev_getopt.py -> build/bdist.macosx-14.0-arm64/wheel/./debugpy/_vendored/pydevd/_pydev_bundle744creating build/bdist.macosx-14.0-arm64/wheel/debugpy/_vendored/pydevd/pydevd_plugins745copying build/lib.macosx-14.0-arm64-cpython-314/debugpy/_vendored/pydevd/pydevd_plugins/django_debug.py -> build/bdist.macosx-14.0-arm64/wheel/./debugpy/_vendored/pydevd/pydevd_plugins746copying build/lib.macosx-14.0-arm64-cpython-314/debugpy/_vendored/pydevd/pydevd_plugins/__init__.py -> build/bdist.macosx-14.0-arm64/wheel/./debugpy/_vendored/pydevd/pydevd_plugins747copying build/lib.macosx-14.0-arm64-cpython-314/debugpy/_vendored/pydevd/pydevd_plugins/pydevd_line_validation.py -> build/bdist.macosx-14.0-arm64/wheel/./debugpy/_vendored/pydevd/pydevd_plugins748creating build/bdist.macosx-14.0-arm64/wheel/debugpy/_vendored/pydevd/pydevd_plugins/extensions749creating build/bdist.macosx-14.0-arm64/wheel/debugpy/_vendored/pydevd/pydevd_plugins/extensions/types750copying build/lib.macosx-14.0-arm64-cpython-314/debugpy/_vendored/pydevd/pydevd_plugins/extensions/types/pydevd_plugin_numpy_types.py -> build/bdist.macosx-14.0-arm64/wheel/./debugpy/_vendored/pydevd/pydevd_plugins/extensions/types751copying build/lib.macosx-14.0-arm64-cpython-314/debugpy/_vendored/pydevd/pydevd_plugins/extensions/types/__init__.py -> build/bdist.macosx-14.0-arm64/wheel/./debugpy/_vendored/pydevd/pydevd_plugins/extensions/types752copying build/lib.macosx-14.0-arm64-cpython-314/debugpy/_vendored/pydevd/pydevd_plugins/extensions/types/pydevd_plugin_pandas_types.py -> build/bdist.macosx-14.0-arm64/wheel/./debugpy/_vendored/pydevd/pydevd_plugins/extensions/types753copying build/lib.macosx-14.0-arm64-cpython-314/debugpy/_vendored/pydevd/pydevd_plugins/extensions/types/pydevd_helpers.py -> build/bdist.macosx-14.0-arm64/wheel/./debugpy/_vendored/pydevd/pydevd_plugins/extensions/types754copying build/lib.macosx-14.0-arm64-cpython-314/debugpy/_vendored/pydevd/pydevd_plugins/extensions/types/pydevd_plugins_django_form_str.py -> build/bdist.macosx-14.0-arm64/wheel/./debugpy/_vendored/pydevd/pydevd_plugins/extensions/types755copying build/lib.macosx-14.0-arm64-cpython-314/debugpy/_vendored/pydevd/pydevd_plugins/extensions/__init__.py -> build/bdist.macosx-14.0-arm64/wheel/./debugpy/_vendored/pydevd/pydevd_plugins/extensions756copying build/lib.macosx-14.0-arm64-cpython-314/debugpy/_vendored/pydevd/pydevd_plugins/extensions/README.md -> build/bdist.macosx-14.0-arm64/wheel/./debugpy/_vendored/pydevd/pydevd_plugins/extensions757copying build/lib.macosx-14.0-arm64-cpython-314/debugpy/_vendored/pydevd/pydevd_plugins/jinja2_debug.py -> build/bdist.macosx-14.0-arm64/wheel/./debugpy/_vendored/pydevd/pydevd_plugins758copying build/lib.macosx-14.0-arm64-cpython-314/debugpy/_vendored/pydevd/pydevd_file_utils.py -> build/bdist.macosx-14.0-arm64/wheel/./debugpy/_vendored/pydevd759copying build/lib.macosx-14.0-arm64-cpython-314/debugpy/_vendored/pydevd/pydevd_tracing.py -> build/bdist.macosx-14.0-arm64/wheel/./debugpy/_vendored/pydevd760copying build/lib.macosx-14.0-arm64-cpython-314/debugpy/_vendored/pydevd/pydev_app_engine_debug_startup.py -> build/bdist.macosx-14.0-arm64/wheel/./debugpy/_vendored/pydevd761copying build/lib.macosx-14.0-arm64-cpython-314/debugpy/_vendored/pydevd/pydev_coverage.py -> build/bdist.macosx-14.0-arm64/wheel/./debugpy/_vendored/pydevd762creating build/bdist.macosx-14.0-arm64/wheel/debugpy/_vendored/pydevd/pydev_ipython763copying build/lib.macosx-14.0-arm64-cpython-314/debugpy/_vendored/pydevd/pydev_ipython/inputhookpyglet.py -> build/bdist.macosx-14.0-arm64/wheel/./debugpy/_vendored/pydevd/pydev_ipython764copying build/lib.macosx-14.0-arm64-cpython-314/debugpy/_vendored/pydevd/pydev_ipython/inputhookgtk.py -> build/bdist.macosx-14.0-arm64/wheel/./debugpy/_vendored/pydevd/pydev_ipython765copying build/lib.macosx-14.0-arm64-cpython-314/debugpy/_vendored/pydevd/pydev_ipython/inputhooktk.py -> build/bdist.macosx-14.0-arm64/wheel/./debugpy/_vendored/pydevd/pydev_ipython766copying build/lib.macosx-14.0-arm64-cpython-314/debugpy/_vendored/pydevd/pydev_ipython/inputhookglut.py -> build/bdist.macosx-14.0-arm64/wheel/./debugpy/_vendored/pydevd/pydev_ipython767copying build/lib.macosx-14.0-arm64-cpython-314/debugpy/_vendored/pydevd/pydev_ipython/version.py -> build/bdist.macosx-14.0-arm64/wheel/./debugpy/_vendored/pydevd/pydev_ipython768copying build/lib.macosx-14.0-arm64-cpython-314/debugpy/_vendored/pydevd/pydev_ipython/matplotlibtools.py -> build/bdist.macosx-14.0-arm64/wheel/./debugpy/_vendored/pydevd/pydev_ipython769copying build/lib.macosx-14.0-arm64-cpython-314/debugpy/_vendored/pydevd/pydev_ipython/inputhookwx.py -> build/bdist.macosx-14.0-arm64/wheel/./debugpy/_vendored/pydevd/pydev_ipython770copying build/lib.macosx-14.0-arm64-cpython-314/debugpy/_vendored/pydevd/pydev_ipython/inputhookqt5.py -> build/bdist.macosx-14.0-arm64/wheel/./debugpy/_vendored/pydevd/pydev_ipython771copying build/lib.macosx-14.0-arm64-cpython-314/debugpy/_vendored/pydevd/pydev_ipython/inputhookgtk3.py -> build/bdist.macosx-14.0-arm64/wheel/./debugpy/_vendored/pydevd/pydev_ipython772copying build/lib.macosx-14.0-arm64-cpython-314/debugpy/_vendored/pydevd/pydev_ipython/qt.py -> build/bdist.macosx-14.0-arm64/wheel/./debugpy/_vendored/pydevd/pydev_ipython773copying build/lib.macosx-14.0-arm64-cpython-314/debugpy/_vendored/pydevd/pydev_ipython/__init__.py -> build/bdist.macosx-14.0-arm64/wheel/./debugpy/_vendored/pydevd/pydev_ipython774copying build/lib.macosx-14.0-arm64-cpython-314/debugpy/_vendored/pydevd/pydev_ipython/inputhookqt4.py -> build/bdist.macosx-14.0-arm64/wheel/./debugpy/_vendored/pydevd/pydev_ipython775copying build/lib.macosx-14.0-arm64-cpython-314/debugpy/_vendored/pydevd/pydev_ipython/README -> build/bdist.macosx-14.0-arm64/wheel/./debugpy/_vendored/pydevd/pydev_ipython776copying build/lib.macosx-14.0-arm64-cpython-314/debugpy/_vendored/pydevd/pydev_ipython/inputhookqt6.py -> build/bdist.macosx-14.0-arm64/wheel/./debugpy/_vendored/pydevd/pydev_ipython777copying build/lib.macosx-14.0-arm64-cpython-314/debugpy/_vendored/pydevd/pydev_ipython/inputhook.py -> build/bdist.macosx-14.0-arm64/wheel/./debugpy/_vendored/pydevd/pydev_ipython778copying build/lib.macosx-14.0-arm64-cpython-314/debugpy/_vendored/pydevd/pydev_ipython/qt_loaders.py -> build/bdist.macosx-14.0-arm64/wheel/./debugpy/_vendored/pydevd/pydev_ipython779copying build/lib.macosx-14.0-arm64-cpython-314/debugpy/_vendored/pydevd/pydev_ipython/qt_for_kernel.py -> build/bdist.macosx-14.0-arm64/wheel/./debugpy/_vendored/pydevd/pydev_ipython780copying build/lib.macosx-14.0-arm64-cpython-314/debugpy/_vendored/pydevd/pydevconsole.py -> build/bdist.macosx-14.0-arm64/wheel/./debugpy/_vendored/pydevd781creating build/bdist.macosx-14.0-arm64/wheel/debugpy/_vendored/pydevd/pydevd_attach_to_process782copying build/lib.macosx-14.0-arm64-cpython-314/debugpy/_vendored/pydevd/pydevd_attach_to_process/_test_attach_to_process.py -> build/bdist.macosx-14.0-arm64/wheel/./debugpy/_vendored/pydevd/pydevd_attach_to_process783copying build/lib.macosx-14.0-arm64-cpython-314/debugpy/_vendored/pydevd/pydevd_attach_to_process/_check.py -> build/bdist.macosx-14.0-arm64/wheel/./debugpy/_vendored/pydevd/pydevd_attach_to_process784copying build/lib.macosx-14.0-arm64-cpython-314/debugpy/_vendored/pydevd/pydevd_attach_to_process/add_code_to_python_process.py -> build/bdist.macosx-14.0-arm64/wheel/./debugpy/_vendored/pydevd/pydevd_attach_to_process785copying build/lib.macosx-14.0-arm64-cpython-314/debugpy/_vendored/pydevd/pydevd_attach_to_process/attach_script.py -> build/bdist.macosx-14.0-arm64/wheel/./debugpy/_vendored/pydevd/pydevd_attach_to_process786creating build/bdist.macosx-14.0-arm64/wheel/debugpy/_vendored/pydevd/pydevd_attach_to_process/common787copying build/lib.macosx-14.0-arm64-cpython-314/debugpy/_vendored/pydevd/pydevd_attach_to_process/common/ref_utils.hpp -> build/bdist.macosx-14.0-arm64/wheel/./debugpy/_vendored/pydevd/pydevd_attach_to_process/common788copying build/lib.macosx-14.0-arm64-cpython-314/debugpy/_vendored/pydevd/pydevd_attach_to_process/common/py_version.hpp -> build/bdist.macosx-14.0-arm64/wheel/./debugpy/_vendored/pydevd/pydevd_attach_to_process/common789copying build/lib.macosx-14.0-arm64-cpython-314/debugpy/_vendored/pydevd/pydevd_attach_to_process/common/py_custom_pyeval_settrace_310.hpp -> build/bdist.macosx-14.0-arm64/wheel/./debugpy/_vendored/pydevd/pydevd_attach_to_process/common790copying build/lib.macosx-14.0-arm64-cpython-314/debugpy/_vendored/pydevd/pydevd_attach_to_process/common/py_custom_pyeval_settrace_311.hpp -> build/bdist.macosx-14.0-arm64/wheel/./debugpy/_vendored/pydevd/pydevd_attach_to_process/common791copying build/lib.macosx-14.0-arm64-cpython-314/debugpy/_vendored/pydevd/pydevd_attach_to_process/common/py_settrace.hpp -> build/bdist.macosx-14.0-arm64/wheel/./debugpy/_vendored/pydevd/pydevd_attach_to_process/common792copying build/lib.macosx-14.0-arm64-cpython-314/debugpy/_vendored/pydevd/pydevd_attach_to_process/common/py_custom_pyeval_settrace_common.hpp -> build/bdist.macosx-14.0-arm64/wheel/./debugpy/_vendored/pydevd/pydevd_attach_to_process/common793copying build/lib.macosx-14.0-arm64-cpython-314/debugpy/_vendored/pydevd/pydevd_attach_to_process/common/python.h -> build/bdist.macosx-14.0-arm64/wheel/./debugpy/_vendored/pydevd/pydevd_attach_to_process/common794copying build/lib.macosx-14.0-arm64-cpython-314/debugpy/_vendored/pydevd/pydevd_attach_to_process/common/py_custom_pyeval_settrace.hpp -> build/bdist.macosx-14.0-arm64/wheel/./debugpy/_vendored/pydevd/pydevd_attach_to_process/common795copying build/lib.macosx-14.0-arm64-cpython-314/debugpy/_vendored/pydevd/pydevd_attach_to_process/common/py_utils.hpp -> build/bdist.macosx-14.0-arm64/wheel/./debugpy/_vendored/pydevd/pydevd_attach_to_process/common796creating build/bdist.macosx-14.0-arm64/wheel/debugpy/_vendored/pydevd/pydevd_attach_to_process/winappdbg797copying build/lib.macosx-14.0-arm64-cpython-314/debugpy/_vendored/pydevd/pydevd_attach_to_process/winappdbg/system.py -> build/bdist.macosx-14.0-arm64/wheel/./debugpy/_vendored/pydevd/pydevd_attach_to_process/winappdbg798copying build/lib.macosx-14.0-arm64-cpython-314/debugpy/_vendored/pydevd/pydevd_attach_to_process/winappdbg/event.py -> build/bdist.macosx-14.0-arm64/wheel/./debugpy/_vendored/pydevd/pydevd_attach_to_process/winappdbg799copying build/lib.macosx-14.0-arm64-cpython-314/debugpy/_vendored/pydevd/pydevd_attach_to_process/winappdbg/disasm.py -> build/bdist.macosx-14.0-arm64/wheel/./debugpy/_vendored/pydevd/pydevd_attach_to_process/winappdbg800copying build/lib.macosx-14.0-arm64-cpython-314/debugpy/_vendored/pydevd/pydevd_attach_to_process/winappdbg/thread.py -> build/bdist.macosx-14.0-arm64/wheel/./debugpy/_vendored/pydevd/pydevd_attach_to_process/winappdbg801copying build/lib.macosx-14.0-arm64-cpython-314/debugpy/_vendored/pydevd/pydevd_attach_to_process/winappdbg/compat.py -> build/bdist.macosx-14.0-arm64/wheel/./debugpy/_vendored/pydevd/pydevd_attach_to_process/winappdbg802copying build/lib.macosx-14.0-arm64-cpython-314/debugpy/_vendored/pydevd/pydevd_attach_to_process/winappdbg/crash.py -> build/bdist.macosx-14.0-arm64/wheel/./debugpy/_vendored/pydevd/pydevd_attach_to_process/winappdbg803copying build/lib.macosx-14.0-arm64-cpython-314/debugpy/_vendored/pydevd/pydevd_attach_to_process/winappdbg/window.py -> build/bdist.macosx-14.0-arm64/wheel/./debugpy/_vendored/pydevd/pydevd_attach_to_process/winappdbg804copying build/lib.macosx-14.0-arm64-cpython-314/debugpy/_vendored/pydevd/pydevd_attach_to_process/winappdbg/registry.py -> build/bdist.macosx-14.0-arm64/wheel/./debugpy/_vendored/pydevd/pydevd_attach_to_process/winappdbg805copying build/lib.macosx-14.0-arm64-cpython-314/debugpy/_vendored/pydevd/pydevd_attach_to_process/winappdbg/util.py -> build/bdist.macosx-14.0-arm64/wheel/./debugpy/_vendored/pydevd/pydevd_attach_to_process/winappdbg806copying build/lib.macosx-14.0-arm64-cpython-314/debugpy/_vendored/pydevd/pydevd_attach_to_process/winappdbg/textio.py -> build/bdist.macosx-14.0-arm64/wheel/./debugpy/_vendored/pydevd/pydevd_attach_to_process/winappdbg807copying build/lib.macosx-14.0-arm64-cpython-314/debugpy/_vendored/pydevd/pydevd_attach_to_process/winappdbg/__init__.py -> build/bdist.macosx-14.0-arm64/wheel/./debugpy/_vendored/pydevd/pydevd_attach_to_process/winappdbg808copying build/lib.macosx-14.0-arm64-cpython-314/debugpy/_vendored/pydevd/pydevd_attach_to_process/winappdbg/debug.py -> build/bdist.macosx-14.0-arm64/wheel/./debugpy/_vendored/pydevd/pydevd_attach_to_process/winappdbg809copying build/lib.macosx-14.0-arm64-cpython-314/debugpy/_vendored/pydevd/pydevd_attach_to_process/winappdbg/interactive.py -> build/bdist.macosx-14.0-arm64/wheel/./debugpy/_vendored/pydevd/pydevd_attach_to_process/winappdbg810copying build/lib.macosx-14.0-arm64-cpython-314/debugpy/_vendored/pydevd/pydevd_attach_to_process/winappdbg/search.py -> build/bdist.macosx-14.0-arm64/wheel/./debugpy/_vendored/pydevd/pydevd_attach_to_process/winappdbg811copying build/lib.macosx-14.0-arm64-cpython-314/debugpy/_vendored/pydevd/pydevd_attach_to_process/winappdbg/breakpoint.py -> build/bdist.macosx-14.0-arm64/wheel/./debugpy/_vendored/pydevd/pydevd_attach_to_process/winappdbg812copying build/lib.macosx-14.0-arm64-cpython-314/debugpy/_vendored/pydevd/pydevd_attach_to_process/winappdbg/process.py -> build/bdist.macosx-14.0-arm64/wheel/./debugpy/_vendored/pydevd/pydevd_attach_to_process/winappdbg813copying build/lib.macosx-14.0-arm64-cpython-314/debugpy/_vendored/pydevd/pydevd_attach_to_process/winappdbg/module.py -> build/bdist.macosx-14.0-arm64/wheel/./debugpy/_vendored/pydevd/pydevd_attach_to_process/winappdbg814copying build/lib.macosx-14.0-arm64-cpython-314/debugpy/_vendored/pydevd/pydevd_attach_to_process/winappdbg/sql.py -> build/bdist.macosx-14.0-arm64/wheel/./debugpy/_vendored/pydevd/pydevd_attach_to_process/winappdbg815creating build/bdist.macosx-14.0-arm64/wheel/debugpy/_vendored/pydevd/pydevd_attach_to_process/winappdbg/win32816copying build/lib.macosx-14.0-arm64-cpython-314/debugpy/_vendored/pydevd/pydevd_attach_to_process/winappdbg/win32/context_amd64.py -> build/bdist.macosx-14.0-arm64/wheel/./debugpy/_vendored/pydevd/pydevd_attach_to_process/winappdbg/win32817copying build/lib.macosx-14.0-arm64-cpython-314/debugpy/_vendored/pydevd/pydevd_attach_to_process/winappdbg/win32/advapi32.py -> build/bdist.macosx-14.0-arm64/wheel/./debugpy/_vendored/pydevd/pydevd_attach_to_process/winappdbg/win32818copying build/lib.macosx-14.0-arm64-cpython-314/debugpy/_vendored/pydevd/pydevd_attach_to_process/winappdbg/win32/peb_teb.py -> build/bdist.macosx-14.0-arm64/wheel/./debugpy/_vendored/pydevd/pydevd_attach_to_process/winappdbg/win32819copying build/lib.macosx-14.0-arm64-cpython-314/debugpy/_vendored/pydevd/pydevd_attach_to_process/winappdbg/win32/version.py -> build/bdist.macosx-14.0-arm64/wheel/./debugpy/_vendored/pydevd/pydevd_attach_to_process/winappdbg/win32820copying build/lib.macosx-14.0-arm64-cpython-314/debugpy/_vendored/pydevd/pydevd_attach_to_process/winappdbg/win32/kernel32.py -> build/bdist.macosx-14.0-arm64/wheel/./debugpy/_vendored/pydevd/pydevd_attach_to_process/winappdbg/win32821copying build/lib.macosx-14.0-arm64-cpython-314/debugpy/_vendored/pydevd/pydevd_attach_to_process/winappdbg/win32/__init__.py -> build/bdist.macosx-14.0-arm64/wheel/./debugpy/_vendored/pydevd/pydevd_attach_to_process/winappdbg/win32822copying build/lib.macosx-14.0-arm64-cpython-314/debugpy/_vendored/pydevd/pydevd_attach_to_process/winappdbg/win32/user32.py -> build/bdist.macosx-14.0-arm64/wheel/./debugpy/_vendored/pydevd/pydevd_attach_to_process/winappdbg/win32823copying build/lib.macosx-14.0-arm64-cpython-314/debugpy/_vendored/pydevd/pydevd_attach_to_process/winappdbg/win32/psapi.py -> build/bdist.macosx-14.0-arm64/wheel/./debugpy/_vendored/pydevd/pydevd_attach_to_process/winappdbg/win32824copying build/lib.macosx-14.0-arm64-cpython-314/debugpy/_vendored/pydevd/pydevd_attach_to_process/winappdbg/win32/dbghelp.py -> build/bdist.macosx-14.0-arm64/wheel/./debugpy/_vendored/pydevd/pydevd_attach_to_process/winappdbg/win32825copying build/lib.macosx-14.0-arm64-cpython-314/debugpy/_vendored/pydevd/pydevd_attach_to_process/winappdbg/win32/defines.py -> build/bdist.macosx-14.0-arm64/wheel/./debugpy/_vendored/pydevd/pydevd_attach_to_process/winappdbg/win32826copying build/lib.macosx-14.0-arm64-cpython-314/debugpy/_vendored/pydevd/pydevd_attach_to_process/winappdbg/win32/shell32.py -> build/bdist.macosx-14.0-arm64/wheel/./debugpy/_vendored/pydevd/pydevd_attach_to_process/winappdbg/win32827copying build/lib.macosx-14.0-arm64-cpython-314/debugpy/_vendored/pydevd/pydevd_attach_to_process/winappdbg/win32/gdi32.py -> build/bdist.macosx-14.0-arm64/wheel/./debugpy/_vendored/pydevd/pydevd_attach_to_process/winappdbg/win32828copying build/lib.macosx-14.0-arm64-cpython-314/debugpy/_vendored/pydevd/pydevd_attach_to_process/winappdbg/win32/context_i386.py -> build/bdist.macosx-14.0-arm64/wheel/./debugpy/_vendored/pydevd/pydevd_attach_to_process/winappdbg/win32829copying build/lib.macosx-14.0-arm64-cpython-314/debugpy/_vendored/pydevd/pydevd_attach_to_process/winappdbg/win32/wtsapi32.py -> build/bdist.macosx-14.0-arm64/wheel/./debugpy/_vendored/pydevd/pydevd_attach_to_process/winappdbg/win32830copying build/lib.macosx-14.0-arm64-cpython-314/debugpy/_vendored/pydevd/pydevd_attach_to_process/winappdbg/win32/ntdll.py -> build/bdist.macosx-14.0-arm64/wheel/./debugpy/_vendored/pydevd/pydevd_attach_to_process/winappdbg/win32831copying build/lib.macosx-14.0-arm64-cpython-314/debugpy/_vendored/pydevd/pydevd_attach_to_process/winappdbg/win32/shlwapi.py -> build/bdist.macosx-14.0-arm64/wheel/./debugpy/_vendored/pydevd/pydevd_attach_to_process/winappdbg/win32832copying build/lib.macosx-14.0-arm64-cpython-314/debugpy/_vendored/pydevd/pydevd_attach_to_process/README.txt -> build/bdist.macosx-14.0-arm64/wheel/./debugpy/_vendored/pydevd/pydevd_attach_to_process833creating build/bdist.macosx-14.0-arm64/wheel/debugpy/_vendored/pydevd/pydevd_attach_to_process/windows834copying build/lib.macosx-14.0-arm64-cpython-314/debugpy/_vendored/pydevd/pydevd_attach_to_process/windows/stdafx.h -> build/bdist.macosx-14.0-arm64/wheel/./debugpy/_vendored/pydevd/pydevd_attach_to_process/windows835copying build/lib.macosx-14.0-arm64-cpython-314/debugpy/_vendored/pydevd/pydevd_attach_to_process/windows/inject_dll.cpp -> build/bdist.macosx-14.0-arm64/wheel/./debugpy/_vendored/pydevd/pydevd_attach_to_process/windows836copying build/lib.macosx-14.0-arm64-cpython-314/debugpy/_vendored/pydevd/pydevd_attach_to_process/windows/attach.h -> build/bdist.macosx-14.0-arm64/wheel/./debugpy/_vendored/pydevd/pydevd_attach_to_process/windows837copying build/lib.macosx-14.0-arm64-cpython-314/debugpy/_vendored/pydevd/pydevd_attach_to_process/windows/py_win_helpers.hpp -> build/bdist.macosx-14.0-arm64/wheel/./debugpy/_vendored/pydevd/pydevd_attach_to_process/windows838copying build/lib.macosx-14.0-arm64-cpython-314/debugpy/_vendored/pydevd/pydevd_attach_to_process/windows/attach.cpp -> build/bdist.macosx-14.0-arm64/wheel/./debugpy/_vendored/pydevd/pydevd_attach_to_process/windows839copying build/lib.macosx-14.0-arm64-cpython-314/debugpy/_vendored/pydevd/pydevd_attach_to_process/windows/targetver.h -> build/bdist.macosx-14.0-arm64/wheel/./debugpy/_vendored/pydevd/pydevd_attach_to_process/windows840copying build/lib.macosx-14.0-arm64-cpython-314/debugpy/_vendored/pydevd/pydevd_attach_to_process/windows/run_code_in_memory.hpp -> build/bdist.macosx-14.0-arm64/wheel/./debugpy/_vendored/pydevd/pydevd_attach_to_process/windows841copying build/lib.macosx-14.0-arm64-cpython-314/debugpy/_vendored/pydevd/pydevd_attach_to_process/windows/run_code_on_dllmain.cpp -> build/bdist.macosx-14.0-arm64/wheel/./debugpy/_vendored/pydevd/pydevd_attach_to_process/windows842copying build/lib.macosx-14.0-arm64-cpython-314/debugpy/_vendored/pydevd/pydevd_attach_to_process/windows/stdafx.cpp -> build/bdist.macosx-14.0-arm64/wheel/./debugpy/_vendored/pydevd/pydevd_attach_to_process/windows843copying build/lib.macosx-14.0-arm64-cpython-314/debugpy/_vendored/pydevd/pydevd_attach_to_process/windows/compile_windows.bat -> build/bdist.macosx-14.0-arm64/wheel/./debugpy/_vendored/pydevd/pydevd_attach_to_process/windows844copying build/lib.macosx-14.0-arm64-cpython-314/debugpy/_vendored/pydevd/pydevd_attach_to_process/attach_pydevd.py -> build/bdist.macosx-14.0-arm64/wheel/./debugpy/_vendored/pydevd/pydevd_attach_to_process845copying build/lib.macosx-14.0-arm64-cpython-314/debugpy/_vendored/pydevd/pydevd_attach_to_process/attach.dylib -> build/bdist.macosx-14.0-arm64/wheel/./debugpy/_vendored/pydevd/pydevd_attach_to_process846copying build/lib.macosx-14.0-arm64-cpython-314/debugpy/_vendored/pydevd/pydevd_attach_to_process/_test_attach_to_process_linux.py -> build/bdist.macosx-14.0-arm64/wheel/./debugpy/_vendored/pydevd/pydevd_attach_to_process847creating build/bdist.macosx-14.0-arm64/wheel/debugpy/_vendored/pydevd/pydevd_attach_to_process/linux_and_mac848copying build/lib.macosx-14.0-arm64-cpython-314/debugpy/_vendored/pydevd/pydevd_attach_to_process/linux_and_mac/compile_mac.sh -> build/bdist.macosx-14.0-arm64/wheel/./debugpy/_vendored/pydevd/pydevd_attach_to_process/linux_and_mac849copying build/lib.macosx-14.0-arm64-cpython-314/debugpy/_vendored/pydevd/pydevd_attach_to_process/linux_and_mac/attach.cpp -> build/bdist.macosx-14.0-arm64/wheel/./debugpy/_vendored/pydevd/pydevd_attach_to_process/linux_and_mac850copying build/lib.macosx-14.0-arm64-cpython-314/debugpy/_vendored/pydevd/pydevd_attach_to_process/linux_and_mac/.gitignore -> build/bdist.macosx-14.0-arm64/wheel/./debugpy/_vendored/pydevd/pydevd_attach_to_process/linux_and_mac851copying build/lib.macosx-14.0-arm64-cpython-314/debugpy/_vendored/pydevd/pydevd_attach_to_process/linux_and_mac/lldb_prepare.py -> build/bdist.macosx-14.0-arm64/wheel/./debugpy/_vendored/pydevd/pydevd_attach_to_process/linux_and_mac852copying build/lib.macosx-14.0-arm64-cpython-314/debugpy/_vendored/pydevd/pydevd_attach_to_process/linux_and_mac/compile_linux.sh -> build/bdist.macosx-14.0-arm64/wheel/./debugpy/_vendored/pydevd/pydevd_attach_to_process/linux_and_mac853copying build/lib.macosx-14.0-arm64-cpython-314/debugpy/_vendored/pydevd/pydevd_attach_to_process/linux_and_mac/compile_manylinux.cmd -> build/bdist.macosx-14.0-arm64/wheel/./debugpy/_vendored/pydevd/pydevd_attach_to_process/linux_and_mac854copying build/lib.macosx-14.0-arm64-cpython-314/debugpy/_vendored/pydevd/pydevd_attach_to_process/add_code_to_python_process.py.orig -> build/bdist.macosx-14.0-arm64/wheel/./debugpy/_vendored/pydevd/pydevd_attach_to_process855copying build/lib.macosx-14.0-arm64-cpython-314/debugpy/_vendored/pydevd/pydevd_attach_to_process/_always_live_program.py -> build/bdist.macosx-14.0-arm64/wheel/./debugpy/_vendored/pydevd/pydevd_attach_to_process856copying build/lib.macosx-14.0-arm64-cpython-314/debugpy/_vendored/pydevd/pydev_run_in_console.py -> build/bdist.macosx-14.0-arm64/wheel/./debugpy/_vendored/pydevd857copying build/lib.macosx-14.0-arm64-cpython-314/debugpy/_vendored/pydevd/pydevd.py -> build/bdist.macosx-14.0-arm64/wheel/./debugpy/_vendored/pydevd858creating build/bdist.macosx-14.0-arm64/wheel/debugpy/_vendored/pydevd/_pydevd_frame_eval859copying build/lib.macosx-14.0-arm64-cpython-314/debugpy/_vendored/pydevd/_pydevd_frame_eval/pydevd_frame_eval_cython_wrapper.py -> build/bdist.macosx-14.0-arm64/wheel/./debugpy/_vendored/pydevd/_pydevd_frame_eval860copying build/lib.macosx-14.0-arm64-cpython-314/debugpy/_vendored/pydevd/_pydevd_frame_eval/pydevd_frame_evaluator.c -> build/bdist.macosx-14.0-arm64/wheel/./debugpy/_vendored/pydevd/_pydevd_frame_eval861copying build/lib.macosx-14.0-arm64-cpython-314/debugpy/_vendored/pydevd/_pydevd_frame_eval/pydevd_frame_eval_main.py -> build/bdist.macosx-14.0-arm64/wheel/./debugpy/_vendored/pydevd/_pydevd_frame_eval862copying build/lib.macosx-14.0-arm64-cpython-314/debugpy/_vendored/pydevd/_pydevd_frame_eval/pydevd_frame_evaluator.template.pyx -> build/bdist.macosx-14.0-arm64/wheel/./debugpy/_vendored/pydevd/_pydevd_frame_eval863copying build/lib.macosx-14.0-arm64-cpython-314/debugpy/_vendored/pydevd/_pydevd_frame_eval/__init__.py -> build/bdist.macosx-14.0-arm64/wheel/./debugpy/_vendored/pydevd/_pydevd_frame_eval864copying build/lib.macosx-14.0-arm64-cpython-314/debugpy/_vendored/pydevd/_pydevd_frame_eval/release_mem.h -> build/bdist.macosx-14.0-arm64/wheel/./debugpy/_vendored/pydevd/_pydevd_frame_eval865copying build/lib.macosx-14.0-arm64-cpython-314/debugpy/_vendored/pydevd/_pydevd_frame_eval/pydevd_modify_bytecode.py -> build/bdist.macosx-14.0-arm64/wheel/./debugpy/_vendored/pydevd/_pydevd_frame_eval866copying build/lib.macosx-14.0-arm64-cpython-314/debugpy/_vendored/pydevd/_pydevd_frame_eval/pydevd_frame_tracing.py -> build/bdist.macosx-14.0-arm64/wheel/./debugpy/_vendored/pydevd/_pydevd_frame_eval867copying build/lib.macosx-14.0-arm64-cpython-314/debugpy/_vendored/pydevd/_pydevd_frame_eval/.gitignore -> build/bdist.macosx-14.0-arm64/wheel/./debugpy/_vendored/pydevd/_pydevd_frame_eval868creating build/bdist.macosx-14.0-arm64/wheel/debugpy/_vendored/pydevd/_pydevd_frame_eval/vendored869copying build/lib.macosx-14.0-arm64-cpython-314/debugpy/_vendored/pydevd/_pydevd_frame_eval/vendored/__init__.py -> build/bdist.macosx-14.0-arm64/wheel/./debugpy/_vendored/pydevd/_pydevd_frame_eval/vendored870copying build/lib.macosx-14.0-arm64-cpython-314/debugpy/_vendored/pydevd/_pydevd_frame_eval/vendored/pydevd_fix_code.py -> build/bdist.macosx-14.0-arm64/wheel/./debugpy/_vendored/pydevd/_pydevd_frame_eval/vendored871creating build/bdist.macosx-14.0-arm64/wheel/debugpy/_vendored/pydevd/_pydevd_frame_eval/vendored/bytecode872copying build/lib.macosx-14.0-arm64-cpython-314/debugpy/_vendored/pydevd/_pydevd_frame_eval/vendored/bytecode/cfg.py -> build/bdist.macosx-14.0-arm64/wheel/./debugpy/_vendored/pydevd/_pydevd_frame_eval/vendored/bytecode873copying build/lib.macosx-14.0-arm64-cpython-314/debugpy/_vendored/pydevd/_pydevd_frame_eval/vendored/bytecode/concrete.py -> build/bdist.macosx-14.0-arm64/wheel/./debugpy/_vendored/pydevd/_pydevd_frame_eval/vendored/bytecode874copying build/lib.macosx-14.0-arm64-cpython-314/debugpy/_vendored/pydevd/_pydevd_frame_eval/vendored/bytecode/flags.py -> build/bdist.macosx-14.0-arm64/wheel/./debugpy/_vendored/pydevd/_pydevd_frame_eval/vendored/bytecode875creating build/bdist.macosx-14.0-arm64/wheel/debugpy/_vendored/pydevd/_pydevd_frame_eval/vendored/bytecode/tests876copying build/lib.macosx-14.0-arm64-cpython-314/debugpy/_vendored/pydevd/_pydevd_frame_eval/vendored/bytecode/tests/test_concrete.py -> build/bdist.macosx-14.0-arm64/wheel/./debugpy/_vendored/pydevd/_pydevd_frame_eval/vendored/bytecode/tests877copying build/lib.macosx-14.0-arm64-cpython-314/debugpy/_vendored/pydevd/_pydevd_frame_eval/vendored/bytecode/tests/test_instr.py -> build/bdist.macosx-14.0-arm64/wheel/./debugpy/_vendored/pydevd/_pydevd_frame_eval/vendored/bytecode/tests878copying build/lib.macosx-14.0-arm64-cpython-314/debugpy/_vendored/pydevd/_pydevd_frame_eval/vendored/bytecode/tests/test_misc.py -> build/bdist.macosx-14.0-arm64/wheel/./debugpy/_vendored/pydevd/_pydevd_frame_eval/vendored/bytecode/tests879copying build/lib.macosx-14.0-arm64-cpython-314/debugpy/_vendored/pydevd/_pydevd_frame_eval/vendored/bytecode/tests/test_peephole_opt.py -> build/bdist.macosx-14.0-arm64/wheel/./debugpy/_vendored/pydevd/_pydevd_frame_eval/vendored/bytecode/tests880copying build/lib.macosx-14.0-arm64-cpython-314/debugpy/_vendored/pydevd/_pydevd_frame_eval/vendored/bytecode/tests/test_code.py -> build/bdist.macosx-14.0-arm64/wheel/./debugpy/_vendored/pydevd/_pydevd_frame_eval/vendored/bytecode/tests881copying build/lib.macosx-14.0-arm64-cpython-314/debugpy/_vendored/pydevd/_pydevd_frame_eval/vendored/bytecode/tests/test_cfg.py -> build/bdist.macosx-14.0-arm64/wheel/./debugpy/_vendored/pydevd/_pydevd_frame_eval/vendored/bytecode/tests882copying build/lib.macosx-14.0-arm64-cpython-314/debugpy/_vendored/pydevd/_pydevd_frame_eval/vendored/bytecode/tests/__init__.py -> build/bdist.macosx-14.0-arm64/wheel/./debugpy/_vendored/pydevd/_pydevd_frame_eval/vendored/bytecode/tests883copying build/lib.macosx-14.0-arm64-cpython-314/debugpy/_vendored/pydevd/_pydevd_frame_eval/vendored/bytecode/tests/test_bytecode.py -> build/bdist.macosx-14.0-arm64/wheel/./debugpy/_vendored/pydevd/_pydevd_frame_eval/vendored/bytecode/tests884copying build/lib.macosx-14.0-arm64-cpython-314/debugpy/_vendored/pydevd/_pydevd_frame_eval/vendored/bytecode/tests/util_annotation.py -> build/bdist.macosx-14.0-arm64/wheel/./debugpy/_vendored/pydevd/_pydevd_frame_eval/vendored/bytecode/tests885copying build/lib.macosx-14.0-arm64-cpython-314/debugpy/_vendored/pydevd/_pydevd_frame_eval/vendored/bytecode/tests/test_flags.py -> build/bdist.macosx-14.0-arm64/wheel/./debugpy/_vendored/pydevd/_pydevd_frame_eval/vendored/bytecode/tests886copying build/lib.macosx-14.0-arm64-cpython-314/debugpy/_vendored/pydevd/_pydevd_frame_eval/vendored/bytecode/__init__.py -> build/bdist.macosx-14.0-arm64/wheel/./debugpy/_vendored/pydevd/_pydevd_frame_eval/vendored/bytecode887copying build/lib.macosx-14.0-arm64-cpython-314/debugpy/_vendored/pydevd/_pydevd_frame_eval/vendored/bytecode/instr.py -> build/bdist.macosx-14.0-arm64/wheel/./debugpy/_vendored/pydevd/_pydevd_frame_eval/vendored/bytecode888copying build/lib.macosx-14.0-arm64-cpython-314/debugpy/_vendored/pydevd/_pydevd_frame_eval/vendored/bytecode/peephole_opt.py -> build/bdist.macosx-14.0-arm64/wheel/./debugpy/_vendored/pydevd/_pydevd_frame_eval/vendored/bytecode889copying build/lib.macosx-14.0-arm64-cpython-314/debugpy/_vendored/pydevd/_pydevd_frame_eval/vendored/bytecode/bytecode.py -> build/bdist.macosx-14.0-arm64/wheel/./debugpy/_vendored/pydevd/_pydevd_frame_eval/vendored/bytecode890copying build/lib.macosx-14.0-arm64-cpython-314/debugpy/_vendored/pydevd/_pydevd_frame_eval/vendored/README.txt -> build/bdist.macosx-14.0-arm64/wheel/./debugpy/_vendored/pydevd/_pydevd_frame_eval/vendored891copying build/lib.macosx-14.0-arm64-cpython-314/debugpy/_vendored/pydevd/_pydevd_frame_eval/pydevd_frame_evaluator.pxd -> build/bdist.macosx-14.0-arm64/wheel/./debugpy/_vendored/pydevd/_pydevd_frame_eval892copying build/lib.macosx-14.0-arm64-cpython-314/debugpy/_vendored/pydevd/setup_pydevd_cython.py -> build/bdist.macosx-14.0-arm64/wheel/./debugpy/_vendored/pydevd893copying build/lib.macosx-14.0-arm64-cpython-314/debugpy/_vendored/pydevd/pydev_pysrc.py -> build/bdist.macosx-14.0-arm64/wheel/./debugpy/_vendored/pydevd894creating build/bdist.macosx-14.0-arm64/wheel/debugpy/_vendored/pydevd/pydev_sitecustomize895copying build/lib.macosx-14.0-arm64-cpython-314/debugpy/_vendored/pydevd/pydev_sitecustomize/__not_in_default_pythonpath.txt -> build/bdist.macosx-14.0-arm64/wheel/./debugpy/_vendored/pydevd/pydev_sitecustomize896copying build/lib.macosx-14.0-arm64-cpython-314/debugpy/_vendored/pydevd/pydev_sitecustomize/sitecustomize.py -> build/bdist.macosx-14.0-arm64/wheel/./debugpy/_vendored/pydevd/pydev_sitecustomize897copying build/lib.macosx-14.0-arm64-cpython-314/debugpy/_vendored/_pydevd_packaging.py -> build/bdist.macosx-14.0-arm64/wheel/./debugpy/_vendored898copying build/lib.macosx-14.0-arm64-cpython-314/debugpy/__main__.py -> build/bdist.macosx-14.0-arm64/wheel/./debugpy899running install_egg_info900running egg_info901writing src/debugpy.egg-info/PKG-INFO902writing dependency_links to src/debugpy.egg-info/dependency_links.txt903writing entry points to src/debugpy.egg-info/entry_points.txt904writing top-level names to src/debugpy.egg-info/top_level.txt905reading manifest file 'src/debugpy.egg-info/SOURCES.txt'906reading manifest template 'MANIFEST.in'907warning: no previously-included files matching '*.py[cdo]' found anywhere in distribution908adding license file 'LICENSE'909writing manifest file 'src/debugpy.egg-info/SOURCES.txt'910Copying src/debugpy.egg-info to build/bdist.macosx-14.0-arm64/wheel/./debugpy-1.8.22-py3.14.egg-info911running install_scripts912creating build/bdist.macosx-14.0-arm64/wheel/debugpy-1.8.22.dist-info/WHEEL913creating '/nix/var/nix/builds/nix-29371-2315062324/source/dist/.tmp-054ejswl/debugpy-1.8.22-cp314-cp314-macosx_14_0_arm64.whl' and adding 'build/bdist.macosx-14.0-arm64/wheel' to it914adding 'debugpy/ThirdPartyNotices.txt'915adding 'debugpy/__init__.py'916adding 'debugpy/__main__.py'917adding 'debugpy/_version.py'918adding 'debugpy/public_api.py'919adding 'debugpy/py.typed'920adding 'debugpy/_vendored/__init__.py'921adding 'debugpy/_vendored/_pydevd_packaging.py'922adding 'debugpy/_vendored/_util.py'923adding 'debugpy/_vendored/force_pydevd.py'924adding 'debugpy/_vendored/pydevd/pydev_app_engine_debug_startup.py'925adding 'debugpy/_vendored/pydevd/pydev_coverage.py'926adding 'debugpy/_vendored/pydevd/pydev_pysrc.py'927adding 'debugpy/_vendored/pydevd/pydev_run_in_console.py'928adding 'debugpy/_vendored/pydevd/pydevconsole.py'929adding 'debugpy/_vendored/pydevd/pydevd.py'930adding 'debugpy/_vendored/pydevd/pydevd_file_utils.py'931adding 'debugpy/_vendored/pydevd/pydevd_tracing.py'932adding 'debugpy/_vendored/pydevd/setup_pydevd_cython.py'933adding 'debugpy/_vendored/pydevd/_pydev_bundle/__init__.py'934adding 'debugpy/_vendored/pydevd/_pydev_bundle/_pydev_calltip_util.py'935adding 'debugpy/_vendored/pydevd/_pydev_bundle/_pydev_completer.py'936adding 'debugpy/_vendored/pydevd/_pydev_bundle/_pydev_execfile.py'937adding 'debugpy/_vendored/pydevd/_pydev_bundle/_pydev_filesystem_encoding.py'938adding 'debugpy/_vendored/pydevd/_pydev_bundle/_pydev_getopt.py'939adding 'debugpy/_vendored/pydevd/_pydev_bundle/_pydev_imports_tipper.py'940adding 'debugpy/_vendored/pydevd/_pydev_bundle/_pydev_jy_imports_tipper.py'941adding 'debugpy/_vendored/pydevd/_pydev_bundle/_pydev_log.py'942adding 'debugpy/_vendored/pydevd/_pydev_bundle/_pydev_saved_modules.py'943adding 'debugpy/_vendored/pydevd/_pydev_bundle/_pydev_sys_patch.py'944adding 'debugpy/_vendored/pydevd/_pydev_bundle/_pydev_tipper_common.py'945adding 'debugpy/_vendored/pydevd/_pydev_bundle/pydev_console_utils.py'946adding 'debugpy/_vendored/pydevd/_pydev_bundle/pydev_import_hook.py'947adding 'debugpy/_vendored/pydevd/_pydev_bundle/pydev_imports.py'948adding 'debugpy/_vendored/pydevd/_pydev_bundle/pydev_ipython_console.py'949adding 'debugpy/_vendored/pydevd/_pydev_bundle/pydev_ipython_console_011.py'950adding 'debugpy/_vendored/pydevd/_pydev_bundle/pydev_is_thread_alive.py'951adding 'debugpy/_vendored/pydevd/_pydev_bundle/pydev_localhost.py'952adding 'debugpy/_vendored/pydevd/_pydev_bundle/pydev_log.py'953adding 'debugpy/_vendored/pydevd/_pydev_bundle/pydev_monkey.py'954adding 'debugpy/_vendored/pydevd/_pydev_bundle/pydev_monkey_qt.py'955adding 'debugpy/_vendored/pydevd/_pydev_bundle/pydev_override.py'956adding 'debugpy/_vendored/pydevd/_pydev_bundle/pydev_umd.py'957adding 'debugpy/_vendored/pydevd/_pydev_bundle/pydev_versioncheck.py'958adding 'debugpy/_vendored/pydevd/_pydev_bundle/fsnotify/__init__.py'959adding 'debugpy/_vendored/pydevd/_pydev_runfiles/__init__.py'960adding 'debugpy/_vendored/pydevd/_pydev_runfiles/pydev_runfiles.py'961adding 'debugpy/_vendored/pydevd/_pydev_runfiles/pydev_runfiles_coverage.py'962adding 'debugpy/_vendored/pydevd/_pydev_runfiles/pydev_runfiles_nose.py'963adding 'debugpy/_vendored/pydevd/_pydev_runfiles/pydev_runfiles_parallel.py'964adding 'debugpy/_vendored/pydevd/_pydev_runfiles/pydev_runfiles_parallel_client.py'965adding 'debugpy/_vendored/pydevd/_pydev_runfiles/pydev_runfiles_pytest2.py'966adding 'debugpy/_vendored/pydevd/_pydev_runfiles/pydev_runfiles_unittest.py'967adding 'debugpy/_vendored/pydevd/_pydev_runfiles/pydev_runfiles_xml_rpc.py'968adding 'debugpy/_vendored/pydevd/_pydevd_bundle/__init__.py'969adding 'debugpy/_vendored/pydevd/_pydevd_bundle/pydevconsole_code.py'970adding 'debugpy/_vendored/pydevd/_pydevd_bundle/pydevd_additional_thread_info.py'971adding 'debugpy/_vendored/pydevd/_pydevd_bundle/pydevd_additional_thread_info_regular.py'972adding 'debugpy/_vendored/pydevd/_pydevd_bundle/pydevd_api.py'973adding 'debugpy/_vendored/pydevd/_pydevd_bundle/pydevd_breakpoints.py'974adding 'debugpy/_vendored/pydevd/_pydevd_bundle/pydevd_bytecode_utils.py'975adding 'debugpy/_vendored/pydevd/_pydevd_bundle/pydevd_bytecode_utils_py311.py'976adding 'debugpy/_vendored/pydevd/_pydevd_bundle/pydevd_code_to_source.py'977adding 'debugpy/_vendored/pydevd/_pydevd_bundle/pydevd_collect_bytecode_info.py'978adding 'debugpy/_vendored/pydevd/_pydevd_bundle/pydevd_comm.py'979adding 'debugpy/_vendored/pydevd/_pydevd_bundle/pydevd_comm_constants.py'980adding 'debugpy/_vendored/pydevd/_pydevd_bundle/pydevd_command_line_handling.py'981adding 'debugpy/_vendored/pydevd/_pydevd_bundle/pydevd_console.py'982adding 'debugpy/_vendored/pydevd/_pydevd_bundle/pydevd_constants.py'983adding 'debugpy/_vendored/pydevd/_pydevd_bundle/pydevd_custom_frames.py'984adding 'debugpy/_vendored/pydevd/_pydevd_bundle/pydevd_cython.c'985adding 'debugpy/_vendored/pydevd/_pydevd_bundle/pydevd_cython.cpython-314-darwin.so'986adding 'debugpy/_vendored/pydevd/_pydevd_bundle/pydevd_cython.pxd'987adding 'debugpy/_vendored/pydevd/_pydevd_bundle/pydevd_cython.pyx'988adding 'debugpy/_vendored/pydevd/_pydevd_bundle/pydevd_cython_wrapper.py'989adding 'debugpy/_vendored/pydevd/_pydevd_bundle/pydevd_daemon_thread.py'990adding 'debugpy/_vendored/pydevd/_pydevd_bundle/pydevd_defaults.py'991adding 'debugpy/_vendored/pydevd/_pydevd_bundle/pydevd_dont_trace.py'992adding 'debugpy/_vendored/pydevd/_pydevd_bundle/pydevd_dont_trace_files.py'993adding 'debugpy/_vendored/pydevd/_pydevd_bundle/pydevd_exec2.py'994adding 'debugpy/_vendored/pydevd/_pydevd_bundle/pydevd_extension_api.py'995adding 'debugpy/_vendored/pydevd/_pydevd_bundle/pydevd_extension_utils.py'996adding 'debugpy/_vendored/pydevd/_pydevd_bundle/pydevd_filtering.py'997adding 'debugpy/_vendored/pydevd/_pydevd_bundle/pydevd_frame.py'998adding 'debugpy/_vendored/pydevd/_pydevd_bundle/pydevd_frame_utils.py'999adding 'debugpy/_vendored/pydevd/_pydevd_bundle/pydevd_gevent_integration.py'1000adding 'debugpy/_vendored/pydevd/_pydevd_bundle/pydevd_import_class.py'1001adding 'debugpy/_vendored/pydevd/_pydevd_bundle/pydevd_io.py'1002adding 'debugpy/_vendored/pydevd/_pydevd_bundle/pydevd_json_debug_options.py'1003adding 'debugpy/_vendored/pydevd/_pydevd_bundle/pydevd_net_command.py'1004adding 'debugpy/_vendored/pydevd/_pydevd_bundle/pydevd_net_command_factory_json.py'1005adding 'debugpy/_vendored/pydevd/_pydevd_bundle/pydevd_net_command_factory_xml.py'1006adding 'debugpy/_vendored/pydevd/_pydevd_bundle/pydevd_plugin_utils.py'1007adding 'debugpy/_vendored/pydevd/_pydevd_bundle/pydevd_process_net_command.py'1008adding 'debugpy/_vendored/pydevd/_pydevd_bundle/pydevd_process_net_command_json.py'1009adding 'debugpy/_vendored/pydevd/_pydevd_bundle/pydevd_referrers.py'1010adding 'debugpy/_vendored/pydevd/_pydevd_bundle/pydevd_reload.py'1011adding 'debugpy/_vendored/pydevd/_pydevd_bundle/pydevd_resolver.py'1012adding 'debugpy/_vendored/pydevd/_pydevd_bundle/pydevd_runpy.py'1013adding 'debugpy/_vendored/pydevd/_pydevd_bundle/pydevd_safe_repr.py'1014adding 'debugpy/_vendored/pydevd/_pydevd_bundle/pydevd_save_locals.py'1015adding 'debugpy/_vendored/pydevd/_pydevd_bundle/pydevd_signature.py'1016adding 'debugpy/_vendored/pydevd/_pydevd_bundle/pydevd_source_mapping.py'1017adding 'debugpy/_vendored/pydevd/_pydevd_bundle/pydevd_stackless.py'1018adding 'debugpy/_vendored/pydevd/_pydevd_bundle/pydevd_suspended_frames.py'1019adding 'debugpy/_vendored/pydevd/_pydevd_bundle/pydevd_thread_lifecycle.py'1020adding 'debugpy/_vendored/pydevd/_pydevd_bundle/pydevd_timeout.py'1021adding 'debugpy/_vendored/pydevd/_pydevd_bundle/pydevd_trace_dispatch.py'1022adding 'debugpy/_vendored/pydevd/_pydevd_bundle/pydevd_trace_dispatch_regular.py'1023adding 'debugpy/_vendored/pydevd/_pydevd_bundle/pydevd_traceproperty.py'1024adding 'debugpy/_vendored/pydevd/_pydevd_bundle/pydevd_utils.py'1025adding 'debugpy/_vendored/pydevd/_pydevd_bundle/pydevd_vars.py'1026adding 'debugpy/_vendored/pydevd/_pydevd_bundle/pydevd_vm_type.py'1027adding 'debugpy/_vendored/pydevd/_pydevd_bundle/pydevd_xml.py'1028adding 'debugpy/_vendored/pydevd/_pydevd_bundle/_debug_adapter/__init__.py'1029adding 'debugpy/_vendored/pydevd/_pydevd_bundle/_debug_adapter/__main__pydevd_gen_debug_adapter_protocol.py'1030adding 'debugpy/_vendored/pydevd/_pydevd_bundle/_debug_adapter/debugProtocol.json'1031adding 'debugpy/_vendored/pydevd/_pydevd_bundle/_debug_adapter/debugProtocolCustom.json'1032adding 'debugpy/_vendored/pydevd/_pydevd_bundle/_debug_adapter/pydevd_base_schema.py'1033adding 'debugpy/_vendored/pydevd/_pydevd_bundle/_debug_adapter/pydevd_schema.py'1034adding 'debugpy/_vendored/pydevd/_pydevd_bundle/_debug_adapter/pydevd_schema_log.py'1035adding 'debugpy/_vendored/pydevd/_pydevd_bundle/pydevd_concurrency_analyser/__init__.py'1036adding 'debugpy/_vendored/pydevd/_pydevd_bundle/pydevd_concurrency_analyser/pydevd_concurrency_logger.py'1037adding 'debugpy/_vendored/pydevd/_pydevd_bundle/pydevd_concurrency_analyser/pydevd_thread_wrappers.py'1038adding 'debugpy/_vendored/pydevd/_pydevd_frame_eval/.gitignore'1039adding 'debugpy/_vendored/pydevd/_pydevd_frame_eval/__init__.py'1040adding 'debugpy/_vendored/pydevd/_pydevd_frame_eval/pydevd_frame_eval_cython_wrapper.py'1041adding 'debugpy/_vendored/pydevd/_pydevd_frame_eval/pydevd_frame_eval_main.py'1042adding 'debugpy/_vendored/pydevd/_pydevd_frame_eval/pydevd_frame_evaluator.c'1043adding 'debugpy/_vendored/pydevd/_pydevd_frame_eval/pydevd_frame_evaluator.pxd'1044adding 'debugpy/_vendored/pydevd/_pydevd_frame_eval/pydevd_frame_evaluator.template.pyx'1045adding 'debugpy/_vendored/pydevd/_pydevd_frame_eval/pydevd_frame_tracing.py'1046adding 'debugpy/_vendored/pydevd/_pydevd_frame_eval/pydevd_modify_bytecode.py'1047adding 'debugpy/_vendored/pydevd/_pydevd_frame_eval/release_mem.h'1048adding 'debugpy/_vendored/pydevd/_pydevd_frame_eval/vendored/README.txt'1049adding 'debugpy/_vendored/pydevd/_pydevd_frame_eval/vendored/__init__.py'1050adding 'debugpy/_vendored/pydevd/_pydevd_frame_eval/vendored/pydevd_fix_code.py'1051adding 'debugpy/_vendored/pydevd/_pydevd_frame_eval/vendored/bytecode/__init__.py'1052adding 'debugpy/_vendored/pydevd/_pydevd_frame_eval/vendored/bytecode/bytecode.py'1053adding 'debugpy/_vendored/pydevd/_pydevd_frame_eval/vendored/bytecode/cfg.py'1054adding 'debugpy/_vendored/pydevd/_pydevd_frame_eval/vendored/bytecode/concrete.py'1055adding 'debugpy/_vendored/pydevd/_pydevd_frame_eval/vendored/bytecode/flags.py'1056adding 'debugpy/_vendored/pydevd/_pydevd_frame_eval/vendored/bytecode/instr.py'1057adding 'debugpy/_vendored/pydevd/_pydevd_frame_eval/vendored/bytecode/peephole_opt.py'1058adding 'debugpy/_vendored/pydevd/_pydevd_frame_eval/vendored/bytecode/tests/__init__.py'1059adding 'debugpy/_vendored/pydevd/_pydevd_frame_eval/vendored/bytecode/tests/test_bytecode.py'1060adding 'debugpy/_vendored/pydevd/_pydevd_frame_eval/vendored/bytecode/tests/test_cfg.py'1061adding 'debugpy/_vendored/pydevd/_pydevd_frame_eval/vendored/bytecode/tests/test_code.py'1062adding 'debugpy/_vendored/pydevd/_pydevd_frame_eval/vendored/bytecode/tests/test_concrete.py'1063adding 'debugpy/_vendored/pydevd/_pydevd_frame_eval/vendored/bytecode/tests/test_flags.py'1064adding 'debugpy/_vendored/pydevd/_pydevd_frame_eval/vendored/bytecode/tests/test_instr.py'1065adding 'debugpy/_vendored/pydevd/_pydevd_frame_eval/vendored/bytecode/tests/test_misc.py'1066adding 'debugpy/_vendored/pydevd/_pydevd_frame_eval/vendored/bytecode/tests/test_peephole_opt.py'1067adding 'debugpy/_vendored/pydevd/_pydevd_frame_eval/vendored/bytecode/tests/util_annotation.py'1068adding 'debugpy/_vendored/pydevd/_pydevd_sys_monitoring/_pydevd_sys_monitoring.py'1069adding 'debugpy/_vendored/pydevd/_pydevd_sys_monitoring/_pydevd_sys_monitoring_cython.c'1070adding 'debugpy/_vendored/pydevd/_pydevd_sys_monitoring/_pydevd_sys_monitoring_cython.cpython-314-darwin.so'1071adding 'debugpy/_vendored/pydevd/_pydevd_sys_monitoring/_pydevd_sys_monitoring_cython.pxd'1072adding 'debugpy/_vendored/pydevd/_pydevd_sys_monitoring/_pydevd_sys_monitoring_cython.pyx'1073adding 'debugpy/_vendored/pydevd/_pydevd_sys_monitoring/pydevd_sys_monitoring.py'1074adding 'debugpy/_vendored/pydevd/pydev_ipython/README'1075adding 'debugpy/_vendored/pydevd/pydev_ipython/__init__.py'1076adding 'debugpy/_vendored/pydevd/pydev_ipython/inputhook.py'1077adding 'debugpy/_vendored/pydevd/pydev_ipython/inputhookglut.py'1078adding 'debugpy/_vendored/pydevd/pydev_ipython/inputhookgtk.py'1079adding 'debugpy/_vendored/pydevd/pydev_ipython/inputhookgtk3.py'1080adding 'debugpy/_vendored/pydevd/pydev_ipython/inputhookpyglet.py'1081adding 'debugpy/_vendored/pydevd/pydev_ipython/inputhookqt4.py'1082adding 'debugpy/_vendored/pydevd/pydev_ipython/inputhookqt5.py'1083adding 'debugpy/_vendored/pydevd/pydev_ipython/inputhookqt6.py'1084adding 'debugpy/_vendored/pydevd/pydev_ipython/inputhooktk.py'1085adding 'debugpy/_vendored/pydevd/pydev_ipython/inputhookwx.py'1086adding 'debugpy/_vendored/pydevd/pydev_ipython/matplotlibtools.py'1087adding 'debugpy/_vendored/pydevd/pydev_ipython/qt.py'1088adding 'debugpy/_vendored/pydevd/pydev_ipython/qt_for_kernel.py'1089adding 'debugpy/_vendored/pydevd/pydev_ipython/qt_loaders.py'1090adding 'debugpy/_vendored/pydevd/pydev_ipython/version.py'1091adding 'debugpy/_vendored/pydevd/pydev_sitecustomize/__not_in_default_pythonpath.txt'1092adding 'debugpy/_vendored/pydevd/pydev_sitecustomize/sitecustomize.py'1093adding 'debugpy/_vendored/pydevd/pydevd_attach_to_process/README.txt'1094adding 'debugpy/_vendored/pydevd/pydevd_attach_to_process/_always_live_program.py'1095adding 'debugpy/_vendored/pydevd/pydevd_attach_to_process/_check.py'1096adding 'debugpy/_vendored/pydevd/pydevd_attach_to_process/_test_attach_to_process.py'1097adding 'debugpy/_vendored/pydevd/pydevd_attach_to_process/_test_attach_to_process_linux.py'1098adding 'debugpy/_vendored/pydevd/pydevd_attach_to_process/add_code_to_python_process.py'1099adding 'debugpy/_vendored/pydevd/pydevd_attach_to_process/add_code_to_python_process.py.orig'1100adding 'debugpy/_vendored/pydevd/pydevd_attach_to_process/attach.dylib'1101adding 'debugpy/_vendored/pydevd/pydevd_attach_to_process/attach_pydevd.py'1102adding 'debugpy/_vendored/pydevd/pydevd_attach_to_process/attach_script.py'1103adding 'debugpy/_vendored/pydevd/pydevd_attach_to_process/common/py_custom_pyeval_settrace.hpp'1104adding 'debugpy/_vendored/pydevd/pydevd_attach_to_process/common/py_custom_pyeval_settrace_310.hpp'1105adding 'debugpy/_vendored/pydevd/pydevd_attach_to_process/common/py_custom_pyeval_settrace_311.hpp'1106adding 'debugpy/_vendored/pydevd/pydevd_attach_to_process/common/py_custom_pyeval_settrace_common.hpp'1107adding 'debugpy/_vendored/pydevd/pydevd_attach_to_process/common/py_settrace.hpp'1108adding 'debugpy/_vendored/pydevd/pydevd_attach_to_process/common/py_utils.hpp'1109adding 'debugpy/_vendored/pydevd/pydevd_attach_to_process/common/py_version.hpp'1110adding 'debugpy/_vendored/pydevd/pydevd_attach_to_process/common/python.h'1111adding 'debugpy/_vendored/pydevd/pydevd_attach_to_process/common/ref_utils.hpp'1112adding 'debugpy/_vendored/pydevd/pydevd_attach_to_process/linux_and_mac/.gitignore'1113adding 'debugpy/_vendored/pydevd/pydevd_attach_to_process/linux_and_mac/attach.cpp'1114adding 'debugpy/_vendored/pydevd/pydevd_attach_to_process/linux_and_mac/compile_linux.sh'1115adding 'debugpy/_vendored/pydevd/pydevd_attach_to_process/linux_and_mac/compile_mac.sh'1116adding 'debugpy/_vendored/pydevd/pydevd_attach_to_process/linux_and_mac/compile_manylinux.cmd'1117adding 'debugpy/_vendored/pydevd/pydevd_attach_to_process/linux_and_mac/lldb_prepare.py'1118adding 'debugpy/_vendored/pydevd/pydevd_attach_to_process/winappdbg/__init__.py'1119adding 'debugpy/_vendored/pydevd/pydevd_attach_to_process/winappdbg/breakpoint.py'1120adding 'debugpy/_vendored/pydevd/pydevd_attach_to_process/winappdbg/compat.py'1121adding 'debugpy/_vendored/pydevd/pydevd_attach_to_process/winappdbg/crash.py'1122adding 'debugpy/_vendored/pydevd/pydevd_attach_to_process/winappdbg/debug.py'1123adding 'debugpy/_vendored/pydevd/pydevd_attach_to_process/winappdbg/disasm.py'1124adding 'debugpy/_vendored/pydevd/pydevd_attach_to_process/winappdbg/event.py'1125adding 'debugpy/_vendored/pydevd/pydevd_attach_to_process/winappdbg/interactive.py'1126adding 'debugpy/_vendored/pydevd/pydevd_attach_to_process/winappdbg/module.py'1127adding 'debugpy/_vendored/pydevd/pydevd_attach_to_process/winappdbg/process.py'1128adding 'debugpy/_vendored/pydevd/pydevd_attach_to_process/winappdbg/registry.py'1129adding 'debugpy/_vendored/pydevd/pydevd_attach_to_process/winappdbg/search.py'1130adding 'debugpy/_vendored/pydevd/pydevd_attach_to_process/winappdbg/sql.py'1131adding 'debugpy/_vendored/pydevd/pydevd_attach_to_process/winappdbg/system.py'1132adding 'debugpy/_vendored/pydevd/pydevd_attach_to_process/winappdbg/textio.py'1133adding 'debugpy/_vendored/pydevd/pydevd_attach_to_process/winappdbg/thread.py'1134adding 'debugpy/_vendored/pydevd/pydevd_attach_to_process/winappdbg/util.py'1135adding 'debugpy/_vendored/pydevd/pydevd_attach_to_process/winappdbg/window.py'1136adding 'debugpy/_vendored/pydevd/pydevd_attach_to_process/winappdbg/win32/__init__.py'1137adding 'debugpy/_vendored/pydevd/pydevd_attach_to_process/winappdbg/win32/advapi32.py'1138adding 'debugpy/_vendored/pydevd/pydevd_attach_to_process/winappdbg/win32/context_amd64.py'1139adding 'debugpy/_vendored/pydevd/pydevd_attach_to_process/winappdbg/win32/context_i386.py'1140adding 'debugpy/_vendored/pydevd/pydevd_attach_to_process/winappdbg/win32/dbghelp.py'1141adding 'debugpy/_vendored/pydevd/pydevd_attach_to_process/winappdbg/win32/defines.py'1142adding 'debugpy/_vendored/pydevd/pydevd_attach_to_process/winappdbg/win32/gdi32.py'1143adding 'debugpy/_vendored/pydevd/pydevd_attach_to_process/winappdbg/win32/kernel32.py'1144adding 'debugpy/_vendored/pydevd/pydevd_attach_to_process/winappdbg/win32/ntdll.py'1145adding 'debugpy/_vendored/pydevd/pydevd_attach_to_process/winappdbg/win32/peb_teb.py'1146adding 'debugpy/_vendored/pydevd/pydevd_attach_to_process/winappdbg/win32/psapi.py'1147adding 'debugpy/_vendored/pydevd/pydevd_attach_to_process/winappdbg/win32/shell32.py'1148adding 'debugpy/_vendored/pydevd/pydevd_attach_to_process/winappdbg/win32/shlwapi.py'1149adding 'debugpy/_vendored/pydevd/pydevd_attach_to_process/winappdbg/win32/user32.py'1150adding 'debugpy/_vendored/pydevd/pydevd_attach_to_process/winappdbg/win32/version.py'1151adding 'debugpy/_vendored/pydevd/pydevd_attach_to_process/winappdbg/win32/wtsapi32.py'1152adding 'debugpy/_vendored/pydevd/pydevd_attach_to_process/windows/attach.cpp'1153adding 'debugpy/_vendored/pydevd/pydevd_attach_to_process/windows/attach.h'1154adding 'debugpy/_vendored/pydevd/pydevd_attach_to_process/windows/compile_windows.bat'1155adding 'debugpy/_vendored/pydevd/pydevd_attach_to_process/windows/inject_dll.cpp'1156adding 'debugpy/_vendored/pydevd/pydevd_attach_to_process/windows/py_win_helpers.hpp'1157adding 'debugpy/_vendored/pydevd/pydevd_attach_to_process/windows/run_code_in_memory.hpp'1158adding 'debugpy/_vendored/pydevd/pydevd_attach_to_process/windows/run_code_on_dllmain.cpp'1159adding 'debugpy/_vendored/pydevd/pydevd_attach_to_process/windows/stdafx.cpp'1160adding 'debugpy/_vendored/pydevd/pydevd_attach_to_process/windows/stdafx.h'1161adding 'debugpy/_vendored/pydevd/pydevd_attach_to_process/windows/targetver.h'1162adding 'debugpy/_vendored/pydevd/pydevd_plugins/__init__.py'1163adding 'debugpy/_vendored/pydevd/pydevd_plugins/django_debug.py'1164adding 'debugpy/_vendored/pydevd/pydevd_plugins/jinja2_debug.py'1165adding 'debugpy/_vendored/pydevd/pydevd_plugins/pydevd_line_validation.py'1166adding 'debugpy/_vendored/pydevd/pydevd_plugins/extensions/README.md'1167adding 'debugpy/_vendored/pydevd/pydevd_plugins/extensions/__init__.py'1168adding 'debugpy/_vendored/pydevd/pydevd_plugins/extensions/types/__init__.py'1169adding 'debugpy/_vendored/pydevd/pydevd_plugins/extensions/types/pydevd_helpers.py'1170adding 'debugpy/_vendored/pydevd/pydevd_plugins/extensions/types/pydevd_plugin_numpy_types.py'1171adding 'debugpy/_vendored/pydevd/pydevd_plugins/extensions/types/pydevd_plugin_pandas_types.py'1172adding 'debugpy/_vendored/pydevd/pydevd_plugins/extensions/types/pydevd_plugins_django_form_str.py'1173adding 'debugpy/adapter/__init__.py'1174adding 'debugpy/adapter/__main__.py'1175adding 'debugpy/adapter/clients.py'1176adding 'debugpy/adapter/components.py'1177adding 'debugpy/adapter/launchers.py'1178adding 'debugpy/adapter/servers.py'1179adding 'debugpy/adapter/sessions.py'1180adding 'debugpy/common/__init__.py'1181adding 'debugpy/common/json.py'1182adding 'debugpy/common/log.py'1183adding 'debugpy/common/messaging.py'1184adding 'debugpy/common/singleton.py'1185adding 'debugpy/common/sockets.py'1186adding 'debugpy/common/stacks.py'1187adding 'debugpy/common/timestamp.py'1188adding 'debugpy/common/util.py'1189adding 'debugpy/launcher/__init__.py'1190adding 'debugpy/launcher/__main__.py'1191adding 'debugpy/launcher/debuggee.py'1192adding 'debugpy/launcher/handlers.py'1193adding 'debugpy/launcher/output.py'1194adding 'debugpy/launcher/winapi.py'1195adding 'debugpy/server/__init__.py'1196adding 'debugpy/server/api.py'1197adding 'debugpy/server/attach_pid_injected.py'1198adding 'debugpy/server/cli.py'1199adding 'debugpy-1.8.22.dist-info/licenses/LICENSE'1200adding 'debugpy-1.8.22.dist-info/METADATA'1201adding 'debugpy-1.8.22.dist-info/WHEEL'1202adding 'debugpy-1.8.22.dist-info/entry_points.txt'1203adding 'debugpy-1.8.22.dist-info/top_level.txt'1204adding 'debugpy-1.8.22.dist-info/RECORD'1205removing build/bdist.macosx-14.0-arm64/wheel1206Successfully built debugpy-1.8.22-cp314-cp314-macosx_14_0_arm64.whl1207Finished creating a wheel...1208Finished executing pypaBuildPhase
pythonRuntimeDepsCheckHook
1209Executing pythonRuntimeDepsCheck1210Checking runtime dependencies for debugpy-1.8.22-cp314-cp314-macosx_14_0_arm64.whl1211Finished executing pythonRuntimeDepsCheck
installPhase
1212Executing pypaInstallPhase1213/nix/store/y7prpv14kh2lcadn8m1bsll35n91qvca-python3.14-debugpy-1.8.22/lib/python3.14/site-packages/debugpy/_vendored/pydevd/_pydevd_frame_eval/vendored/bytecode/tests/test_cfg.py:694: SyntaxWarning: 'return' in a 'finally' block1214 return 21215/nix/store/y7prpv14kh2lcadn8m1bsll35n91qvca-python3.14-debugpy-1.8.22/lib/python3.14/site-packages/debugpy/_vendored/pydevd/_pydevd_frame_eval/vendored/bytecode/tests/test_cfg.py:694: SyntaxWarning: 'return' in a 'finally' block1216 return 21217/nix/store/y7prpv14kh2lcadn8m1bsll35n91qvca-python3.14-debugpy-1.8.22/lib/python3.14/site-packages/debugpy/_vendored/pydevd/pydevd_attach_to_process/winappdbg/event.py:1478: SyntaxWarning: 'return' in a 'finally' block1218 return method(event)1219/nix/store/y7prpv14kh2lcadn8m1bsll35n91qvca-python3.14-debugpy-1.8.22/lib/python3.14/site-packages/debugpy/_vendored/pydevd/pydevd_attach_to_process/winappdbg/event.py:1635: SyntaxWarning: 'return' in a 'finally' block1220 return super(EventSift, self).__call__(event)1221/nix/store/y7prpv14kh2lcadn8m1bsll35n91qvca-python3.14-debugpy-1.8.22/lib/python3.14/site-packages/debugpy/_vendored/pydevd/pydevd_attach_to_process/winappdbg/event.py:1478: SyntaxWarning: 'return' in a 'finally' block1222 return method(event)1223/nix/store/y7prpv14kh2lcadn8m1bsll35n91qvca-python3.14-debugpy-1.8.22/lib/python3.14/site-packages/debugpy/_vendored/pydevd/pydevd_attach_to_process/winappdbg/event.py:1635: SyntaxWarning: 'return' in a 'finally' block1224 return super(EventSift, self).__call__(event)1225Successfully installed debugpy-1.8.22-cp314-cp314-macosx_14_0_arm64.whl1226Finished executing pypaInstallPhase
pythonOutputDistPhase
1227Executing pythonOutputDistPhase1228Finished executing pythonOutputDistPhase
fixupPhase
1229checking for references to /nix/var/nix/builds/nix-29371-2315062324/ in /nix/store/y7prpv14kh2lcadn8m1bsll35n91qvca-python3.14-debugpy-1.8.22...1230patching script interpreter paths in /nix/store/y7prpv14kh2lcadn8m1bsll35n91qvca-python3.14-debugpy-1.8.221231stripping (with command strip and flags -S) in /nix/store/y7prpv14kh2lcadn8m1bsll35n91qvca-python3.14-debugpy-1.8.22/lib /nix/store/y7prpv14kh2lcadn8m1bsll35n91qvca-python3.14-debugpy-1.8.22/bin1232checking for references to /nix/var/nix/builds/nix-29371-2315062324/ in /nix/store/9a9ciyyjxs1m26lrwpr957w7p58x0r9m-python3.14-debugpy-1.8.22-dist...1233patching script interpreter paths in /nix/store/9a9ciyyjxs1m26lrwpr957w7p58x0r9m-python3.14-debugpy-1.8.22-dist1234Rewriting #!/nix/store/0kcws5blwbdyxqxjd1w8hjipz61xny3k-python3-3.14.7/bin/python3.14 to #!/nix/store/0kcws5blwbdyxqxjd1w8hjipz61xny3k-python3-3.14.71235wrapping `/nix/store/y7prpv14kh2lcadn8m1bsll35n91qvca-python3.14-debugpy-1.8.22/bin/debugpy'...1236Rewriting #!/nix/store/0kcws5blwbdyxqxjd1w8hjipz61xny3k-python3-3.14.7/bin/python3.14 to #!/nix/store/0kcws5blwbdyxqxjd1w8hjipz61xny3k-python3-3.14.71237wrapping `/nix/store/y7prpv14kh2lcadn8m1bsll35n91qvca-python3.14-debugpy-1.8.22/bin/debugpy-adapter'...1238Executing pythonRemoveTestsDir1239Finished executing pythonRemoveTestsDir
installCheckPhase
1240no Makefile or custom installCheckPhase, doing nothing
pythonImportsCheckPhase
1241Executing pythonImportsCheckPhase1242Check whether the following modules can be imported: debugpy
pythonMetadataCheckPhase
1243Executing pythonMetadataCheckPhase
pytestCheckPhase
1244Executing pytestCheckPhase1245pytest flags: -m pytest --deselect=tests/debugpy/test_breakpoints.py::test_error_in_condition\[program-attach_connect\(cli\)-\] --deselect=tests/debugpy/test_breakpoints.py::test_error_in_condition\[program-attach_connect\(cli\)-NameError\] -k not\ \(test_systemexit\) --numprocesses=101246============================= test session starts ==============================1247platform darwin -- Python 3.14.7, pytest-9.1.1, pluggy-1.6.01248Test environment for tests-3059512491250System paths:1251 sys.executable: /nix/store/0kcws5blwbdyxqxjd1w8hjipz61xny3k-python3-3.14.7/bin/python3.141252 sys.prefix: /nix/store/0kcws5blwbdyxqxjd1w8hjipz61xny3k-python3-3.14.71253 sys.base_prefix: /nix/store/0kcws5blwbdyxqxjd1w8hjipz61xny3k-python3-3.14.71254 sys.real_prefix: <missing>1255 site.getsitepackages(): /nix/store/0kcws5blwbdyxqxjd1w8hjipz61xny3k-python3-3.14.7/lib/python3.14/site-packages1256 site.getusersitepackages(): /homeless-shelter/.local/lib/python3.14/site-packages1257 sys.path (site-packages): /nix/store/0kcws5blwbdyxqxjd1w8hjipz61xny3k-python3-3.14.7/lib/python3.14/site-packages1258 /nix/store/20i35znndn7iph8z7k4yxs11idbkmiv3-python3.14-zope-event-6.2/lib/python3.14/site-packages1259 /nix/store/2j545dlbqc6sdw8y9gndjh3prkh8n41n-python3.14-untangle-1.2.1/lib/python3.14/site-packages1260 /nix/store/4hxh1in9crq6hra00gxgmvp7ji343ylb-python3.14-zope-interface-8.2/lib/python3.14/site-packages1261 /nix/store/5091q5r44zpnd6rw1kjs22kcj4vdmxhk-python3.14-wheel-0.47.0/lib/python3.14/site-packages1262 /nix/store/74zq072r6an64bf2b566hpwybz5zkzak-python3.14-requests-2.34.2/lib/python3.14/site-packages1263 /nix/store/7bqpmfvk7fx9brabg1nxcp3piy8cnz8y-python3.14-pluggy-1.6.0/lib/python3.14/site-packages1264 /nix/store/7qy7wypakv9mnh611g8y9ranm97ba9ag-python3.14-blinker-1.9.0/lib/python3.14/site-packages1265 /nix/store/85vnphw47agrh63k50gpdddanaqlnp9y-python3.14-toml-0.10.2/lib/python3.14/site-packages1266 /nix/store/97lzmzwww6852v6g9ryfzw8qwhy2m7x6-python3.14-importlib-metadata-9.0.0/lib/python3.14/site-packages1267 /nix/store/9j87lv531sgns2z7h3lw94si3i2r6lxb-python3.14-werkzeug-3.1.8/lib/python3.14/site-packages1268 /nix/store/ba65hwvsf1h1r3mw000rrbvfsxz42pq6-python3.14-packaging-26.2/lib/python3.14/site-packages1269 /nix/store/bjb6h5pk5s113xbjwcigfb83dvf0slvq-python3.14-iniconfig-2.3.0/lib/python3.14/site-packages1270 /nix/store/bz4jpm9ymk9izfr10m6vsgcwkwazs0kl-python3.14-zipp-4.1.0/lib/python3.14/site-packages1271 /nix/store/c02kixk5ajbwfbjgadwjjfdibzjxrn8i-python3.14-idna-3.18/lib/python3.14/site-packages1272 /nix/store/caszxfy8nx27pqg3w8ays83zvhbd5j9s-python3.14-django-5.2.17/lib/python3.14/site-packages1273 /nix/store/cp1hsk9pigafw8kz9xpa6s697019hlq1-python3.14-pytest-9.1.1/lib/python3.14/site-packages1274 /nix/store/cp6vhcyg8bna8rrmnamn75ii070diafk-python3.14-setuptools-83.0.0/lib/python3.14/site-packages1275 /nix/store/d2piwcslcxljsvysrk6ch98nn8xnbh59-python3.14-pytest-xdist-3.8.0/lib/python3.14/site-packages1276 /nix/store/d91i6xz58an9gmdr1by5ys7xvr5h71rr-python3.14-pytest-timeout-2.4.0/lib/python3.14/site-packages1277 /nix/store/d9vwz61z77vhxwiffddzz6nj7vydaljq-python3.14-click-8.3.3/lib/python3.14/site-packages1278 /nix/store/fkf50zy6m3n4jvjwfm9mskzg1gph2b4c-python3.14-certifi-2026.06.17/lib/python3.14/site-packages1279 /nix/store/hzd5qaminw1yrvc7qh520zwjqr178kgl-python3.14-itsdangerous-2.2.0/lib/python3.14/site-packages1280 /nix/store/i34mr7yqggjms48pmy67i8j8c783w3gr-python3.14-execnet-2.1.2/lib/python3.14/site-packages1281 /nix/store/iwgcrsrp4xzfwjbm94b6dcx1hqb62ynd-python3.14-sqlparse-0.5.5/lib/python3.14/site-packages1282 /nix/store/jlj0pis39mjd0kc8k5kvi66z28ndywmy-python3.14-defusedxml-0.8.0rc2/lib/python3.14/site-packages1283 /nix/store/kk7lnnik9h8v0cnfid3vhv7kmnqivfp8-python3.14-pygments-2.20.0/lib/python3.14/site-packages1284 /nix/store/lcb9p8fdakcgn2i7kgnckgqbxp1fhkmm-python3.14-installer-1.0.1/lib/python3.14/site-packages1285 /nix/store/lngpa3jfgidz0vnrvkrnq0xga0zf9m4i-python3.14-numpy-2.5.2/lib/python3.14/site-packages1286 /nix/store/lqfmy241n92565i3mv4ygb3f49qqbsq2-python3.14-psutil-7.2.2/lib/python3.14/site-packages1287 /nix/store/ms2br5kc6xnqv43zp7bb24f1mdgp5l9w-python3.14-typing-extensions-4.16.0/lib/python3.14/site-packages1288 /nix/store/n45w3jzma66k1zwgb07yly89r4bfzn1f-python3.14-greenlet-3.5.3/lib/python3.14/site-packages1289 /nix/store/q2jzqwbiwn2mh56yj9i7k4vzgb76a6di-python3.14-markupsafe-3.0.3/lib/python3.14/site-packages1290 /nix/store/rcn988r1cbqgrjj20ahrlck4q6k81wzm-python3.14-gevent-26.5.0/lib/python3.14/site-packages1291 /nix/store/rxrgpnhq3r0p02jbkmyg4803dmwx2v3w-python3.14-asgiref-3.11.1/lib/python3.14/site-packages1292 /nix/store/vijxivrfq230srkvk50c60lmvcn2p8qw-python3.14-urllib3-2.7.0/lib/python3.14/site-packages1293 /nix/store/vqf29cbb44a8z9zlb851bdmj33ib3z6h-python3.14-charset-normalizer-3.4.9/lib/python3.14/site-packages1294 /nix/store/wn6avf8rlnvdrxmsnlfzx6f5f8a5cd9n-python3.14-jinja2-3.1.6/lib/python3.14/site-packages1295 /nix/store/wyqviadnca4iymkwpc33ji8pvn60g0j5-python3.14-flask-3.1.3/lib/python3.14/site-packages1296 /nix/store/x2mgrdgcb51jrrjy64jrkrxjr40sns8m-python3.14-pytest-retry-1.7.0/lib/python3.14/site-packages1297 /nix/store/y7prpv14kh2lcadn8m1bsll35n91qvca-python3.14-debugpy-1.8.22/lib/python3.14/site-packages1298 sysconfig.get_path('stdlib'): /nix/store/0kcws5blwbdyxqxjd1w8hjipz61xny3k-python3-3.14.7/lib/python3.141299 sysconfig.get_path('platstdlib'): /nix/store/0kcws5blwbdyxqxjd1w8hjipz61xny3k-python3-3.14.7/lib/python3.141300 sysconfig.get_path('purelib'): /nix/store/0kcws5blwbdyxqxjd1w8hjipz61xny3k-python3-3.14.7/lib/python3.14/site-packages1301 sysconfig.get_path('platlib'): /nix/store/0kcws5blwbdyxqxjd1w8hjipz61xny3k-python3-3.14.7/lib/python3.14/site-packages1302 sysconfig.get_path('include'): /nix/store/0kcws5blwbdyxqxjd1w8hjipz61xny3k-python3-3.14.7/include/python3.141303 sysconfig.get_path('scripts'): /nix/store/0kcws5blwbdyxqxjd1w8hjipz61xny3k-python3-3.14.7/bin1304 sysconfig.get_path('data'): /nix/store/0kcws5blwbdyxqxjd1w8hjipz61xny3k-python3-3.14.71305 os.__file__: /nix/store/0kcws5blwbdyxqxjd1w8hjipz61xny3k-python3-3.14.7/lib/python3.14/os.py1306 threading.__file__: /nix/store/0kcws5blwbdyxqxjd1w8hjipz61xny3k-python3-3.14.7/lib/python3.14/threading.py1307 debugpy.__file__: /nix/store/y7prpv14kh2lcadn8m1bsll35n91qvca-python3.14-debugpy-1.8.22/lib/python3.14/site-packages/debugpy/__init__.py13081309Installed packages:1310 debugpy==1.8.221311 wheel==0.47.01312 packaging==26.21313 installer==1.0.11314 setuptools==83.0.01315 pytest==9.1.11316 iniconfig==2.3.01317 pluggy==1.6.01318 Pygments==2.20.01319 pytest-xdist==3.8.01320 execnet==2.1.21321 pytest-timeout==2.4.01322 pytest-retry==1.7.01323 importlib_metadata==9.0.01324 toml==0.10.21325 zipp==4.1.01326 psutil==7.2.21327 untangle==1.2.11328 defusedxml==0.8.0rc21329 Django==5.2.171330 asgiref==3.11.11331 typing_extensions==4.16.01332 sqlparse==0.5.51333 Flask==3.1.31334 click==8.3.31335 blinker==1.9.01336 itsdangerous==2.2.01337 Jinja2==3.1.61338 MarkupSafe==3.0.31339 Werkzeug==3.1.81340 gevent==26.5.01341 zope.event==6.21342 zope.interface==8.21343 greenlet==3.5.31344 numpy==2.5.21345 requests==2.34.21346 certifi==2026.6.171347 charset-normalizer==3.4.91348 idna==3.181349 urllib3==2.7.01350rootdir: /nix/var/nix/builds/nix-29371-2315062324/source1351configfile: pytest.ini1352testpaths: tests1353plugins: xdist-3.8.0, timeout-2.4.0, retry-1.7.01354timeout: 120.0s1355timeout method: thread1356timeout func_only: False135710 workers [1092 items] 1358ssssssss.................................F.............................. [ 6%]1359.....................sss...........ss.................................ss [ 13%]1360s....................................................................... [ 19%]1361......sss.......................................................ssssssss [ 26%]1362........................................ss.............s................ [ 32%]1363....................ss......ss.............ss........................... [ 39%]1364....ss......ss.............ss.........................................ss [ 46%]1365.....ss..ss.............s.........s..........ss.......ss......ss........ [ 52%]1366.....................s........................s..................s.....s [ 59%]1367..........s.s............ss.......s..................s.................. [ 65%]1368.s.............ssssssssssssssss....................s.sss......ss........ [ 72%]1369..................s.......................s.......s.....s..s............ [ 79%]1370..............ss.....................................s..............ssss [ 85%]1371sss..sssss.s..s.ssss..sssss.....s.....s........sss..............s....... [ 92%]1372........................................................................ [ 98%]1373............ [100%]1374=================================== FAILURES ===================================1375______________________________ test_lldb_command _______________________________1376[gw1] darwin -- Python 3.14.7 /nix/store/0kcws5blwbdyxqxjd1w8hjipz61xny3k-python3-3.14.7/bin/python3.1413771378acpp = <module 'add_code_to_python_process_under_test' from '/nix/store/y7prpv14kh2lcadn8m1bsll35n91qvca-python3.14-debugpy-1.8.22/lib/python3.14/site-packages/debugpy/_vendored/pydevd/pydevd_attach_to_process/add_code_to_python_process.py'>13791380 def test_lldb_command(acpp):1381 target_dll = "/some/where/attach_linux_amd64.so"1382 lldb_prepare = os.path.normpath(1383 os.path.join(ATTACH_TO_PROCESS_DIR, "linux_and_mac", "lldb_prepare.py")1384 )1385 assert os.path.exists(lldb_prepare)1386 1387 with mock.patch.object(acpp, "get_target_filename", return_value=target_dll):1388 with mock.patch.object(acpp.subprocess, "check_call") as check_call:1389 acpp._run_python_code_lldb(4242, "print(1)", "not found", show_debug_info=7)1390 1391 check_call.assert_called_once()1392 (cmd,), kwargs = check_call.call_args1393 assert kwargs["shell"]1394 1395> assert cmd.startswith("lldb --no-lldbinit --script-language Python ")1396E assert False1397E + where False = <built-in method startswith of str object at 0x1071a1440>('lldb --no-lldbinit --script-language Python ')1398E + where <built-in method startswith of str object at 0x1071a1440> = '/nix/store/yja9vfwqsq8y2mlxssvdal4niy5516c5-lldb-21.1.8/bin/lldb --no-lldbinit --script-language Python -o \'process ...attach "/some/where/attach_linux_amd64.so" 0 "print(1)" 7\' -o \'process detach\' -o \'script import os; os._exit(0)\''.startswith13991400tests/debugpy/server/test_add_code_to_python_process.py:120: AssertionError1401---------------------------- Captured stdout setup -----------------------------140214031404---------------------------- Captured stderr setup -----------------------------1405I+00.021: Also logging to "/nix/var/nix/builds/nix-29371-2315062324/source/tests/_logs/3.14-64/tests/debugpy/server/test_add_code_to_python_process.py/test_lldb_command_gw1/tests-30599.log".14061407I+00.000: tests/debugpy/server/test_add_code_to_python_process.py::test_lldb_command started.14081409I+00.019: Environment:1410 1411 System paths:1412 sys.executable: /nix/store/0kcws5blwbdyxqxjd1w8hjipz61xny3k-python3-3.14.7/bin/python3.141413 sys.prefix: /nix/store/0kcws5blwbdyxqxjd1w8hjipz61xny3k-python3-3.14.71414 sys.base_prefix: /nix/store/0kcws5blwbdyxqxjd1w8hjipz61xny3k-python3-3.14.71415 sys.real_prefix: <missing>1416 site.getsitepackages(): /nix/store/0kcws5blwbdyxqxjd1w8hjipz61xny3k-python3-3.14.7/lib/python3.14/site-packages1417 site.getusersitepackages(): /homeless-shelter/.local/lib/python3.14/site-packages1418 sys.path (site-packages): /nix/store/0kcws5blwbdyxqxjd1w8hjipz61xny3k-python3-3.14.7/lib/python3.14/site-packages1419 /nix/store/20i35znndn7iph8z7k4yxs11idbkmiv3-python3.14-zope-event-6.2/lib/python3.14/site-packages1420 /nix/store/2j545dlbqc6sdw8y9gndjh3prkh8n41n-python3.14-untangle-1.2.1/lib/python3.14/site-packages1421 /nix/store/4hxh1in9crq6hra00gxgmvp7ji343ylb-python3.14-zope-interface-8.2/lib/python3.14/site-packages1422 /nix/store/5091q5r44zpnd6rw1kjs22kcj4vdmxhk-python3.14-wheel-0.47.0/lib/python3.14/site-packages1423 /nix/store/74zq072r6an64bf2b566hpwybz5zkzak-python3.14-requests-2.34.2/lib/python3.14/site-packages1424 /nix/store/7bqpmfvk7fx9brabg1nxcp3piy8cnz8y-python3.14-pluggy-1.6.0/lib/python3.14/site-packages1425 /nix/store/7qy7wypakv9mnh611g8y9ranm97ba9ag-python3.14-blinker-1.9.0/lib/python3.14/site-packages1426 /nix/store/85vnphw47agrh63k50gpdddanaqlnp9y-python3.14-toml-0.10.2/lib/python3.14/site-packages1427 /nix/store/97lzmzwww6852v6g9ryfzw8qwhy2m7x6-python3.14-importlib-metadata-9.0.0/lib/python3.14/site-packages1428 /nix/store/9j87lv531sgns2z7h3lw94si3i2r6lxb-python3.14-werkzeug-3.1.8/lib/python3.14/site-packages1429 /nix/store/ba65hwvsf1h1r3mw000rrbvfsxz42pq6-python3.14-packaging-26.2/lib/python3.14/site-packages1430 /nix/store/bjb6h5pk5s113xbjwcigfb83dvf0slvq-python3.14-iniconfig-2.3.0/lib/python3.14/site-packages1431 /nix/store/bz4jpm9ymk9izfr10m6vsgcwkwazs0kl-python3.14-zipp-4.1.0/lib/python3.14/site-packages1432 /nix/store/c02kixk5ajbwfbjgadwjjfdibzjxrn8i-python3.14-idna-3.18/lib/python3.14/site-packages1433 /nix/store/caszxfy8nx27pqg3w8ays83zvhbd5j9s-python3.14-django-5.2.17/lib/python3.14/site-packages1434 /nix/store/cp1hsk9pigafw8kz9xpa6s697019hlq1-python3.14-pytest-9.1.1/lib/python3.14/site-packages1435 /nix/store/cp6vhcyg8bna8rrmnamn75ii070diafk-python3.14-setuptools-83.0.0/lib/python3.14/site-packages1436 /nix/store/d2piwcslcxljsvysrk6ch98nn8xnbh59-python3.14-pytest-xdist-3.8.0/lib/python3.14/site-packages1437 /nix/store/d91i6xz58an9gmdr1by5ys7xvr5h71rr-python3.14-pytest-timeout-2.4.0/lib/python3.14/site-packages1438 /nix/store/d9vwz61z77vhxwiffddzz6nj7vydaljq-python3.14-click-8.3.3/lib/python3.14/site-packages1439 /nix/store/fkf50zy6m3n4jvjwfm9mskzg1gph2b4c-python3.14-certifi-2026.06.17/lib/python3.14/site-packages1440 /nix/store/hzd5qaminw1yrvc7qh520zwjqr178kgl-python3.14-itsdangerous-2.2.0/lib/python3.14/site-packages1441 /nix/store/i34mr7yqggjms48pmy67i8j8c783w3gr-python3.14-execnet-2.1.2/lib/python3.14/site-packages1442 /nix/store/iwgcrsrp4xzfwjbm94b6dcx1hqb62ynd-python3.14-sqlparse-0.5.5/lib/python3.14/site-packages1443 /nix/store/jlj0pis39mjd0kc8k5kvi66z28ndywmy-python3.14-defusedxml-0.8.0rc2/lib/python3.14/site-packages1444 /nix/store/kk7lnnik9h8v0cnfid3vhv7kmnqivfp8-python3.14-pygments-2.20.0/lib/python3.14/site-packages1445 /nix/store/lcb9p8fdakcgn2i7kgnckgqbxp1fhkmm-python3.14-installer-1.0.1/lib/python3.14/site-packages1446 /nix/store/lngpa3jfgidz0vnrvkrnq0xga0zf9m4i-python3.14-numpy-2.5.2/lib/python3.14/site-packages1447 /nix/store/lqfmy241n92565i3mv4ygb3f49qqbsq2-python3.14-psutil-7.2.2/lib/python3.14/site-packages1448 /nix/store/ms2br5kc6xnqv43zp7bb24f1mdgp5l9w-python3.14-typing-extensions-4.16.0/lib/python3.14/site-packages1449 /nix/store/n45w3jzma66k1zwgb07yly89r4bfzn1f-python3.14-greenlet-3.5.3/lib/python3.14/site-packages1450 /nix/store/q2jzqwbiwn2mh56yj9i7k4vzgb76a6di-python3.14-markupsafe-3.0.3/lib/python3.14/site-packages1451 /nix/store/rcn988r1cbqgrjj20ahrlck4q6k81wzm-python3.14-gevent-26.5.0/lib/python3.14/site-packages1452 /nix/store/rxrgpnhq3r0p02jbkmyg4803dmwx2v3w-python3.14-asgiref-3.11.1/lib/python3.14/site-packages1453 /nix/store/vijxivrfq230srkvk50c60lmvcn2p8qw-python3.14-urllib3-2.7.0/lib/python3.14/site-packages1454 /nix/store/vqf29cbb44a8z9zlb851bdmj33ib3z6h-python3.14-charset-normalizer-3.4.9/lib/python3.14/site-packages1455 /nix/store/wn6avf8rlnvdrxmsnlfzx6f5f8a5cd9n-python3.14-jinja2-3.1.6/lib/python3.14/site-packages1456 /nix/store/wyqviadnca4iymkwpc33ji8pvn60g0j5-python3.14-flask-3.1.3/lib/python3.14/site-packages1457 /nix/store/x2mgrdgcb51jrrjy64jrkrxjr40sns8m-python3.14-pytest-retry-1.7.0/lib/python3.14/site-packages1458 /nix/store/y7prpv14kh2lcadn8m1bsll35n91qvca-python3.14-debugpy-1.8.22/lib/python3.14/site-packages1459 sysconfig.get_path('stdlib'): /nix/store/0kcws5blwbdyxqxjd1w8hjipz61xny3k-python3-3.14.7/lib/python3.141460 sysconfig.get_path('platstdlib'): /nix/store/0kcws5blwbdyxqxjd1w8hjipz61xny3k-python3-3.14.7/lib/python3.141461 sysconfig.get_path('purelib'): /nix/store/0kcws5blwbdyxqxjd1w8hjipz61xny3k-python3-3.14.7/lib/python3.14/site-packages1462 sysconfig.get_path('platlib'): /nix/store/0kcws5blwbdyxqxjd1w8hjipz61xny3k-python3-3.14.7/lib/python3.14/site-packages1463 sysconfig.get_path('include'): /nix/store/0kcws5blwbdyxqxjd1w8hjipz61xny3k-python3-3.14.7/include/python3.141464 sysconfig.get_path('scripts'): /nix/store/0kcws5blwbdyxqxjd1w8hjipz61xny3k-python3-3.14.7/bin1465 sysconfig.get_path('data'): /nix/store/0kcws5blwbdyxqxjd1w8hjipz61xny3k-python3-3.14.71466 os.__file__: /nix/store/0kcws5blwbdyxqxjd1w8hjipz61xny3k-python3-3.14.7/lib/python3.14/os.py1467 threading.__file__: /nix/store/0kcws5blwbdyxqxjd1w8hjipz61xny3k-python3-3.14.7/lib/python3.14/threading.py1468 debugpy.__file__: /nix/store/y7prpv14kh2lcadn8m1bsll35n91qvca-python3.14-debugpy-1.8.22/lib/python3.14/site-packages/debugpy/__init__.py1469 1470 Installed packages:1471 debugpy==1.8.221472 wheel==0.47.01473 packaging==26.21474 installer==1.0.11475 setuptools==83.0.01476 pytest==9.1.11477 iniconfig==2.3.01478 pluggy==1.6.01479 Pygments==2.20.01480 pytest-xdist==3.8.01481 execnet==2.1.21482 pytest-timeout==2.4.01483 pytest-retry==1.7.01484 importlib_metadata==9.0.01485 toml==0.10.21486 zipp==4.1.01487 psutil==7.2.21488 untangle==1.2.11489 defusedxml==0.8.0rc21490 Django==5.2.171491 asgiref==3.11.11492 typing_extensions==4.16.01493 sqlparse==0.5.51494 Flask==3.1.31495 click==8.3.31496 blinker==1.9.01497 itsdangerous==2.2.01498 Jinja2==3.1.61499 MarkupSafe==3.0.31500 Werkzeug==3.1.81501 gevent==26.5.01502 zope.event==6.21503 zope.interface==8.21504 greenlet==3.5.31505 numpy==2.5.21506 requests==2.34.21507 certifi==2026.6.171508 charset-normalizer==3.4.91509 idna==3.181510 urllib3==2.7.015111512----------------------------- Captured stdout call -----------------------------1513Running: /nix/store/yja9vfwqsq8y2mlxssvdal4niy5516c5-lldb-21.1.8/bin/lldb --no-lldbinit --script-language Python -o 'process attach --pid 4242' -o 'command script import "/nix/store/y7prpv14kh2lcadn8m1bsll35n91qvca-python3.14-debugpy-1.8.22/lib/python3.14/site-packages/debugpy/_vendored/pydevd/pydevd_attach_to_process/linux_and_mac/lldb_prepare.py"' -o 'load_lib_and_attach "/some/where/attach_linux_amd64.so" 0 "print(1)" 7' -o 'process detach' -o 'script import os; os._exit(0)'1514--------------------------- Captured stderr teardown ---------------------------1515I+00.043: pytest setup phase for tests/debugpy/server/test_add_code_to_python_process.py::test_lldb_command passed.15161517E+00.043: pytest call phase for tests/debugpy/server/test_add_code_to_python_process.py::test_lldb_command failed.15181519I+00.043: Dumping logs from "/nix/var/nix/builds/nix-29371-2315062324/source/tests/_logs/3.14-64/tests/debugpy/server/test_add_code_to_python_process.py/test_lldb_command_gw1"15201521I+00.043: Not logging to "/nix/var/nix/builds/nix-29371-2315062324/source/tests/_logs/3.14-64/tests/debugpy/server/test_add_code_to_python_process.py/test_lldb_command_gw1/tests-30599.log" anymore.15221523=============================== warnings summary ===============================1524tests/watchdog/worker.py:1271525 /nix/var/nix/builds/nix-29371-2315062324/source/tests/watchdog/worker.py:127: SyntaxWarning: 'return' in a 'finally' block1526 return15271528-- Docs: https://docs.pytest.org/en/stable/how-to/capture-warnings.html1529=========================== short test summary info ============================1530FAILED tests/debugpy/server/test_add_code_to_python_process.py::test_lldb_command - assert False1531====== 1 failed, 965 passed, 126 skipped, 1 warning in 245.88s (0:04:05) =======15320.00s - Debugger warning: It seems that frozen modules are being used, which may15330.00s - make the debugger miss breakpoints. Please pass -Xfrozen_modules=off15340.00s - to python to disable frozen modules.15350.00s - Note: Debugging will proceed. Set PYDEVD_DISABLE_FILE_VALIDATION=1 to disable this validation.1536I+00.435: Allocated port 5678 for worker 015371538I+00.435: Allocated port 5679 for worker 015391540I+00.440: debugpy and pydevd logs will be under /nix/var/nix/builds/nix-29371-2315062324/source/tests/_logs/3.14-641541