nixbot

builds

clan/clan-community build #190 failed

branch 26.05 · PR #198 · commit e421328946 · · took 17m 52s · eval 1m 4s

eval warnings 1 kind · 1 occurrence
  • warn Dependency of package 'nix-unit' uses a nested list in attribute 'nativeBuildInputs'. ×1

8 failed
failed attributes
status attribute duration
failed checks.aarch64-linux.authelia 2m 51s
container-test-run-authelia: Status: "loading new config: loading http app module: provision http: getting tls app: loading tls app module: provision tls: …
container-test-run-authelia:
     Status: "loading new config: loading http app module: provision http: getting tls app: loading tls app module: provision tls: loading certificates: tls: private key does not match public key"
        CPU: 480ms
Sep 27 20:19:29 server systemd[1]: Starting Caddy...
Sep 27 20:19:29 server caddy[404]: Error: loading initial config: loading new config: loading http app module: provision http: getting tls app: loading tls app module: provision tls: loading certificates: tls: private key does not match public key
Sep 27 20:19:29 server systemd[1]: Started Caddy.
Sep 27 20:19:29 server systemd[1]: caddy.service: Main process exited, code=exited, status=1/FAILURE
Sep 27 20:19:29 server systemd[1]: caddy.service: Failed with result 'exit-code'.
failed checks.aarch64-linux.dm-wireguard-star 16m 55s
container-test-run-dm-wireguard-star: ~~~~^^^^^^^^^^^^^^^^^^^^^^^^^^^^^^^^^^^^^^^^^^^^ File "<string>", line 5, in <module> File "/nix/store/1v002aslhnn …
container-test-run-dm-wireguard-star:
    ~~~~^^^^^^^^^^^^^^^^^^^^^^^^^^^^^^^^^^^^^^^^^^^^
  File "<string>", line 5, in <module>
  File "/nix/store/1v002aslhnn1b7kr1fq8m14lldran2b0-test-driver-0.0.1/lib/python3.13/site-packages/test_driver/__init__.py", line 467, in wait_for_unit
    retry(check_active, timeout)
    ~~~~~^^^^^^^^^^^^^^^^^^^^^^^
  File "/nix/store/1v002aslhnn1b7kr1fq8m14lldran2b0-test-driver-0.0.1/lib/python3.13/site-packages/test_driver/__init__.py", line 202, in retry
    raise Error(msg)
test_driver.Error: action timed out after 900 seconds
failed checks.aarch64-linux.pocket-id 2m 11s
container-test-run-pocket-id: Sep 27 20:18:26 server pocket-id-clients-reconcile[322]: curl: (7) Failed to connect to 127.0.0.1:1411 after 0 ms: Could not conne …
container-test-run-pocket-id:
Sep 27 20:18:26 server pocket-id-clients-reconcile[322]: curl: (7) Failed to connect to 127.0.0.1:1411 after 0 ms: Could not connect to server
Sep 27 20:18:27 server pocket-id-clients-reconcile[400]: curl: (7) Failed to connect to 127.0.0.1:1411 after 0 ms: Could not connect to server
Sep 27 20:18:28 server pocket-id-clients-reconcile[406]: [dashboard] create
Sep 27 20:18:28 server pocket-id-clients-reconcile[413]: curl: (22) The requested URL returned error: 404
Sep 27 20:18:28 server systemd[1]: pocket-id-clients.service: Main process exited, code=exited, status=22/n/a
Sep 27 20:18:28 server systemd[1]: pocket-id-clients.service: Failed with result 'exit-code'.
Sep 27 20:18:28 server systemd[1]: Failed to start Reconcile Pocket ID OIDC clients against the clan-declared spec.
failed checks.aarch64-linux.punchcard 2m 54s
container-test-run-punchcard: Status: "loading new config: loading tls app module: provision tls: loading certificates: tls: private key does not match pub …
container-test-run-punchcard:
     Status: "loading new config: loading tls app module: provision tls: loading certificates: tls: private key does not match public key"
        CPU: 477ms
Sep 27 20:19:32 server systemd[1]: Starting Caddy...
Sep 27 20:19:32 server caddy[386]: Error: loading initial config: loading new config: loading tls app module: provision tls: loading certificates: tls: private key does not match public key
Sep 27 20:19:32 server systemd[1]: Started Caddy.
Sep 27 20:19:32 server systemd[1]: caddy.service: Main process exited, code=exited, status=1/FAILURE
Sep 27 20:19:32 server systemd[1]: caddy.service: Failed with result 'exit-code'.
failed checks.x86_64-linux.authelia 1m 44s
container-test-run-authelia: Status: "loading new config: loading http app module: provision http: getting tls app: loading tls app module: provision tls: …
container-test-run-authelia:
     Status: "loading new config: loading http app module: provision http: getting tls app: loading tls app module: provision tls: loading certificates: tls: private key does not match public key"
        CPU: 293ms
Sep 27 20:18:22 server systemd[1]: Starting Caddy...
Sep 27 20:18:22 server caddy[406]: Error: loading initial config: loading new config: loading http app module: provision http: getting tls app: loading tls app module: provision tls: loading certificates: tls: private key does not match public key
Sep 27 20:18:22 server systemd[1]: Started Caddy.
Sep 27 20:18:22 server systemd[1]: caddy.service: Main process exited, code=exited, status=1/FAILURE
Sep 27 20:18:22 server systemd[1]: caddy.service: Failed with result 'exit-code'.
failed checks.x86_64-linux.dm-wireguard-star 15m 39s
container-test-run-dm-wireguard-star: ~~~~^^^^^^^^^^^^^^^^^^^^^^^^^^^^^^^^^^^^^^^^^^^^ File "<string>", line 5, in <module> File "/nix/store/7pcwg3l52sf …
container-test-run-dm-wireguard-star:
    ~~~~^^^^^^^^^^^^^^^^^^^^^^^^^^^^^^^^^^^^^^^^^^^^
  File "<string>", line 5, in <module>
  File "/nix/store/7pcwg3l52sff9p90k03qhavpaqk1zhfi-test-driver-0.0.1/lib/python3.13/site-packages/test_driver/__init__.py", line 467, in wait_for_unit
    retry(check_active, timeout)
    ~~~~~^^^^^^^^^^^^^^^^^^^^^^^
  File "/nix/store/7pcwg3l52sff9p90k03qhavpaqk1zhfi-test-driver-0.0.1/lib/python3.13/site-packages/test_driver/__init__.py", line 202, in retry
    raise Error(msg)
test_driver.Error: action timed out after 900 seconds
failed checks.x86_64-linux.pocket-id 46s
container-test-run-pocket-id: Sep 27 20:17:02 server systemd[1]: Starting Reconcile Pocket ID OIDC clients against the clan-declared spec... Sep 27 20:17:02 ser …
container-test-run-pocket-id:
Sep 27 20:17:02 server systemd[1]: Starting Reconcile Pocket ID OIDC clients against the clan-declared spec...
Sep 27 20:17:02 server pocket-id-clients-reconcile[321]: curl: (7) Failed to connect to 127.0.0.1:1411 after 0 ms: Could not connect to server
Sep 27 20:17:03 server pocket-id-clients-reconcile[380]: [dashboard] create
Sep 27 20:17:03 server pocket-id-clients-reconcile[387]: curl: (22) The requested URL returned error: 404
Sep 27 20:17:03 server systemd[1]: pocket-id-clients.service: Main process exited, code=exited, status=22/n/a
Sep 27 20:17:03 server systemd[1]: pocket-id-clients.service: Failed with result 'exit-code'.
Sep 27 20:17:03 server systemd[1]: Failed to start Reconcile Pocket ID OIDC clients against the clan-declared spec.
failed checks.x86_64-linux.punchcard 1m 41s
container-test-run-punchcard: Status: "loading new config: loading tls app module: provision tls: loading certificates: tls: private key does not match pub …
container-test-run-punchcard:
     Status: "loading new config: loading tls app module: provision tls: loading certificates: tls: private key does not match public key"
        CPU: 294ms
Sep 27 20:18:16 server systemd[1]: Starting Caddy...
Sep 27 20:18:17 server caddy[387]: Error: loading initial config: loading new config: loading tls app module: provision tls: loading certificates: tls: private key does not match public key
Sep 27 20:18:17 server systemd[1]: Started Caddy.
Sep 27 20:18:17 server systemd[1]: caddy.service: Main process exited, code=exited, status=1/FAILURE
Sep 27 20:18:17 server systemd[1]: caddy.service: Failed with result 'exit-code'.
13 succeeded ⚠ 1
succeeded attributes
status attribute duration
succeeded checks.aarch64-darwin.nix-unit
  • Dependency of package 'nix-unit' uses a nested list in attribute 'nativeBuildInputs'. This is deprecated as of Nixpkgs release 26.05, and support will be removed in a future nixpkgs release.
26s
succeeded checks.aarch64-darwin.coverage 2s
succeeded checks.aarch64-darwin.treefmt 11s
succeeded checks.aarch64-linux.coverage 3s
succeeded checks.aarch64-linux.eval-tests-import-flake 2s
succeeded checks.aarch64-linux.nix-unit 50s
succeeded checks.aarch64-linux.treefmt 8s
succeeded checks.x86_64-linux.coredns 28s
succeeded checks.x86_64-linux.coverage 5s
succeeded checks.x86_64-linux.eval-tests-import-flake 4s
succeeded checks.x86_64-linux.nix-unit 16s
succeeded checks.x86_64-linux.treefmt 5s
succeeded checks.x86_64-linux.webapps 20s
5 already built
skipped attributes
status attribute duration
loading…