nixbot

builds

clan/clan-community build #192 failed

branch 26.05 · PR #199 · commit 97b4ffe4f4 · · took 16m 19s · eval 37s

eval warnings 1 kind · 1 occurrence
  • warn Dependency of package 'nix-unit' uses a nested list in attribute 'nativeBuildInputs'. ×1

8 failed
failed attributes
status attribute duration
failed checks.aarch64-linux.authelia 8s
container-test-run-authelia: Status: "loading new config: loading http app module: provision http: getting tls app: loading tls app module: provision tls: …
container-test-run-authelia:
     Status: "loading new config: loading http app module: provision http: getting tls app: loading tls app module: provision tls: loading certificates: tls: private key does not match public key"
        CPU: 525ms
Sep 28 00:06:06 server systemd[1]: Starting Caddy...
Sep 28 00:06:07 server caddy[407]: Error: loading initial config: loading new config: loading http app module: provision http: getting tls app: loading tls app module: provision tls: loading certificates: tls: private key does not match public key
Sep 28 00:06:07 server systemd[1]: Started Caddy.
Sep 28 00:06:07 server systemd[1]: caddy.service: Main process exited, code=exited, status=1/FAILURE
Sep 28 00:06:07 server systemd[1]: caddy.service: Failed with result 'exit-code'.
failed checks.aarch64-linux.dm-wireguard-star 15m 51s
container-test-run-dm-wireguard-star: ~~~~^^^^^^^^^^^^^^^^^^^^^^^^^^^^^^^^^^^^^^^^^^^^ File "<string>", line 5, in <module> File "/nix/store/1v002aslhnn …
container-test-run-dm-wireguard-star:
    ~~~~^^^^^^^^^^^^^^^^^^^^^^^^^^^^^^^^^^^^^^^^^^^^
  File "<string>", line 5, in <module>
  File "/nix/store/1v002aslhnn1b7kr1fq8m14lldran2b0-test-driver-0.0.1/lib/python3.13/site-packages/test_driver/__init__.py", line 467, in wait_for_unit
    retry(check_active, timeout)
    ~~~~~^^^^^^^^^^^^^^^^^^^^^^^
  File "/nix/store/1v002aslhnn1b7kr1fq8m14lldran2b0-test-driver-0.0.1/lib/python3.13/site-packages/test_driver/__init__.py", line 202, in retry
    raise Error(msg)
test_driver.Error: action timed out after 900 seconds
failed checks.aarch64-linux.pocket-id 12s
container-test-run-pocket-id: Sep 28 00:06:00 server pocket-id-clients-reconcile[319]: curl: (7) Failed to connect to 127.0.0.1:1411 after 0 ms: Could not conne …
container-test-run-pocket-id:
Sep 28 00:06:00 server pocket-id-clients-reconcile[319]: curl: (7) Failed to connect to 127.0.0.1:1411 after 0 ms: Could not connect to server
Sep 28 00:06:01 server pocket-id-clients-reconcile[396]: curl: (7) Failed to connect to 127.0.0.1:1411 after 0 ms: Could not connect to server
Sep 28 00:06:02 server pocket-id-clients-reconcile[403]: [dashboard] create
Sep 28 00:06:02 server pocket-id-clients-reconcile[414]: curl: (22) The requested URL returned error: 404
Sep 28 00:06:02 server systemd[1]: pocket-id-clients.service: Main process exited, code=exited, status=22/n/a
Sep 28 00:06:02 server systemd[1]: pocket-id-clients.service: Failed with result 'exit-code'.
Sep 28 00:06:02 server systemd[1]: Failed to start Reconcile Pocket ID OIDC clients against the clan-declared spec.
failed checks.aarch64-linux.punchcard 8s
container-test-run-punchcard: Status: "loading new config: loading http app module: provision http: getting tls app: loading tls app module: provision tls: …
container-test-run-punchcard:
     Status: "loading new config: loading http app module: provision http: getting tls app: loading tls app module: provision tls: loading certificates: tls: private key does not match public key"
        CPU: 523ms
Sep 28 00:06:14 server systemd[1]: Starting Caddy...
Sep 28 00:06:14 server caddy[384]: Error: loading initial config: loading new config: loading http app module: provision http: getting tls app: loading tls app module: provision tls: loading certificates: tls: private key does not match public key
Sep 28 00:06:14 server systemd[1]: Started Caddy.
Sep 28 00:06:14 server systemd[1]: caddy.service: Main process exited, code=exited, status=1/FAILURE
Sep 28 00:06:14 server systemd[1]: caddy.service: Failed with result 'exit-code'.
failed checks.x86_64-linux.authelia 5s
container-test-run-authelia: Status: "loading new config: loading http app module: provision http: getting tls app: loading tls app module: provision tls: …
container-test-run-authelia:
     Status: "loading new config: loading http app module: provision http: getting tls app: loading tls app module: provision tls: loading certificates: tls: private key does not match public key"
        CPU: 322ms
Sep 28 00:06:11 server systemd[1]: Starting Caddy...
Sep 28 00:06:11 server caddy[404]: Error: loading initial config: loading new config: loading http app module: provision http: getting tls app: loading tls app module: provision tls: loading certificates: tls: private key does not match public key
Sep 28 00:06:11 server systemd[1]: Started Caddy.
Sep 28 00:06:11 server systemd[1]: caddy.service: Main process exited, code=exited, status=1/FAILURE
Sep 28 00:06:11 server systemd[1]: caddy.service: Failed with result 'exit-code'.
failed checks.x86_64-linux.dm-wireguard-star 15m 12s
container-test-run-dm-wireguard-star: ~~~~^^^^^^^^^^^^^^^^^^^^^^^^^^^^^^^^^^^^^^^^^^^^ File "<string>", line 5, in <module> File "/nix/store/7pcwg3l52sf …
container-test-run-dm-wireguard-star:
    ~~~~^^^^^^^^^^^^^^^^^^^^^^^^^^^^^^^^^^^^^^^^^^^^
  File "<string>", line 5, in <module>
  File "/nix/store/7pcwg3l52sff9p90k03qhavpaqk1zhfi-test-driver-0.0.1/lib/python3.13/site-packages/test_driver/__init__.py", line 467, in wait_for_unit
    retry(check_active, timeout)
    ~~~~~^^^^^^^^^^^^^^^^^^^^^^^
  File "/nix/store/7pcwg3l52sff9p90k03qhavpaqk1zhfi-test-driver-0.0.1/lib/python3.13/site-packages/test_driver/__init__.py", line 202, in retry
    raise Error(msg)
test_driver.Error: action timed out after 900 seconds
failed checks.x86_64-linux.pocket-id 15s
container-test-run-pocket-id: Sep 28 00:06:08 server systemd[1]: Starting Reconcile Pocket ID OIDC clients against the clan-declared spec... Sep 28 00:06:08 ser …
container-test-run-pocket-id:
Sep 28 00:06:08 server systemd[1]: Starting Reconcile Pocket ID OIDC clients against the clan-declared spec...
Sep 28 00:06:08 server pocket-id-clients-reconcile[320]: curl: (7) Failed to connect to 127.0.0.1:1411 after 0 ms: Could not connect to server
Sep 28 00:06:09 server pocket-id-clients-reconcile[383]: [dashboard] create
Sep 28 00:06:09 server pocket-id-clients-reconcile[390]: curl: (22) The requested URL returned error: 404
Sep 28 00:06:09 server systemd[1]: pocket-id-clients.service: Main process exited, code=exited, status=22/n/a
Sep 28 00:06:09 server systemd[1]: pocket-id-clients.service: Failed with result 'exit-code'.
Sep 28 00:06:09 server systemd[1]: Failed to start Reconcile Pocket ID OIDC clients against the clan-declared spec.
failed checks.x86_64-linux.punchcard 6s
container-test-run-punchcard: Status: "loading new config: loading http app module: provision http: getting tls app: loading tls app module: provision tls: …
container-test-run-punchcard:
     Status: "loading new config: loading http app module: provision http: getting tls app: loading tls app module: provision tls: loading certificates: tls: private key does not match public key"
        CPU: 302ms
Sep 28 00:06:12 server systemd[1]: Starting Caddy...
Sep 28 00:06:13 server caddy[387]: Error: loading initial config: loading new config: loading http app module: provision http: getting tls app: loading tls app module: provision tls: loading certificates: tls: private key does not match public key
Sep 28 00:06:13 server systemd[1]: Started Caddy.
Sep 28 00:06:13 server systemd[1]: caddy.service: Main process exited, code=exited, status=1/FAILURE
Sep 28 00:06:13 server systemd[1]: caddy.service: Failed with result 'exit-code'.
6 succeeded ⚠ 1
succeeded attributes
status attribute duration
succeeded checks.aarch64-darwin.nix-unit
  • Dependency of package 'nix-unit' uses a nested list in attribute 'nativeBuildInputs'. This is deprecated as of Nixpkgs release 26.05, and support will be removed in a future nixpkgs release.
27s
succeeded checks.aarch64-darwin.treefmt 3s
succeeded checks.aarch64-linux.nix-unit 48s
succeeded checks.aarch64-linux.treefmt 8s
succeeded checks.x86_64-linux.nix-unit 21s
succeeded checks.x86_64-linux.treefmt 3s
12 already built
skipped attributes
status attribute duration
loading…