nixbot

builds

clan/clan-community build #199 failed

branch 26.05 · PR #206 · commit a24b87ed3a · · took 15m 52s · eval 25s

eval warnings 1 kind · 1 occurrence
  • warn Dependency of package 'nix-unit' uses a nested list in attribute 'nativeBuildInputs'. ×1

8 failed
failed attributes
status attribute duration
failed checks.aarch64-linux.authelia 7s
container-test-run-authelia: Status: "loading new config: loading http app module: provision http: getting tls app: loading tls app module: provision tls: …
container-test-run-authelia:
     Status: "loading new config: loading http app module: provision http: getting tls app: loading tls app module: provision tls: loading certificates: tls: private key does not match public key"
        CPU: 468ms
Sep 30 00:01:22 server systemd[1]: Starting Caddy...
Sep 30 00:01:23 server caddy[404]: Error: loading initial config: loading new config: loading http app module: provision http: getting tls app: loading tls app module: provision tls: loading certificates: tls: private key does not match public key
Sep 30 00:01:23 server systemd[1]: Started Caddy.
Sep 30 00:01:23 server systemd[1]: caddy.service: Main process exited, code=exited, status=1/FAILURE
Sep 30 00:01:23 server systemd[1]: caddy.service: Failed with result 'exit-code'.
failed checks.aarch64-linux.dm-wireguard-star 15m 25s
container-test-run-dm-wireguard-star: ~~~~^^^^^^^^^^^^^^^^^^^^^^^^^^^^^^^^^^^^^^^^^^^^ File "<string>", line 5, in <module> File "/nix/store/1v002aslhnn …
container-test-run-dm-wireguard-star:
    ~~~~^^^^^^^^^^^^^^^^^^^^^^^^^^^^^^^^^^^^^^^^^^^^
  File "<string>", line 5, in <module>
  File "/nix/store/1v002aslhnn1b7kr1fq8m14lldran2b0-test-driver-0.0.1/lib/python3.13/site-packages/test_driver/__init__.py", line 467, in wait_for_unit
    retry(check_active, timeout)
    ~~~~~^^^^^^^^^^^^^^^^^^^^^^^
  File "/nix/store/1v002aslhnn1b7kr1fq8m14lldran2b0-test-driver-0.0.1/lib/python3.13/site-packages/test_driver/__init__.py", line 202, in retry
    raise Error(msg)
test_driver.Error: action timed out after 900 seconds
failed checks.aarch64-linux.pocket-id 7s
container-test-run-pocket-id: Sep 30 00:01:16 server pocket-id-clients-reconcile[320]: curl: (7) Failed to connect to 127.0.0.1:1411 after 0 ms: Could not conne …
container-test-run-pocket-id:
Sep 30 00:01:16 server pocket-id-clients-reconcile[320]: curl: (7) Failed to connect to 127.0.0.1:1411 after 0 ms: Could not connect to server
Sep 30 00:01:17 server pocket-id-clients-reconcile[399]: curl: (7) Failed to connect to 127.0.0.1:1411 after 0 ms: Could not connect to server
Sep 30 00:01:18 server pocket-id-clients-reconcile[406]: [dashboard] create
Sep 30 00:01:18 server pocket-id-clients-reconcile[413]: curl: (22) The requested URL returned error: 404
Sep 30 00:01:18 server systemd[1]: pocket-id-clients.service: Main process exited, code=exited, status=22/n/a
Sep 30 00:01:18 server systemd[1]: pocket-id-clients.service: Failed with result 'exit-code'.
Sep 30 00:01:18 server systemd[1]: Failed to start Reconcile Pocket ID OIDC clients against the clan-declared spec.
failed checks.aarch64-linux.punchcard 7s
container-test-run-punchcard: Status: "loading new config: loading http app module: provision http: getting tls app: loading tls app module: provision tls: …
container-test-run-punchcard:
     Status: "loading new config: loading http app module: provision http: getting tls app: loading tls app module: provision tls: loading certificates: tls: private key does not match public key"
        CPU: 509ms
Sep 30 00:01:22 server systemd[1]: Starting Caddy...
Sep 30 00:01:23 server caddy[385]: Error: loading initial config: loading new config: loading http app module: provision http: getting tls app: loading tls app module: provision tls: loading certificates: tls: private key does not match public key
Sep 30 00:01:23 server systemd[1]: Started Caddy.
Sep 30 00:01:23 server systemd[1]: caddy.service: Main process exited, code=exited, status=1/FAILURE
Sep 30 00:01:23 server systemd[1]: caddy.service: Failed with result 'exit-code'.
failed checks.x86_64-linux.authelia 5s
container-test-run-authelia: Status: "loading new config: loading tls app module: provision tls: loading certificates: tls: private key does not match publ …
container-test-run-authelia:
     Status: "loading new config: loading tls app module: provision tls: loading certificates: tls: private key does not match public key"
        CPU: 300ms
Sep 30 00:01:21 server systemd[1]: Starting Caddy...
Sep 30 00:01:21 server caddy[405]: Error: loading initial config: loading new config: loading tls app module: provision tls: loading certificates: tls: private key does not match public key
Sep 30 00:01:21 server systemd[1]: Started Caddy.
Sep 30 00:01:21 server systemd[1]: caddy.service: Main process exited, code=exited, status=1/FAILURE
Sep 30 00:01:21 server systemd[1]: caddy.service: Failed with result 'exit-code'.
failed checks.x86_64-linux.dm-wireguard-star 15m 12s
container-test-run-dm-wireguard-star: ~~~~^^^^^^^^^^^^^^^^^^^^^^^^^^^^^^^^^^^^^^^^^^^^ File "<string>", line 5, in <module> File "/nix/store/7pcwg3l52sf …
container-test-run-dm-wireguard-star:
    ~~~~^^^^^^^^^^^^^^^^^^^^^^^^^^^^^^^^^^^^^^^^^^^^
  File "<string>", line 5, in <module>
  File "/nix/store/7pcwg3l52sff9p90k03qhavpaqk1zhfi-test-driver-0.0.1/lib/python3.13/site-packages/test_driver/__init__.py", line 467, in wait_for_unit
    retry(check_active, timeout)
    ~~~~~^^^^^^^^^^^^^^^^^^^^^^^
  File "/nix/store/7pcwg3l52sff9p90k03qhavpaqk1zhfi-test-driver-0.0.1/lib/python3.13/site-packages/test_driver/__init__.py", line 202, in retry
    raise Error(msg)
test_driver.Error: action timed out after 900 seconds
failed checks.x86_64-linux.pocket-id 5s
container-test-run-pocket-id: Sep 30 00:01:15 server systemd[1]: Starting Reconcile Pocket ID OIDC clients against the clan-declared spec... Sep 30 00:01:15 ser …
container-test-run-pocket-id:
Sep 30 00:01:15 server systemd[1]: Starting Reconcile Pocket ID OIDC clients against the clan-declared spec...
Sep 30 00:01:15 server pocket-id-clients-reconcile[321]: curl: (7) Failed to connect to 127.0.0.1:1411 after 0 ms: Could not connect to server
Sep 30 00:01:16 server pocket-id-clients-reconcile[381]: [dashboard] create
Sep 30 00:01:16 server pocket-id-clients-reconcile[388]: curl: (22) The requested URL returned error: 404
Sep 30 00:01:16 server systemd[1]: pocket-id-clients.service: Main process exited, code=exited, status=22/n/a
Sep 30 00:01:16 server systemd[1]: pocket-id-clients.service: Failed with result 'exit-code'.
Sep 30 00:01:16 server systemd[1]: Failed to start Reconcile Pocket ID OIDC clients against the clan-declared spec.
failed checks.x86_64-linux.punchcard 5s
container-test-run-punchcard: Status: "loading new config: loading http app module: provision http: getting tls app: loading tls app module: provision tls: …
container-test-run-punchcard:
     Status: "loading new config: loading http app module: provision http: getting tls app: loading tls app module: provision tls: loading certificates: tls: private key does not match public key"
        CPU: 301ms
Sep 30 00:01:21 server systemd[1]: Starting Caddy...
Sep 30 00:01:21 server caddy[387]: Error: loading initial config: loading new config: loading http app module: provision http: getting tls app: loading tls app module: provision tls: loading certificates: tls: private key does not match public key
Sep 30 00:01:21 server systemd[1]: Started Caddy.
Sep 30 00:01:21 server systemd[1]: caddy.service: Main process exited, code=exited, status=1/FAILURE
Sep 30 00:01:21 server systemd[1]: caddy.service: Failed with result 'exit-code'.
6 succeeded ⚠ 1
succeeded attributes
status attribute duration
succeeded checks.aarch64-darwin.nix-unit
  • Dependency of package 'nix-unit' uses a nested list in attribute 'nativeBuildInputs'. This is deprecated as of Nixpkgs release 26.05, and support will be removed in a future nixpkgs release.
27s
succeeded checks.aarch64-darwin.treefmt 3s
succeeded checks.aarch64-linux.nix-unit 22s
succeeded checks.aarch64-linux.treefmt 4s
succeeded checks.x86_64-linux.nix-unit 20s
succeeded checks.x86_64-linux.treefmt 3s
12 already built
skipped attributes
status attribute duration
loading…