nixbot

builds

clan/clan-community build #202 failed

branch 26.05 · PR #209 · commit b1bf5f4657 · · took 18m 17s · eval 36s

eval warnings 1 kind · 1 occurrence
  • warn Dependency of package 'nix-unit' uses a nested list in attribute 'nativeBuildInputs'. ×1

8 failed
failed attributes
status attribute duration
failed checks.aarch64-linux.authelia 2m 23s
container-test-run-authelia: Status: "loading new config: loading http app module: provision http: getting tls app: loading tls app module: provision tls: …
container-test-run-authelia:
     Status: "loading new config: loading http app module: provision http: getting tls app: loading tls app module: provision tls: loading certificates: tls: private key does not match public key"
        CPU: 467ms
Sep 30 20:03:43 server systemd[1]: Starting Caddy...
Sep 30 20:03:43 server caddy[404]: Error: loading initial config: loading new config: loading http app module: provision http: getting tls app: loading tls app module: provision tls: loading certificates: tls: private key does not match public key
Sep 30 20:03:43 server systemd[1]: Started Caddy.
Sep 30 20:03:43 server systemd[1]: caddy.service: Main process exited, code=exited, status=1/FAILURE
Sep 30 20:03:43 server systemd[1]: caddy.service: Failed with result 'exit-code'.
failed checks.aarch64-linux.dm-wireguard-star 17m 40s
container-test-run-dm-wireguard-star: ~~~~^^^^^^^^^^^^^^^^^^^^^^^^^^^^^^^^^^^^^^^^^^^^ File "<string>", line 5, in <module> File "/nix/store/1v002aslhnn …
container-test-run-dm-wireguard-star:
    ~~~~^^^^^^^^^^^^^^^^^^^^^^^^^^^^^^^^^^^^^^^^^^^^
  File "<string>", line 5, in <module>
  File "/nix/store/1v002aslhnn1b7kr1fq8m14lldran2b0-test-driver-0.0.1/lib/python3.13/site-packages/test_driver/__init__.py", line 467, in wait_for_unit
    retry(check_active, timeout)
    ~~~~~^^^^^^^^^^^^^^^^^^^^^^^
  File "/nix/store/1v002aslhnn1b7kr1fq8m14lldran2b0-test-driver-0.0.1/lib/python3.13/site-packages/test_driver/__init__.py", line 202, in retry
    raise Error(msg)
test_driver.Error: action timed out after 900 seconds
failed checks.aarch64-linux.pocket-id 2m 4s
container-test-run-pocket-id: Sep 30 20:03:17 server pocket-id-clients-reconcile[324]: curl: (7) Failed to connect to 127.0.0.1:1411 after 0 ms: Could not conne …
container-test-run-pocket-id:
Sep 30 20:03:17 server pocket-id-clients-reconcile[324]: curl: (7) Failed to connect to 127.0.0.1:1411 after 0 ms: Could not connect to server
Sep 30 20:03:18 server pocket-id-clients-reconcile[400]: curl: (7) Failed to connect to 127.0.0.1:1411 after 0 ms: Could not connect to server
Sep 30 20:03:19 server pocket-id-clients-reconcile[408]: [dashboard] create
Sep 30 20:03:19 server pocket-id-clients-reconcile[415]: curl: (22) The requested URL returned error: 404
Sep 30 20:03:19 server systemd[1]: pocket-id-clients.service: Main process exited, code=exited, status=22/n/a
Sep 30 20:03:19 server systemd[1]: pocket-id-clients.service: Failed with result 'exit-code'.
Sep 30 20:03:19 server systemd[1]: Failed to start Reconcile Pocket ID OIDC clients against the clan-declared spec.
failed checks.aarch64-linux.punchcard 2m 25s
container-test-run-punchcard: Status: "loading new config: loading http app module: provision http: getting tls app: loading tls app module: provision tls: …
container-test-run-punchcard:
     Status: "loading new config: loading http app module: provision http: getting tls app: loading tls app module: provision tls: loading certificates: tls: private key does not match public key"
        CPU: 491ms
Sep 30 20:03:45 server systemd[1]: Starting Caddy...
Sep 30 20:03:45 server caddy[385]: Error: loading initial config: loading new config: loading http app module: provision http: getting tls app: loading tls app module: provision tls: loading certificates: tls: private key does not match public key
Sep 30 20:03:45 server systemd[1]: Started Caddy.
Sep 30 20:03:45 server systemd[1]: caddy.service: Main process exited, code=exited, status=1/FAILURE
Sep 30 20:03:45 server systemd[1]: caddy.service: Failed with result 'exit-code'.
failed checks.x86_64-linux.authelia 48s
container-test-run-authelia: Status: "loading new config: loading http app module: provision http: getting tls app: loading tls app module: provision tls: …
container-test-run-authelia:
     Status: "loading new config: loading http app module: provision http: getting tls app: loading tls app module: provision tls: loading certificates: tls: private key does not match public key"
        CPU: 340ms
Sep 30 20:02:08 server systemd[1]: Starting Caddy...
Sep 30 20:02:09 server caddy[406]: Error: loading initial config: loading new config: loading http app module: provision http: getting tls app: loading tls app module: provision tls: loading certificates: tls: private key does not match public key
Sep 30 20:02:09 server systemd[1]: Started Caddy.
Sep 30 20:02:09 server systemd[1]: caddy.service: Main process exited, code=exited, status=1/FAILURE
Sep 30 20:02:09 server systemd[1]: caddy.service: Failed with result 'exit-code'.
failed checks.x86_64-linux.dm-wireguard-star 15m 51s
container-test-run-dm-wireguard-star: ~~~~^^^^^^^^^^^^^^^^^^^^^^^^^^^^^^^^^^^^^^^^^^^^ File "<string>", line 5, in <module> File "/nix/store/7pcwg3l52sf …
container-test-run-dm-wireguard-star:
    ~~~~^^^^^^^^^^^^^^^^^^^^^^^^^^^^^^^^^^^^^^^^^^^^
  File "<string>", line 5, in <module>
  File "/nix/store/7pcwg3l52sff9p90k03qhavpaqk1zhfi-test-driver-0.0.1/lib/python3.13/site-packages/test_driver/__init__.py", line 467, in wait_for_unit
    retry(check_active, timeout)
    ~~~~~^^^^^^^^^^^^^^^^^^^^^^^
  File "/nix/store/7pcwg3l52sff9p90k03qhavpaqk1zhfi-test-driver-0.0.1/lib/python3.13/site-packages/test_driver/__init__.py", line 202, in retry
    raise Error(msg)
test_driver.Error: action timed out after 900 seconds
failed checks.x86_64-linux.pocket-id 39s
container-test-run-pocket-id: Sep 30 20:01:53 server systemd[1]: Starting Reconcile Pocket ID OIDC clients against the clan-declared spec... Sep 30 20:01:53 ser …
container-test-run-pocket-id:
Sep 30 20:01:53 server systemd[1]: Starting Reconcile Pocket ID OIDC clients against the clan-declared spec...
Sep 30 20:01:53 server pocket-id-clients-reconcile[320]: curl: (7) Failed to connect to 127.0.0.1:1411 after 0 ms: Could not connect to server
Sep 30 20:01:54 server pocket-id-clients-reconcile[381]: [dashboard] create
Sep 30 20:01:54 server pocket-id-clients-reconcile[388]: curl: (22) The requested URL returned error: 404
Sep 30 20:01:54 server systemd[1]: pocket-id-clients.service: Main process exited, code=exited, status=22/n/a
Sep 30 20:01:54 server systemd[1]: pocket-id-clients.service: Failed with result 'exit-code'.
Sep 30 20:01:54 server systemd[1]: Failed to start Reconcile Pocket ID OIDC clients against the clan-declared spec.
failed checks.x86_64-linux.punchcard 48s
container-test-run-punchcard: Status: "loading new config: loading http app module: provision http: getting tls app: loading tls app module: provision tls: …
container-test-run-punchcard:
     Status: "loading new config: loading http app module: provision http: getting tls app: loading tls app module: provision tls: loading certificates: tls: private key does not match public key"
        CPU: 303ms
Sep 30 20:02:09 server systemd[1]: Starting Caddy...
Sep 30 20:02:09 server caddy[389]: Error: loading initial config: loading new config: loading http app module: provision http: getting tls app: loading tls app module: provision tls: loading certificates: tls: private key does not match public key
Sep 30 20:02:09 server systemd[1]: Started Caddy.
Sep 30 20:02:09 server systemd[1]: caddy.service: Main process exited, code=exited, status=1/FAILURE
Sep 30 20:02:09 server systemd[1]: caddy.service: Failed with result 'exit-code'.
10 succeeded ⚠ 1
succeeded attributes
status attribute duration
succeeded checks.aarch64-darwin.nix-unit
  • Dependency of package 'nix-unit' uses a nested list in attribute 'nativeBuildInputs'. This is deprecated as of Nixpkgs release 26.05, and support will be removed in a future nixpkgs release.
24s
succeeded checks.aarch64-darwin.treefmt 5s
succeeded checks.aarch64-linux.coredns 2m 30s
succeeded checks.aarch64-linux.nix-unit 23s
succeeded checks.aarch64-linux.treefmt 3s
succeeded checks.aarch64-linux.webapps 2m 24s
succeeded checks.x86_64-linux.coredns 49s
succeeded checks.x86_64-linux.nix-unit 14s
succeeded checks.x86_64-linux.treefmt 3s
succeeded checks.x86_64-linux.webapps 54s
8 already built
skipped attributes
status attribute duration
loading…