nixbot

builds

clan/clan-community build #204 failed

branch 26.05 · PR #211 · commit a21b25da0f · · took 15m 53s · eval 26s

eval warnings 1 kind · 1 occurrence
  • warn Dependency of package 'nix-unit' uses a nested list in attribute 'nativeBuildInputs'. ×1

8 failed
failed attributes
status attribute duration
failed checks.aarch64-linux.authelia 7s
container-test-run-authelia: Status: "loading new config: loading http app module: provision http: getting tls app: loading tls app module: provision tls: …
container-test-run-authelia:
     Status: "loading new config: loading http app module: provision http: getting tls app: loading tls app module: provision tls: loading certificates: tls: private key does not match public key"
        CPU: 489ms
Oct 01 05:01:25 server systemd[1]: Starting Caddy...
Oct 01 05:01:25 server caddy[403]: Error: loading initial config: loading new config: loading http app module: provision http: getting tls app: loading tls app module: provision tls: loading certificates: tls: private key does not match public key
Oct 01 05:01:25 server systemd[1]: Started Caddy.
Oct 01 05:01:25 server systemd[1]: caddy.service: Main process exited, code=exited, status=1/FAILURE
Oct 01 05:01:25 server systemd[1]: caddy.service: Failed with result 'exit-code'.
failed checks.aarch64-linux.dm-wireguard-star 15m 26s
container-test-run-dm-wireguard-star: ~~~~^^^^^^^^^^^^^^^^^^^^^^^^^^^^^^^^^^^^^^^^^^^^ File "<string>", line 5, in <module> File "/nix/store/1v002aslhnn …
container-test-run-dm-wireguard-star:
    ~~~~^^^^^^^^^^^^^^^^^^^^^^^^^^^^^^^^^^^^^^^^^^^^
  File "<string>", line 5, in <module>
  File "/nix/store/1v002aslhnn1b7kr1fq8m14lldran2b0-test-driver-0.0.1/lib/python3.13/site-packages/test_driver/__init__.py", line 467, in wait_for_unit
    retry(check_active, timeout)
    ~~~~~^^^^^^^^^^^^^^^^^^^^^^^
  File "/nix/store/1v002aslhnn1b7kr1fq8m14lldran2b0-test-driver-0.0.1/lib/python3.13/site-packages/test_driver/__init__.py", line 202, in retry
    raise Error(msg)
test_driver.Error: action timed out after 900 seconds
failed checks.aarch64-linux.pocket-id 8s
container-test-run-pocket-id: Oct 01 05:01:19 server pocket-id-clients-reconcile[323]: curl: (7) Failed to connect to 127.0.0.1:1411 after 0 ms: Could not conne …
container-test-run-pocket-id:
Oct 01 05:01:19 server pocket-id-clients-reconcile[323]: curl: (7) Failed to connect to 127.0.0.1:1411 after 0 ms: Could not connect to server
Oct 01 05:01:20 server pocket-id-clients-reconcile[400]: curl: (7) Failed to connect to 127.0.0.1:1411 after 0 ms: Could not connect to server
Oct 01 05:01:21 server pocket-id-clients-reconcile[406]: [dashboard] create
Oct 01 05:01:21 server pocket-id-clients-reconcile[413]: curl: (22) The requested URL returned error: 404
Oct 01 05:01:21 server systemd[1]: pocket-id-clients.service: Main process exited, code=exited, status=22/n/a
Oct 01 05:01:21 server systemd[1]: pocket-id-clients.service: Failed with result 'exit-code'.
Oct 01 05:01:21 server systemd[1]: Failed to start Reconcile Pocket ID OIDC clients against the clan-declared spec.
failed checks.aarch64-linux.punchcard 7s
container-test-run-punchcard: Status: "loading new config: loading http app module: provision http: getting tls app: loading tls app module: provision tls: …
container-test-run-punchcard:
     Status: "loading new config: loading http app module: provision http: getting tls app: loading tls app module: provision tls: loading certificates: tls: private key does not match public key"
        CPU: 498ms
Oct 01 05:01:25 server systemd[1]: Starting Caddy...
Oct 01 05:01:25 server caddy[389]: Error: loading initial config: loading new config: loading http app module: provision http: getting tls app: loading tls app module: provision tls: loading certificates: tls: private key does not match public key
Oct 01 05:01:25 server systemd[1]: Started Caddy.
Oct 01 05:01:25 server systemd[1]: caddy.service: Main process exited, code=exited, status=1/FAILURE
Oct 01 05:01:25 server systemd[1]: caddy.service: Failed with result 'exit-code'.
failed checks.x86_64-linux.authelia 6s
container-test-run-authelia: Status: "loading new config: loading http app module: provision http: getting tls app: loading tls app module: provision tls: …
container-test-run-authelia:
     Status: "loading new config: loading http app module: provision http: getting tls app: loading tls app module: provision tls: loading certificates: tls: private key does not match public key"
        CPU: 291ms
Oct 01 05:01:24 server systemd[1]: Starting Caddy...
Oct 01 05:01:24 server caddy[406]: Error: loading initial config: loading new config: loading http app module: provision http: getting tls app: loading tls app module: provision tls: loading certificates: tls: private key does not match public key
Oct 01 05:01:24 server systemd[1]: Started Caddy.
Oct 01 05:01:24 server systemd[1]: caddy.service: Main process exited, code=exited, status=1/FAILURE
Oct 01 05:01:24 server systemd[1]: caddy.service: Failed with result 'exit-code'.
failed checks.x86_64-linux.dm-wireguard-star 15m 13s
container-test-run-dm-wireguard-star: ~~~~^^^^^^^^^^^^^^^^^^^^^^^^^^^^^^^^^^^^^^^^^^^^ File "<string>", line 5, in <module> File "/nix/store/7pcwg3l52sf …
container-test-run-dm-wireguard-star:
    ~~~~^^^^^^^^^^^^^^^^^^^^^^^^^^^^^^^^^^^^^^^^^^^^
  File "<string>", line 5, in <module>
  File "/nix/store/7pcwg3l52sff9p90k03qhavpaqk1zhfi-test-driver-0.0.1/lib/python3.13/site-packages/test_driver/__init__.py", line 467, in wait_for_unit
    retry(check_active, timeout)
    ~~~~~^^^^^^^^^^^^^^^^^^^^^^^
  File "/nix/store/7pcwg3l52sff9p90k03qhavpaqk1zhfi-test-driver-0.0.1/lib/python3.13/site-packages/test_driver/__init__.py", line 202, in retry
    raise Error(msg)
test_driver.Error: action timed out after 900 seconds
failed checks.x86_64-linux.pocket-id 5s
container-test-run-pocket-id: Oct 01 05:01:17 server systemd[1]: Starting Reconcile Pocket ID OIDC clients against the clan-declared spec... Oct 01 05:01:17 ser …
container-test-run-pocket-id:
Oct 01 05:01:17 server systemd[1]: Starting Reconcile Pocket ID OIDC clients against the clan-declared spec...
Oct 01 05:01:17 server pocket-id-clients-reconcile[321]: curl: (7) Failed to connect to 127.0.0.1:1411 after 0 ms: Could not connect to server
Oct 01 05:01:18 server pocket-id-clients-reconcile[383]: [dashboard] create
Oct 01 05:01:18 server pocket-id-clients-reconcile[390]: curl: (22) The requested URL returned error: 404
Oct 01 05:01:18 server systemd[1]: pocket-id-clients.service: Main process exited, code=exited, status=22/n/a
Oct 01 05:01:18 server systemd[1]: pocket-id-clients.service: Failed with result 'exit-code'.
Oct 01 05:01:18 server systemd[1]: Failed to start Reconcile Pocket ID OIDC clients against the clan-declared spec.
failed checks.x86_64-linux.punchcard 6s
container-test-run-punchcard: Status: "loading new config: loading http app module: provision http: getting tls app: loading tls app module: provision tls: …
container-test-run-punchcard:
     Status: "loading new config: loading http app module: provision http: getting tls app: loading tls app module: provision tls: loading certificates: tls: private key does not match public key"
        CPU: 287ms
Oct 01 05:01:23 server systemd[1]: Starting Caddy...
Oct 01 05:01:23 server caddy[387]: Error: loading initial config: loading new config: loading http app module: provision http: getting tls app: loading tls app module: provision tls: loading certificates: tls: private key does not match public key
Oct 01 05:01:23 server systemd[1]: Started Caddy.
Oct 01 05:01:23 server systemd[1]: caddy.service: Main process exited, code=exited, status=1/FAILURE
Oct 01 05:01:23 server systemd[1]: caddy.service: Failed with result 'exit-code'.
6 succeeded ⚠ 1
succeeded attributes
status attribute duration
succeeded checks.aarch64-darwin.nix-unit
  • Dependency of package 'nix-unit' uses a nested list in attribute 'nativeBuildInputs'. This is deprecated as of Nixpkgs release 26.05, and support will be removed in a future nixpkgs release.
24s
succeeded checks.aarch64-darwin.treefmt 4s
succeeded checks.aarch64-linux.nix-unit 23s
succeeded checks.aarch64-linux.treefmt 3s
succeeded checks.x86_64-linux.nix-unit 20s
succeeded checks.x86_64-linux.treefmt 4s
12 already built
skipped attributes
status attribute duration
loading…