nixbot

builds

clan/clan-community build #209 failed

branch 26.05 · PR #216 · commit ea29c32674 · · took 20m 23s · eval 45s

eval warnings 1 kind · 1 occurrence
  • warn Dependency of package 'nix-unit' uses a nested list in attribute 'nativeBuildInputs'. ×1

8 failed
failed attributes
status attribute duration
failed checks.aarch64-linux.authelia 4m 22s
container-test-run-authelia: Status: "loading new config: loading http app module: provision http: getting tls app: loading tls app module: provision tls: …
container-test-run-authelia:
     Status: "loading new config: loading http app module: provision http: getting tls app: loading tls app module: provision tls: loading certificates: tls: private key does not match public key"
        CPU: 479ms
Oct 02 05:06:43 server systemd[1]: Starting Caddy...
Oct 02 05:06:43 server caddy[402]: Error: loading initial config: loading new config: loading http app module: provision http: getting tls app: loading tls app module: provision tls: loading certificates: tls: private key does not match public key
Oct 02 05:06:43 server systemd[1]: Started Caddy.
Oct 02 05:06:43 server systemd[1]: caddy.service: Main process exited, code=exited, status=1/FAILURE
Oct 02 05:06:43 server systemd[1]: caddy.service: Failed with result 'exit-code'.
failed checks.aarch64-linux.dm-wireguard-star 19m 40s
container-test-run-dm-wireguard-star: ~~~~^^^^^^^^^^^^^^^^^^^^^^^^^^^^^^^^^^^^^^^^^^^^ File "<string>", line 5, in <module> File "/nix/store/1v002aslhnn …
container-test-run-dm-wireguard-star:
    ~~~~^^^^^^^^^^^^^^^^^^^^^^^^^^^^^^^^^^^^^^^^^^^^
  File "<string>", line 5, in <module>
  File "/nix/store/1v002aslhnn1b7kr1fq8m14lldran2b0-test-driver-0.0.1/lib/python3.13/site-packages/test_driver/__init__.py", line 467, in wait_for_unit
    retry(check_active, timeout)
    ~~~~~^^^^^^^^^^^^^^^^^^^^^^^
  File "/nix/store/1v002aslhnn1b7kr1fq8m14lldran2b0-test-driver-0.0.1/lib/python3.13/site-packages/test_driver/__init__.py", line 202, in retry
    raise Error(msg)
test_driver.Error: action timed out after 900 seconds
failed checks.aarch64-linux.pocket-id 4m 29s
container-test-run-pocket-id: Oct 02 05:06:40 server pocket-id-clients-reconcile[321]: curl: (7) Failed to connect to 127.0.0.1:1411 after 0 ms: Could not conne …
container-test-run-pocket-id:
Oct 02 05:06:40 server pocket-id-clients-reconcile[321]: curl: (7) Failed to connect to 127.0.0.1:1411 after 0 ms: Could not connect to server
Oct 02 05:06:41 server pocket-id-clients-reconcile[399]: curl: (7) Failed to connect to 127.0.0.1:1411 after 0 ms: Could not connect to server
Oct 02 05:06:42 server pocket-id-clients-reconcile[407]: [dashboard] create
Oct 02 05:06:42 server pocket-id-clients-reconcile[414]: curl: (22) The requested URL returned error: 404
Oct 02 05:06:42 server systemd[1]: pocket-id-clients.service: Main process exited, code=exited, status=22/n/a
Oct 02 05:06:42 server systemd[1]: pocket-id-clients.service: Failed with result 'exit-code'.
Oct 02 05:06:42 server systemd[1]: Failed to start Reconcile Pocket ID OIDC clients against the clan-declared spec.
failed checks.aarch64-linux.punchcard 4m 16s
container-test-run-punchcard: Status: "loading new config: loading http app module: provision http: getting tls app: loading tls app module: provision tls: …
container-test-run-punchcard:
     Status: "loading new config: loading http app module: provision http: getting tls app: loading tls app module: provision tls: loading certificates: tls: private key does not match public key"
        CPU: 480ms
Oct 02 05:06:37 server systemd[1]: Starting Caddy...
Oct 02 05:06:37 server caddy[386]: Error: loading initial config: loading new config: loading http app module: provision http: getting tls app: loading tls app module: provision tls: loading certificates: tls: private key does not match public key
Oct 02 05:06:37 server systemd[1]: Started Caddy.
Oct 02 05:06:37 server systemd[1]: caddy.service: Main process exited, code=exited, status=1/FAILURE
Oct 02 05:06:37 server systemd[1]: caddy.service: Failed with result 'exit-code'.
failed checks.x86_64-linux.authelia 1m 5s
container-test-run-authelia: Status: "loading new config: loading tls app module: provision tls: loading certificates: tls: private key does not match publ …
container-test-run-authelia:
     Status: "loading new config: loading tls app module: provision tls: loading certificates: tls: private key does not match public key"
        CPU: 294ms
Oct 02 05:03:25 server systemd[1]: Starting Caddy...
Oct 02 05:03:26 server caddy[405]: Error: loading initial config: loading new config: loading tls app module: provision tls: loading certificates: tls: private key does not match public key
Oct 02 05:03:26 server systemd[1]: Started Caddy.
Oct 02 05:03:26 server systemd[1]: caddy.service: Main process exited, code=exited, status=1/FAILURE
Oct 02 05:03:26 server systemd[1]: caddy.service: Failed with result 'exit-code'.
failed checks.x86_64-linux.dm-wireguard-star 16m 10s
container-test-run-dm-wireguard-star: ~~~~^^^^^^^^^^^^^^^^^^^^^^^^^^^^^^^^^^^^^^^^^^^^ File "<string>", line 5, in <module> File "/nix/store/7pcwg3l52sf …
container-test-run-dm-wireguard-star:
    ~~~~^^^^^^^^^^^^^^^^^^^^^^^^^^^^^^^^^^^^^^^^^^^^
  File "<string>", line 5, in <module>
  File "/nix/store/7pcwg3l52sff9p90k03qhavpaqk1zhfi-test-driver-0.0.1/lib/python3.13/site-packages/test_driver/__init__.py", line 467, in wait_for_unit
    retry(check_active, timeout)
    ~~~~~^^^^^^^^^^^^^^^^^^^^^^^
  File "/nix/store/7pcwg3l52sff9p90k03qhavpaqk1zhfi-test-driver-0.0.1/lib/python3.13/site-packages/test_driver/__init__.py", line 202, in retry
    raise Error(msg)
test_driver.Error: action timed out after 900 seconds
failed checks.x86_64-linux.pocket-id 44s
container-test-run-pocket-id: Oct 02 05:02:57 server systemd[1]: Starting Reconcile Pocket ID OIDC clients against the clan-declared spec... Oct 02 05:02:57 ser …
container-test-run-pocket-id:
Oct 02 05:02:57 server systemd[1]: Starting Reconcile Pocket ID OIDC clients against the clan-declared spec...
Oct 02 05:02:57 server pocket-id-clients-reconcile[321]: curl: (7) Failed to connect to 127.0.0.1:1411 after 0 ms: Could not connect to server
Oct 02 05:02:58 server pocket-id-clients-reconcile[382]: [dashboard] create
Oct 02 05:02:58 server pocket-id-clients-reconcile[389]: curl: (22) The requested URL returned error: 404
Oct 02 05:02:58 server systemd[1]: pocket-id-clients.service: Main process exited, code=exited, status=22/n/a
Oct 02 05:02:58 server systemd[1]: pocket-id-clients.service: Failed with result 'exit-code'.
Oct 02 05:02:58 server systemd[1]: Failed to start Reconcile Pocket ID OIDC clients against the clan-declared spec.
failed checks.x86_64-linux.punchcard 1m 2s
container-test-run-punchcard: Status: "loading new config: loading http app module: provision http: getting tls app: loading tls app module: provision tls: …
container-test-run-punchcard:
     Status: "loading new config: loading http app module: provision http: getting tls app: loading tls app module: provision tls: loading certificates: tls: private key does not match public key"
        CPU: 296ms
Oct 02 05:03:22 server systemd[1]: Starting Caddy...
Oct 02 05:03:22 server caddy[387]: Error: loading initial config: loading new config: loading http app module: provision http: getting tls app: loading tls app module: provision tls: loading certificates: tls: private key does not match public key
Oct 02 05:03:22 server systemd[1]: Started Caddy.
Oct 02 05:03:22 server systemd[1]: caddy.service: Main process exited, code=exited, status=1/FAILURE
Oct 02 05:03:22 server systemd[1]: caddy.service: Failed with result 'exit-code'.
10 succeeded ⚠ 1
succeeded attributes
status attribute duration
succeeded checks.aarch64-darwin.nix-unit
  • Dependency of package 'nix-unit' uses a nested list in attribute 'nativeBuildInputs'. This is deprecated as of Nixpkgs release 26.05, and support will be removed in a future nixpkgs release.
26s
succeeded checks.aarch64-darwin.treefmt 4s
succeeded checks.aarch64-linux.coredns 4m 4s
succeeded checks.aarch64-linux.nix-unit 23s
succeeded checks.aarch64-linux.treefmt 4s
succeeded checks.aarch64-linux.webapps 3m 35s
succeeded checks.x86_64-linux.coredns 1m 16s
succeeded checks.x86_64-linux.nix-unit 15s
succeeded checks.x86_64-linux.treefmt 4s
succeeded checks.x86_64-linux.webapps 1m 7s
8 already built
skipped attributes
status attribute duration
loading…