nixbot

builds

clan/clan-community build #211 failed

branch 26.05 · PR #218 · commit 560026c05b · · took 15m 53s · eval 27s

eval warnings 1 kind · 1 occurrence
  • warn Dependency of package 'nix-unit' uses a nested list in attribute 'nativeBuildInputs'. ×1

8 failed
failed attributes
status attribute duration
failed checks.aarch64-linux.authelia 8s
container-test-run-authelia: Status: "loading new config: loading http app module: provision http: getting tls app: loading tls app module: provision tls: …
container-test-run-authelia:
     Status: "loading new config: loading http app module: provision http: getting tls app: loading tls app module: provision tls: loading certificates: tls: private key does not match public key"
        CPU: 510ms
Oct 02 10:09:16 server systemd[1]: Starting Caddy...
Oct 02 10:09:17 server caddy[403]: Error: loading initial config: loading new config: loading http app module: provision http: getting tls app: loading tls app module: provision tls: loading certificates: tls: private key does not match public key
Oct 02 10:09:17 server systemd[1]: Started Caddy.
Oct 02 10:09:17 server systemd[1]: caddy.service: Main process exited, code=exited, status=1/FAILURE
Oct 02 10:09:17 server systemd[1]: caddy.service: Failed with result 'exit-code'.
failed checks.aarch64-linux.dm-wireguard-star 15m 25s
container-test-run-dm-wireguard-star: ~~~~^^^^^^^^^^^^^^^^^^^^^^^^^^^^^^^^^^^^^^^^^^^^ File "<string>", line 5, in <module> File "/nix/store/1v002aslhnn …
container-test-run-dm-wireguard-star:
    ~~~~^^^^^^^^^^^^^^^^^^^^^^^^^^^^^^^^^^^^^^^^^^^^
  File "<string>", line 5, in <module>
  File "/nix/store/1v002aslhnn1b7kr1fq8m14lldran2b0-test-driver-0.0.1/lib/python3.13/site-packages/test_driver/__init__.py", line 467, in wait_for_unit
    retry(check_active, timeout)
    ~~~~~^^^^^^^^^^^^^^^^^^^^^^^
  File "/nix/store/1v002aslhnn1b7kr1fq8m14lldran2b0-test-driver-0.0.1/lib/python3.13/site-packages/test_driver/__init__.py", line 202, in retry
    raise Error(msg)
test_driver.Error: action timed out after 900 seconds
failed checks.aarch64-linux.pocket-id 7s
container-test-run-pocket-id: Oct 02 10:09:09 server pocket-id-clients-reconcile[322]: curl: (7) Failed to connect to 127.0.0.1:1411 after 0 ms: Could not conne …
container-test-run-pocket-id:
Oct 02 10:09:09 server pocket-id-clients-reconcile[322]: curl: (7) Failed to connect to 127.0.0.1:1411 after 0 ms: Could not connect to server
Oct 02 10:09:10 server pocket-id-clients-reconcile[398]: curl: (7) Failed to connect to 127.0.0.1:1411 after 0 ms: Could not connect to server
Oct 02 10:09:11 server pocket-id-clients-reconcile[404]: [dashboard] create
Oct 02 10:09:11 server pocket-id-clients-reconcile[412]: curl: (22) The requested URL returned error: 404
Oct 02 10:09:11 server systemd[1]: pocket-id-clients.service: Main process exited, code=exited, status=22/n/a
Oct 02 10:09:11 server systemd[1]: pocket-id-clients.service: Failed with result 'exit-code'.
Oct 02 10:09:11 server systemd[1]: Failed to start Reconcile Pocket ID OIDC clients against the clan-declared spec.
failed checks.aarch64-linux.punchcard 8s
container-test-run-punchcard: Status: "loading new config: loading http app module: provision http: getting tls app: loading tls app module: provision tls: …
container-test-run-punchcard:
     Status: "loading new config: loading http app module: provision http: getting tls app: loading tls app module: provision tls: loading certificates: tls: private key does not match public key"
        CPU: 490ms
Oct 02 10:09:16 server systemd[1]: Starting Caddy...
Oct 02 10:09:17 server caddy[385]: Error: loading initial config: loading new config: loading http app module: provision http: getting tls app: loading tls app module: provision tls: loading certificates: tls: private key does not match public key
Oct 02 10:09:17 server systemd[1]: Started Caddy.
Oct 02 10:09:17 server systemd[1]: caddy.service: Main process exited, code=exited, status=1/FAILURE
Oct 02 10:09:17 server systemd[1]: caddy.service: Failed with result 'exit-code'.
failed checks.x86_64-linux.authelia 7s
container-test-run-authelia: Status: "loading new config: loading tls app module: provision tls: loading certificates: tls: private key does not match publ …
container-test-run-authelia:
     Status: "loading new config: loading tls app module: provision tls: loading certificates: tls: private key does not match public key"
        CPU: 356ms
Oct 02 10:09:15 server systemd[1]: Starting Caddy...
Oct 02 10:09:16 server caddy[404]: Error: loading initial config: loading new config: loading tls app module: provision tls: loading certificates: tls: private key does not match public key
Oct 02 10:09:16 server systemd[1]: Started Caddy.
Oct 02 10:09:16 server systemd[1]: caddy.service: Main process exited, code=exited, status=1/FAILURE
Oct 02 10:09:16 server systemd[1]: caddy.service: Failed with result 'exit-code'.
failed checks.x86_64-linux.dm-wireguard-star 15m 12s
container-test-run-dm-wireguard-star: ~~~~^^^^^^^^^^^^^^^^^^^^^^^^^^^^^^^^^^^^^^^^^^^^ File "<string>", line 5, in <module> File "/nix/store/7pcwg3l52sf …
container-test-run-dm-wireguard-star:
    ~~~~^^^^^^^^^^^^^^^^^^^^^^^^^^^^^^^^^^^^^^^^^^^^
  File "<string>", line 5, in <module>
  File "/nix/store/7pcwg3l52sff9p90k03qhavpaqk1zhfi-test-driver-0.0.1/lib/python3.13/site-packages/test_driver/__init__.py", line 467, in wait_for_unit
    retry(check_active, timeout)
    ~~~~~^^^^^^^^^^^^^^^^^^^^^^^
  File "/nix/store/7pcwg3l52sff9p90k03qhavpaqk1zhfi-test-driver-0.0.1/lib/python3.13/site-packages/test_driver/__init__.py", line 202, in retry
    raise Error(msg)
test_driver.Error: action timed out after 900 seconds
failed checks.x86_64-linux.pocket-id 5s
container-test-run-pocket-id: Oct 02 10:09:08 server systemd[1]: Starting Reconcile Pocket ID OIDC clients against the clan-declared spec... Oct 02 10:09:08 ser …
container-test-run-pocket-id:
Oct 02 10:09:08 server systemd[1]: Starting Reconcile Pocket ID OIDC clients against the clan-declared spec...
Oct 02 10:09:08 server pocket-id-clients-reconcile[321]: curl: (7) Failed to connect to 127.0.0.1:1411 after 0 ms: Could not connect to server
Oct 02 10:09:09 server pocket-id-clients-reconcile[385]: [dashboard] create
Oct 02 10:09:09 server pocket-id-clients-reconcile[392]: curl: (22) The requested URL returned error: 404
Oct 02 10:09:09 server systemd[1]: pocket-id-clients.service: Main process exited, code=exited, status=22/n/a
Oct 02 10:09:09 server systemd[1]: pocket-id-clients.service: Failed with result 'exit-code'.
Oct 02 10:09:09 server systemd[1]: Failed to start Reconcile Pocket ID OIDC clients against the clan-declared spec.
failed checks.x86_64-linux.punchcard 6s
container-test-run-punchcard: Status: "loading new config: loading http app module: provision http: getting tls app: loading tls app module: provision tls: …
container-test-run-punchcard:
     Status: "loading new config: loading http app module: provision http: getting tls app: loading tls app module: provision tls: loading certificates: tls: private key does not match public key"
        CPU: 347ms
Oct 02 10:09:15 server systemd[1]: Starting Caddy...
Oct 02 10:09:16 server caddy[388]: Error: loading initial config: loading new config: loading http app module: provision http: getting tls app: loading tls app module: provision tls: loading certificates: tls: private key does not match public key
Oct 02 10:09:16 server systemd[1]: Started Caddy.
Oct 02 10:09:16 server systemd[1]: caddy.service: Main process exited, code=exited, status=1/FAILURE
Oct 02 10:09:16 server systemd[1]: caddy.service: Failed with result 'exit-code'.
5 succeeded ⚠ 1
succeeded attributes
status attribute duration
succeeded checks.aarch64-darwin.nix-unit
  • Dependency of package 'nix-unit' uses a nested list in attribute 'nativeBuildInputs'. This is deprecated as of Nixpkgs release 26.05, and support will be removed in a future nixpkgs release.
54s
succeeded checks.aarch64-darwin.treefmt 4s
succeeded checks.aarch64-linux.nix-unit 23s
succeeded checks.aarch64-linux.treefmt 3s
succeeded checks.x86_64-linux.nix-unit 27s
13 already built
skipped attributes
status attribute duration
loading…