nixbot

builds

clan/clan-community build #245 failed

branch 26.05 · PR #248 · commit 547ccd4352 · · took 2m 33s · eval 1m 16s

eval warnings 17 kinds · 113 occurrences
  • error …-merged-test-dir-punchcard.drv: build-x86-01: build-x86-01: input not substitutable: error: path '/nix/store/…-test-vars-generated' is required, but there is no substituter that can build it, asking the scheduler again ×18
  • error …-merged-test-dir-pocket-id.drv: build-x86-01: build-x86-01: input not substitutable: error: path '/nix/store/…-test-vars-generated' is required, but there is no substituter that can build it, asking the scheduler again ×6
  • error …-merged-test-dir-dm-wireguard-star.drv: gi-build-x86-02: gi-build-x86-02: input not substitutable: error: path '/nix/store/…-test-vars-generated' is required, but there is no substituter that can build it, asking the scheduler again ×9
  • error ×11
  • error build of '/nix/store/…-merged-test-dir-dm-wireguard-star.drv^out' failed: error: gave up after 9 reschedules ×2
  • error build of '/nix/store/…-merged-test-dir-punchcard.drv^out' failed: error: gave up after 9 reschedules ×2
  • error …-merged-test-dir-wifi.drv: build-x86-01: build-x86-01: input not substitutable: error: path '/nix/store/…-test-vars-generated' is required, but there is no substituter that can build it, asking the scheduler again ×9
  • error …-merged-test-dir-authelia.drv: build-x86-01: build-x86-01: input not substitutable: error: path '/nix/store/…-test-vars-generated' is required, but there is no substituter that can build it, asking the scheduler again ×18
  • error build of '/nix/store/…-merged-test-dir-wifi.drv^out' failed: error: gave up after 9 reschedules ×1
  • error build of '/nix/store/…-merged-test-dir-authelia.drv^out' failed: error: gave up after 9 reschedules ×2
  • error …-merged-test-dir-dm-wireguard-star.drv: build-x86-01: build-x86-01: input not substitutable: error: path '/nix/store/…-test-vars-generated' is required, but there is no substituter that can build it, asking the scheduler again ×9
  • error …-merged-test-dir-webapps.drv: build-x86-01: build-x86-01: input not substitutable: error: path '/nix/store/…-test-vars-generated' is required, but there is no substituter that can build it, asking the scheduler again ×8
  • error …-merged-test-dir-coredns.drv: gi-build-x86-02: gi-build-x86-02: input not substitutable: error: path '/nix/store/…-test-vars-generated' is required, but there is no substituter that can build it, asking the scheduler again ×12
  • error …-merged-test-dir-webapps.drv: gi-build-x86-02: gi-build-x86-02: input not substitutable: error: path '/nix/store/…-test-vars-generated' is required, but there is no substituter that can build it, asking the scheduler again ×1
  • error build of '/nix/store/…-merged-test-dir-webapps.drv^out' failed: error: gave up after 9 reschedules ×2
  • error build of '/nix/store/…-merged-test-dir-coredns.drv^out' failed: error: gave up after 9 reschedules ×2
  • warn Dependency of package 'nix-unit' uses a nested list in attribute 'nativeBuildInputs'. ×1

17 failed ⚠ 1
failed attributes
status attribute duration
failed checks.aarch64-darwin.nix-unit
  • Dependency of package 'nix-unit' uses a nested list in attribute 'nativeBuildInputs'. This is deprecated as of Nixpkgs release 26.05, and support will be removed in a future nixpkgs release.
2m 0s
setup: don't know how to build these paths: /nix/store/197sbjrmj0asj6czcc01401qx6bw26h2-nix-unit-check.drv warning: ignoring the client-specified setting 'sto …
setup:
don't know how to build these paths:
  /nix/store/197sbjrmj0asj6czcc01401qx6bw26h2-nix-unit-check.drv
warning: ignoring the client-specified setting 'store', because it is a restricted setting and you are not a trusted user
warning: 197sbjrmj0asj6czcc01401qx6bw26h2-nix-unit-check.drv: no connected, non-draining worker for system 'aarch64-darwin' offers features {}, the workers offer {}, waiting up to 120s for a worker
197sbjrmj0asj6czcc01401qx6bw26h2-nix-unit-check.drv: no connected, non-draining worker for system 'aarch64-darwin' offers features {}, the workers offer {}
error: no connected, non-draining worker for system 'aarch64-darwin' offers features {}, the workers offer {}
failed checks.aarch64-darwin.treefmt 2m 2s
setup: /nix/store/papzdc7ngbiyvgymzcygb0xp13cpis48-xz-5.8.4-bin /nix/store/476zsjqic4kbjk43p27m165b5flfqr8l-zlib-1.3.2 /nix/store/5ds9fysxln35sqh4krqw9imr …
setup:
  /nix/store/papzdc7ngbiyvgymzcygb0xp13cpis48-xz-5.8.4-bin
  /nix/store/476zsjqic4kbjk43p27m165b5flfqr8l-zlib-1.3.2
  /nix/store/5ds9fysxln35sqh4krqw9imr4m5lnr1q-zlib-ng-2.3.3
  /nix/store/mxajghyzvi968fzv2vcwq368mxi92niw-zstd-1.5.7
warning: ignoring the client-specified setting 'store', because it is a restricted setting and you are not a trusted user
warning: z92cfs6kkr6lrdc20k971sqy53zyby9y-treefmt-check.drv: no connected, non-draining worker for system 'aarch64-darwin' offers features {}, the workers offer {}, waiting up to 120s for a worker
z92cfs6kkr6lrdc20k971sqy53zyby9y-treefmt-check.drv: no connected, non-draining worker for system 'aarch64-darwin' offers features {}, the workers offer {}
error: no connected, non-draining worker for system 'aarch64-darwin' offers features {}, the workers offer {}
failed eval checks.aarch64-linux.authelia —
error: … while evaluating the attribute 'drvPath' at «https://releases.nixos.org/nixos/26.05/nixos-26.05.11045.774debe7a0d1/nixexprs.tar.xz?narH …
error:
       … while evaluating the attribute 'drvPath'
         at «https://releases.nixos.org/nixos/26.05/nixos-26.05.11045.774debe7a0d1/nixexprs.tar.xz?narHash=sha256-S5MjznoY0gbQbcANPLz5RYjg%2B5/WQmFRgNbHcP%2Bydcg%3D»/lib/customisation.nix:427:7:
          426|     // {
          427|       drvPath =
             |       ^
          428|         assert condition;

       … while calling the 'derivationStrict' builtin
         at «nix-internal»/derivation-internal.nix:37:12:
           36|
           37|   strict = derivationStrict drvAttrs;
             |            ^
           38|

       … while evaluating the option `nodes.server.networking.interfaces':

       … while evaluating definitions from `/nix/store/csk881ggvmifg4qf1cal0r1ffflbmlhp-source/nixos/modules/hardware/facter/networking':

       … while evaluating the option `nodes.server.hardware.facter.enable':

       … while evaluating the option `nodes.server.hardware.facter.report':

       … while evaluating the option `nodes.server.hardware.facter.reportPath':

       … while evaluating definitions from `/nix/store/ws2m25334bs7klda239x7sd7y2kp07hc-source/nixosModules/clanCore/nixos-facter.nix':

       (stack trace truncated; use '--show-trace' to show the full, detailed trace)

       error: build of '/nix/store/salgxlvi1ahhxkvjvjy5bric658hgp0j-merged-test-dir-authelia.drv^out' failed: error: gave up after 9 reschedules
failed eval checks.aarch64-linux.coredns —
error: … while evaluating the attribute 'drvPath' at «https://releases.nixos.org/nixos/26.05/nixos-26.05.11045.774debe7a0d1/nixexprs.tar.xz?narH …
error:
       … while evaluating the attribute 'drvPath'
         at «https://releases.nixos.org/nixos/26.05/nixos-26.05.11045.774debe7a0d1/nixexprs.tar.xz?narHash=sha256-S5MjznoY0gbQbcANPLz5RYjg%2B5/WQmFRgNbHcP%2Bydcg%3D»/lib/customisation.nix:427:7:
          426|     // {
          427|       drvPath =
             |       ^
          428|         assert condition;

       … while calling the 'derivationStrict' builtin
         at «nix-internal»/derivation-internal.nix:37:12:
           36|
           37|   strict = derivationStrict drvAttrs;
             |            ^
           38|

       … while evaluating the option `nodes.client.networking.interfaces':

       … while evaluating definitions from `/nix/store/csk881ggvmifg4qf1cal0r1ffflbmlhp-source/nixos/modules/hardware/facter/networking':

       … while evaluating the option `nodes.client.hardware.facter.enable':

       … while evaluating the option `nodes.client.hardware.facter.report':

       … while evaluating the option `nodes.client.hardware.facter.reportPath':

       … while evaluating definitions from `/nix/store/ws2m25334bs7klda239x7sd7y2kp07hc-source/nixosModules/clanCore/nixos-facter.nix':

       (stack trace truncated; use '--show-trace' to show the full, detailed trace)

       error: build of '/nix/store/pcipjh8vbg1fnxx0isv0vzi21q9i0ckr-merged-test-dir-coredns.drv^out' failed: error: gave up after 9 reschedules
failed eval checks.aarch64-linux.dm-wireguard-star —
error: … while evaluating the attribute 'drvPath' at «https://releases.nixos.org/nixos/26.05/nixos-26.05.11045.774debe7a0d1/nixexprs.tar.xz?narH …
error:
       … while evaluating the attribute 'drvPath'
         at «https://releases.nixos.org/nixos/26.05/nixos-26.05.11045.774debe7a0d1/nixexprs.tar.xz?narHash=sha256-S5MjznoY0gbQbcANPLz5RYjg%2B5/WQmFRgNbHcP%2Bydcg%3D»/lib/customisation.nix:427:7:
          426|     // {
          427|       drvPath =
             |       ^
          428|         assert condition;

       … while calling the 'derivationStrict' builtin
         at «nix-internal»/derivation-internal.nix:37:12:
           36|
           37|   strict = derivationStrict drvAttrs;
             |            ^
           38|

       … while evaluating the option `nodes.controller.networking.interfaces':

       … while evaluating definitions from `/nix/store/csk881ggvmifg4qf1cal0r1ffflbmlhp-source/nixos/modules/hardware/facter/networking':

       … while evaluating the option `nodes.controller.hardware.facter.enable':

       … while evaluating the option `nodes.controller.hardware.facter.report':

       … while evaluating the option `nodes.controller.hardware.facter.reportPath':

       … while evaluating definitions from `/nix/store/ws2m25334bs7klda239x7sd7y2kp07hc-source/nixosModules/clanCore/nixos-facter.nix':

       (stack trace truncated; use '--show-trace' to show the full, detailed trace)

       error: build of '/nix/store/h22vlvza8nhkbwqm498xd6lzbbb2mx9m-merged-test-dir-dm-wireguard-star.drv^out' failed: error: gave up after 9 reschedules
failed checks.aarch64-linux.nix-unit 14s
setup: v37csrgblpa6ib18avr0lrg355vm7pzv-nix-unit-check.drv: build01: build01: input not substitutable: error: path '/nix/store/wl748g7i5xrpd008gggal2qbkz5iwb9f- …
setup:
v37csrgblpa6ib18avr0lrg355vm7pzv-nix-unit-check.drv: build01: build01: input not substitutable: error: path '/nix/store/wl748g7i5xrpd008gggal2qbkz5iwb9f-nix-unit-2.35.1' is required, but there is no substituter that can build it, asking the scheduler again
v37csrgblpa6ib18avr0lrg355vm7pzv-nix-unit-check.drv: build01: build01: input not substitutable: error: path '/nix/store/wl748g7i5xrpd008gggal2qbkz5iwb9f-nix-unit-2.35.1' is required, but there is no substituter that can build it, asking the scheduler again
v37csrgblpa6ib18avr0lrg355vm7pzv-nix-unit-check.drv: build01: build01: input not substitutable: error: path '/nix/store/wl748g7i5xrpd008gggal2qbkz5iwb9f-nix-unit-2.35.1' is required, but there is no substituter that can build it, asking the scheduler again
v37csrgblpa6ib18avr0lrg355vm7pzv-nix-unit-check.drv: build01: build01: input not substitutable: error: path '/nix/store/wl748g7i5xrpd008gggal2qbkz5iwb9f-nix-unit-2.35.1' is required, but there is no substituter that can build it, asking the scheduler again
v37csrgblpa6ib18avr0lrg355vm7pzv-nix-unit-check.drv: build01: build01: input not substitutable: error: path '/nix/store/wl748g7i5xrpd008gggal2qbkz5iwb9f-nix-unit-2.35.1' is required, but there is no substituter that can build it, asking the scheduler again
v37csrgblpa6ib18avr0lrg355vm7pzv-nix-unit-check.drv: build01: build01: input not substitutable: error: path '/nix/store/wl748g7i5xrpd008gggal2qbkz5iwb9f-nix-unit-2.35.1' is required, but there is no substituter that can build it, asking the scheduler again
v37csrgblpa6ib18avr0lrg355vm7pzv-nix-unit-check.drv: build01: build01: input not substitutable: error: path '/nix/store/wl748g7i5xrpd008gggal2qbkz5iwb9f-nix-unit-2.35.1' is required, but there is no substituter that can build it, asking the scheduler again
error: gave up after 9 reschedules
failed checks.aarch64-linux.pocket-id 7s
setup: /nix/store/s7mnqvr1ikjkqf0li81rsy3khjm8sl49-zlib-1.3.2 /nix/store/pwwpmwjdmk34smyfkf61ksyp7h5kdv45-zlib-1.3.2-static /nix/store/6fhxdm9f25c7h86nadf …
setup:
  /nix/store/s7mnqvr1ikjkqf0li81rsy3khjm8sl49-zlib-1.3.2
  /nix/store/pwwpmwjdmk34smyfkf61ksyp7h5kdv45-zlib-1.3.2-static
  /nix/store/6fhxdm9f25c7h86nadfy8qim4h9hq04d-zlib-ng-2.3.3
  /nix/store/i8f26lwk8i93hmiyrmsy752m6nwi4pmk-zstd-1.5.7
  /nix/store/01623a8kcyp04gbqsal6fys34yfigd02-zstd-1.5.7-bin
warning: ignoring the client-specified setting 'store', because it is a restricted setting and you are not a trusted user
g2zqgdq7g5vsfdpx6ry03k56fcx0cmwj-container-test-run-pocket-id.drv: error: gRPC AddMultipleToStore on 'nix-store.geninf.io:50051' failed: error: some references of path '/nix/store/n2p02gjiqfhl4sy08ay55klv7jbz845l-perl-5.42.0-env.drv' could not be realised
error: error: gRPC AddMultipleToStore on 'nix-store.geninf.io:50051' failed: error: some references of path '/nix/store/n2p02gjiqfhl4sy08ay55klv7jbz845l-perl-5.42.0-env.drv' could not be realised
failed eval checks.aarch64-linux.punchcard —
error: … while evaluating the attribute 'drvPath' at «https://releases.nixos.org/nixos/26.05/nixos-26.05.11045.774debe7a0d1/nixexprs.tar.xz?narH …
error:
       … while evaluating the attribute 'drvPath'
         at «https://releases.nixos.org/nixos/26.05/nixos-26.05.11045.774debe7a0d1/nixexprs.tar.xz?narHash=sha256-S5MjznoY0gbQbcANPLz5RYjg%2B5/WQmFRgNbHcP%2Bydcg%3D»/lib/customisation.nix:427:7:
          426|     // {
          427|       drvPath =
             |       ^
          428|         assert condition;

       … while calling the 'derivationStrict' builtin
         at «nix-internal»/derivation-internal.nix:37:12:
           36|
           37|   strict = derivationStrict drvAttrs;
             |            ^
           38|

       … while evaluating the option `nodes.server.networking.interfaces':

       … while evaluating definitions from `/nix/store/csk881ggvmifg4qf1cal0r1ffflbmlhp-source/nixos/modules/hardware/facter/networking':

       … while evaluating the option `nodes.server.hardware.facter.enable':

       … while evaluating the option `nodes.server.hardware.facter.report':

       … while evaluating the option `nodes.server.hardware.facter.reportPath':

       … while evaluating definitions from `/nix/store/ws2m25334bs7klda239x7sd7y2kp07hc-source/nixosModules/clanCore/nixos-facter.nix':

       (stack trace truncated; use '--show-trace' to show the full, detailed trace)

       error: build of '/nix/store/969xyh8l8127sck596mnn2363hdw5ldm-merged-test-dir-punchcard.drv^out' failed: error: gave up after 9 reschedules
failed checks.aarch64-linux.treefmt 16s
setup: zp1yrf2j65gz8y17xa0k158152qsa9hs-treefmt-check.drv: build01: build01: input not substitutable: error: some references of path '/nix/store/b59rwab6z16av0h …
setup:
zp1yrf2j65gz8y17xa0k158152qsa9hs-treefmt-check.drv: build01: build01: input not substitutable: error: some references of path '/nix/store/b59rwab6z16av0hxz93wv63kzwglyqq5-treefmt' could not be realised, asking the scheduler again
zp1yrf2j65gz8y17xa0k158152qsa9hs-treefmt-check.drv: build01: build01: input not substitutable: error: some references of path '/nix/store/b59rwab6z16av0hxz93wv63kzwglyqq5-treefmt' could not be realised, asking the scheduler again
zp1yrf2j65gz8y17xa0k158152qsa9hs-treefmt-check.drv: build01: build01: input not substitutable: error: some references of path '/nix/store/b59rwab6z16av0hxz93wv63kzwglyqq5-treefmt' could not be realised, asking the scheduler again
zp1yrf2j65gz8y17xa0k158152qsa9hs-treefmt-check.drv: build01: build01: input not substitutable: error: some references of path '/nix/store/b59rwab6z16av0hxz93wv63kzwglyqq5-treefmt' could not be realised, asking the scheduler again
zp1yrf2j65gz8y17xa0k158152qsa9hs-treefmt-check.drv: build01: build01: input not substitutable: error: some references of path '/nix/store/b59rwab6z16av0hxz93wv63kzwglyqq5-treefmt' could not be realised, asking the scheduler again
zp1yrf2j65gz8y17xa0k158152qsa9hs-treefmt-check.drv: build01: build01: input not substitutable: error: some references of path '/nix/store/b59rwab6z16av0hxz93wv63kzwglyqq5-treefmt' could not be realised, asking the scheduler again
zp1yrf2j65gz8y17xa0k158152qsa9hs-treefmt-check.drv: build01: build01: input not substitutable: error: some references of path '/nix/store/b59rwab6z16av0hxz93wv63kzwglyqq5-treefmt' could not be realised, asking the scheduler again
error: gave up after 9 reschedules
failed eval checks.aarch64-linux.webapps —
error: … while evaluating the attribute 'drvPath' at «https://releases.nixos.org/nixos/26.05/nixos-26.05.11045.774debe7a0d1/nixexprs.tar.xz?narH …
error:
       … while evaluating the attribute 'drvPath'
         at «https://releases.nixos.org/nixos/26.05/nixos-26.05.11045.774debe7a0d1/nixexprs.tar.xz?narHash=sha256-S5MjznoY0gbQbcANPLz5RYjg%2B5/WQmFRgNbHcP%2Bydcg%3D»/lib/customisation.nix:427:7:
          426|     // {
          427|       drvPath =
             |       ^
          428|         assert condition;

       … while calling the 'derivationStrict' builtin
         at «nix-internal»/derivation-internal.nix:37:12:
           36|
           37|   strict = derivationStrict drvAttrs;
             |            ^
           38|

       … while evaluating the option `nodes.server.networking.interfaces':

       … while evaluating definitions from `/nix/store/csk881ggvmifg4qf1cal0r1ffflbmlhp-source/nixos/modules/hardware/facter/networking':

       … while evaluating the option `nodes.server.hardware.facter.enable':

       … while evaluating the option `nodes.server.hardware.facter.report':

       … while evaluating the option `nodes.server.hardware.facter.reportPath':

       … while evaluating definitions from `/nix/store/ws2m25334bs7klda239x7sd7y2kp07hc-source/nixosModules/clanCore/nixos-facter.nix':

       (stack trace truncated; use '--show-trace' to show the full, detailed trace)

       error: build of '/nix/store/l9fvzh7hax1927225li1p8lkq6hp7hgv-merged-test-dir-webapps.drv^out' failed: error: gave up after 9 reschedules
failed eval checks.aarch64-linux.wifi —
error: … while evaluating the attribute 'drvPath' at «https://releases.nixos.org/nixos/26.05/nixos-26.05.11045.774debe7a0d1/nixexprs.tar.xz?narH …
error:
       … while evaluating the attribute 'drvPath'
         at «https://releases.nixos.org/nixos/26.05/nixos-26.05.11045.774debe7a0d1/nixexprs.tar.xz?narHash=sha256-S5MjznoY0gbQbcANPLz5RYjg%2B5/WQmFRgNbHcP%2Bydcg%3D»/lib/customisation.nix:427:7:
          426|     // {
          427|       drvPath =
             |       ^
          428|         assert condition;

       … while calling the 'derivationStrict' builtin
         at «nix-internal»/derivation-internal.nix:37:12:
           36|
           37|   strict = derivationStrict drvAttrs;
             |            ^
           38|

       … while evaluating the option `driverConfiguration.vlans':

       … while evaluating definitions from `/nix/store/csk881ggvmifg4qf1cal0r1ffflbmlhp-source/nixos/lib/testing/driver-configuration.nix':

       … while evaluating the option `nodes.second.networking.interfaces':

       … while evaluating definitions from `/nix/store/csk881ggvmifg4qf1cal0r1ffflbmlhp-source/nixos/modules/hardware/facter/networking':

       … while evaluating the option `nodes.second.hardware.facter.enable':

       … while evaluating the option `nodes.second.hardware.facter.report':

       … while evaluating the option `nodes.second.hardware.facter.reportPath':

       … while evaluating definitions from `/nix/store/ws2m25334bs7klda239x7sd7y2kp07hc-source/nixosModules/clanCore/nixos-facter.nix':

       (stack trace truncated; use '--show-trace' to show the full, detailed trace)

       error: build of '/nix/store/7l18qckfj3cg9psrpy5svygllq1fr4q0-merged-test-dir-wifi.drv^out' failed: error: gave up after 9 reschedules
failed eval checks.x86_64-linux.authelia —
error: … while evaluating the attribute 'drvPath' at «https://releases.nixos.org/nixos/26.05/nixos-26.05.11045.774debe7a0d1/nixexprs.tar.xz?narH …
error:
       … while evaluating the attribute 'drvPath'
         at «https://releases.nixos.org/nixos/26.05/nixos-26.05.11045.774debe7a0d1/nixexprs.tar.xz?narHash=sha256-S5MjznoY0gbQbcANPLz5RYjg%2B5/WQmFRgNbHcP%2Bydcg%3D»/lib/customisation.nix:427:7:
          426|     // {
          427|       drvPath =
             |       ^
          428|         assert condition;

       … while calling the 'derivationStrict' builtin
         at «nix-internal»/derivation-internal.nix:37:12:
           36|
           37|   strict = derivationStrict drvAttrs;
             |            ^
           38|

       … while evaluating the option `nodes.server.networking.interfaces':

       … while evaluating definitions from `/nix/store/csk881ggvmifg4qf1cal0r1ffflbmlhp-source/nixos/modules/hardware/facter/networking':

       … while evaluating the option `nodes.server.hardware.facter.enable':

       … while evaluating the option `nodes.server.hardware.facter.report':

       … while evaluating the option `nodes.server.hardware.facter.reportPath':

       … while evaluating definitions from `/nix/store/ws2m25334bs7klda239x7sd7y2kp07hc-source/nixosModules/clanCore/nixos-facter.nix':

       (stack trace truncated; use '--show-trace' to show the full, detailed trace)

       error: build of '/nix/store/salgxlvi1ahhxkvjvjy5bric658hgp0j-merged-test-dir-authelia.drv^out' failed: error: gave up after 9 reschedules
failed eval checks.x86_64-linux.coredns —
error: … while evaluating the attribute 'drvPath' at «https://releases.nixos.org/nixos/26.05/nixos-26.05.11045.774debe7a0d1/nixexprs.tar.xz?narH …
error:
       … while evaluating the attribute 'drvPath'
         at «https://releases.nixos.org/nixos/26.05/nixos-26.05.11045.774debe7a0d1/nixexprs.tar.xz?narHash=sha256-S5MjznoY0gbQbcANPLz5RYjg%2B5/WQmFRgNbHcP%2Bydcg%3D»/lib/customisation.nix:427:7:
          426|     // {
          427|       drvPath =
             |       ^
          428|         assert condition;

       … while calling the 'derivationStrict' builtin
         at «nix-internal»/derivation-internal.nix:37:12:
           36|
           37|   strict = derivationStrict drvAttrs;
             |            ^
           38|

       … while evaluating the option `nodes.client.networking.interfaces':

       … while evaluating definitions from `/nix/store/csk881ggvmifg4qf1cal0r1ffflbmlhp-source/nixos/modules/hardware/facter/networking':

       … while evaluating the option `nodes.client.hardware.facter.enable':

       … while evaluating the option `nodes.client.hardware.facter.report':

       … while evaluating the option `nodes.client.hardware.facter.reportPath':

       … while evaluating definitions from `/nix/store/ws2m25334bs7klda239x7sd7y2kp07hc-source/nixosModules/clanCore/nixos-facter.nix':

       (stack trace truncated; use '--show-trace' to show the full, detailed trace)

       error: build of '/nix/store/pcipjh8vbg1fnxx0isv0vzi21q9i0ckr-merged-test-dir-coredns.drv^out' failed: error: gave up after 9 reschedules
failed eval checks.x86_64-linux.dm-wireguard-star —
error: … while evaluating the attribute 'drvPath' at «https://releases.nixos.org/nixos/26.05/nixos-26.05.11045.774debe7a0d1/nixexprs.tar.xz?narH …
error:
       … while evaluating the attribute 'drvPath'
         at «https://releases.nixos.org/nixos/26.05/nixos-26.05.11045.774debe7a0d1/nixexprs.tar.xz?narHash=sha256-S5MjznoY0gbQbcANPLz5RYjg%2B5/WQmFRgNbHcP%2Bydcg%3D»/lib/customisation.nix:427:7:
          426|     // {
          427|       drvPath =
             |       ^
          428|         assert condition;

       … while calling the 'derivationStrict' builtin
         at «nix-internal»/derivation-internal.nix:37:12:
           36|
           37|   strict = derivationStrict drvAttrs;
             |            ^
           38|

       … while evaluating the option `nodes.controller.networking.interfaces':

       … while evaluating definitions from `/nix/store/csk881ggvmifg4qf1cal0r1ffflbmlhp-source/nixos/modules/hardware/facter/networking':

       … while evaluating the option `nodes.controller.hardware.facter.enable':

       … while evaluating the option `nodes.controller.hardware.facter.report':

       … while evaluating the option `nodes.controller.hardware.facter.reportPath':

       … while evaluating definitions from `/nix/store/ws2m25334bs7klda239x7sd7y2kp07hc-source/nixosModules/clanCore/nixos-facter.nix':

       (stack trace truncated; use '--show-trace' to show the full, detailed trace)

       error: build of '/nix/store/h22vlvza8nhkbwqm498xd6lzbbb2mx9m-merged-test-dir-dm-wireguard-star.drv^out' failed: error: gave up after 9 reschedules
failed checks.x86_64-linux.pocket-id 14s
container-test-run-pocket-id: Oct 08 10:04:14 server systemd[1]: Starting Reconcile Pocket ID OIDC clients against the clan-declared spec... Oct 08 10:04:14 ser …
container-test-run-pocket-id:
Oct 08 10:04:14 server systemd[1]: Starting Reconcile Pocket ID OIDC clients against the clan-declared spec...
Oct 08 10:04:14 server pocket-id-clients-reconcile[321]: curl: (7) Failed to connect to 127.0.0.1:1411 after 0 ms: Could not connect to server
Oct 08 10:04:15 server pocket-id-clients-reconcile[383]: [dashboard] create
Oct 08 10:04:15 server pocket-id-clients-reconcile[390]: curl: (22) The requested URL returned error: 404
Oct 08 10:04:15 server systemd[1]: pocket-id-clients.service: Main process exited, code=exited, status=22/n/a
Oct 08 10:04:15 server systemd[1]: pocket-id-clients.service: Failed with result 'exit-code'.
Oct 08 10:04:15 server systemd[1]: Failed to start Reconcile Pocket ID OIDC clients against the clan-declared spec.
failed eval checks.x86_64-linux.punchcard —
error: … while evaluating the attribute 'drvPath' at «https://releases.nixos.org/nixos/26.05/nixos-26.05.11045.774debe7a0d1/nixexprs.tar.xz?narH …
error:
       … while evaluating the attribute 'drvPath'
         at «https://releases.nixos.org/nixos/26.05/nixos-26.05.11045.774debe7a0d1/nixexprs.tar.xz?narHash=sha256-S5MjznoY0gbQbcANPLz5RYjg%2B5/WQmFRgNbHcP%2Bydcg%3D»/lib/customisation.nix:427:7:
          426|     // {
          427|       drvPath =
             |       ^
          428|         assert condition;

       … while calling the 'derivationStrict' builtin
         at «nix-internal»/derivation-internal.nix:37:12:
           36|
           37|   strict = derivationStrict drvAttrs;
             |            ^
           38|

       … while evaluating the option `nodes.server.networking.interfaces':

       … while evaluating definitions from `/nix/store/csk881ggvmifg4qf1cal0r1ffflbmlhp-source/nixos/modules/hardware/facter/networking':

       … while evaluating the option `nodes.server.hardware.facter.enable':

       … while evaluating the option `nodes.server.hardware.facter.report':

       … while evaluating the option `nodes.server.hardware.facter.reportPath':

       … while evaluating definitions from `/nix/store/ws2m25334bs7klda239x7sd7y2kp07hc-source/nixosModules/clanCore/nixos-facter.nix':

       (stack trace truncated; use '--show-trace' to show the full, detailed trace)

       error: build of '/nix/store/969xyh8l8127sck596mnn2363hdw5ldm-merged-test-dir-punchcard.drv^out' failed: error: gave up after 9 reschedules
failed eval checks.x86_64-linux.webapps —
error: … while evaluating the attribute 'drvPath' at «https://releases.nixos.org/nixos/26.05/nixos-26.05.11045.774debe7a0d1/nixexprs.tar.xz?narH …
error:
       … while evaluating the attribute 'drvPath'
         at «https://releases.nixos.org/nixos/26.05/nixos-26.05.11045.774debe7a0d1/nixexprs.tar.xz?narHash=sha256-S5MjznoY0gbQbcANPLz5RYjg%2B5/WQmFRgNbHcP%2Bydcg%3D»/lib/customisation.nix:427:7:
          426|     // {
          427|       drvPath =
             |       ^
          428|         assert condition;

       … while calling the 'derivationStrict' builtin
         at «nix-internal»/derivation-internal.nix:37:12:
           36|
           37|   strict = derivationStrict drvAttrs;
             |            ^
           38|

       … while evaluating the option `nodes.server.networking.interfaces':

       … while evaluating definitions from `/nix/store/csk881ggvmifg4qf1cal0r1ffflbmlhp-source/nixos/modules/hardware/facter/networking':

       … while evaluating the option `nodes.server.hardware.facter.enable':

       … while evaluating the option `nodes.server.hardware.facter.report':

       … while evaluating the option `nodes.server.hardware.facter.reportPath':

       … while evaluating definitions from `/nix/store/ws2m25334bs7klda239x7sd7y2kp07hc-source/nixosModules/clanCore/nixos-facter.nix':

       (stack trace truncated; use '--show-trace' to show the full, detailed trace)

       error: build of '/nix/store/l9fvzh7hax1927225li1p8lkq6hp7hgv-merged-test-dir-webapps.drv^out' failed: error: gave up after 9 reschedules
2 succeeded
succeeded attributes
status attribute duration
loading…
7 already built
skipped attributes
status attribute duration
loading…