nixbot

builds

clan/clan-community build #247 failed

branch 26.05 · PR #249 · commit e5b4e6ff9c · · took 2m 25s · eval 23s

eval warnings 6 kinds · 21 occurrences
  • error …-merged-test-dir-punchcard.drv: build-x86-01: build-x86-01: input not substitutable: error: path '/nix/store/…-test-vars-generated' is required, but there is no substituter that can build it, asking the scheduler again ×2
  • error …-merged-test-dir-dm-wireguard-star.drv: gi-build-x86-02: gi-build-x86-02: input not substitutable: error: path '/nix/store/…-test-vars-generated' is required, but there is no substituter that can build it, asking the scheduler again ×9
  • error …-merged-test-dir-dm-wireguard-star.drv: build-x86-01: build-x86-01: input not substitutable: error: path '/nix/store/…-test-vars-generated' is required, but there is no substituter that can build it, asking the scheduler again ×5
  • error ×2
  • error build of '/nix/store/…-merged-test-dir-dm-wireguard-star.drv^out' failed: error: gave up after 9 reschedules ×2
  • warn Dependency of package 'nix-unit' uses a nested list in attribute 'nativeBuildInputs'. ×1

12 failed ⚠ 1
failed attributes
status attribute duration
failed checks.aarch64-darwin.nix-unit
  • Dependency of package 'nix-unit' uses a nested list in attribute 'nativeBuildInputs'. This is deprecated as of Nixpkgs release 26.05, and support will be removed in a future nixpkgs release.
2m 1s
setup: don't know how to build these paths: /nix/store/3w03qaajpg35l1l60ahzml664zc7jfaq-nix-unit-check.drv warning: ignoring the client-specified setting 'sto …
setup:
don't know how to build these paths:
  /nix/store/3w03qaajpg35l1l60ahzml664zc7jfaq-nix-unit-check.drv
warning: ignoring the client-specified setting 'store', because it is a restricted setting and you are not a trusted user
warning: 3w03qaajpg35l1l60ahzml664zc7jfaq-nix-unit-check.drv: no connected, non-draining worker for system 'aarch64-darwin' offers features {}, the workers offer {}, waiting up to 120s for a worker
3w03qaajpg35l1l60ahzml664zc7jfaq-nix-unit-check.drv: no connected, non-draining worker for system 'aarch64-darwin' offers features {}, the workers offer {}
error: no connected, non-draining worker for system 'aarch64-darwin' offers features {}, the workers offer {}
failed checks.aarch64-darwin.treefmt 2m 2s
setup: don't know how to build these paths: /nix/store/79gmpna8vv6kq9r622d5ag9rzk02738p-treefmt-check.drv warning: ignoring the client-specified setting 'stor …
setup:
don't know how to build these paths:
  /nix/store/79gmpna8vv6kq9r622d5ag9rzk02738p-treefmt-check.drv
warning: ignoring the client-specified setting 'store', because it is a restricted setting and you are not a trusted user
warning: 79gmpna8vv6kq9r622d5ag9rzk02738p-treefmt-check.drv: no connected, non-draining worker for system 'aarch64-darwin' offers features {}, the workers offer {}, waiting up to 120s for a worker
79gmpna8vv6kq9r622d5ag9rzk02738p-treefmt-check.drv: no connected, non-draining worker for system 'aarch64-darwin' offers features {}, the workers offer {}
error: no connected, non-draining worker for system 'aarch64-darwin' offers features {}, the workers offer {}
failed checks.aarch64-linux.authelia 53s
setup: don't know how to build these paths: /nix/store/yns8jf4frwrf6rf3faibhsg8iwj4vl1x-container-test-run-authelia.drv warning: ignoring the client-specified …
setup:
don't know how to build these paths:
  /nix/store/yns8jf4frwrf6rf3faibhsg8iwj4vl1x-container-test-run-authelia.drv
warning: ignoring the client-specified setting 'store', because it is a restricted setting and you are not a trusted user
r9yaaxxmf7gvbqflrzzrksk160qbyslv-Caddyfile-formatted.drv: error: gRPC AddMultipleToStore on 'nix-store.geninf.io:50051' failed: error: some references of path '/nix/store/vlxdk7ps0ym8fyskrbwvlrg5h40mj28s-caddy-2.11.4.drv' could not be realised
vknwnpjdjy8mlrfhc8hsf8r3hb1jc9yi-system-path.drv: error: gRPC AddMultipleToStore on 'nix-store.geninf.io:50051' failed: error: some references of path '/nix/store/n2p02gjiqfhl4sy08ay55klv7jbz845l-perl-5.42.0-env.drv' could not be realised
rq8fpisv99y1fiqjdnan60q6k9fzpd3v-unit-nix-daemon.service.drv: error: gRPC AddMultipleToStore on 'nix-store.geninf.io:50051' failed: error: some references of path '/nix/store/06jq3w0r6cp7vf0wzqqmp0dwzzhnaz02-X-Restart-Triggers-nix-daemon.drv' could not be realised
error: dependency '24pw8gzvbz444dzcxih95lz5dmhsmhm0-nixos-test-driver-authelia.drv' failed
failed eval checks.aarch64-linux.dm-wireguard-star —
error: … while evaluating the attribute 'drvPath' at «https://releases.nixos.org/nixos/26.05/nixos-26.05.11045.774debe7a0d1/nixexprs.tar.xz?narH …
error:
       … while evaluating the attribute 'drvPath'
         at «https://releases.nixos.org/nixos/26.05/nixos-26.05.11045.774debe7a0d1/nixexprs.tar.xz?narHash=sha256-S5MjznoY0gbQbcANPLz5RYjg%2B5/WQmFRgNbHcP%2Bydcg%3D»/lib/customisation.nix:427:7:
          426|     // {
          427|       drvPath =
             |       ^
          428|         assert condition;

       … while calling the 'derivationStrict' builtin
         at «nix-internal»/derivation-internal.nix:37:12:
           36|
           37|   strict = derivationStrict drvAttrs;
             |            ^
           38|

       … while evaluating the option `nodes.controller.networking.interfaces':

       … while evaluating definitions from `/nix/store/csk881ggvmifg4qf1cal0r1ffflbmlhp-source/nixos/modules/hardware/facter/networking':

       … while evaluating the option `nodes.controller.hardware.facter.enable':

       … while evaluating the option `nodes.controller.hardware.facter.report':

       … while evaluating the option `nodes.controller.hardware.facter.reportPath':

       … while evaluating definitions from `/nix/store/ws2m25334bs7klda239x7sd7y2kp07hc-source/nixosModules/clanCore/nixos-facter.nix':

       (stack trace truncated; use '--show-trace' to show the full, detailed trace)

       error: build of '/nix/store/h22vlvza8nhkbwqm498xd6lzbbb2mx9m-merged-test-dir-dm-wireguard-star.drv^out' failed: error: gave up after 9 reschedules
failed checks.aarch64-linux.nix-unit 6s
setup: xa8c6fghflcc306ivg82jqlgm4khvwrg-nix-unit-check.drv: build01: build01: input not substitutable: error: path '/nix/store/wl748g7i5xrpd008gggal2qbkz5iwb9f- …
setup:
xa8c6fghflcc306ivg82jqlgm4khvwrg-nix-unit-check.drv: build01: build01: input not substitutable: error: path '/nix/store/wl748g7i5xrpd008gggal2qbkz5iwb9f-nix-unit-2.35.1' is required, but there is no substituter that can build it, asking the scheduler again
xa8c6fghflcc306ivg82jqlgm4khvwrg-nix-unit-check.drv: build01: build01: input not substitutable: error: path '/nix/store/wl748g7i5xrpd008gggal2qbkz5iwb9f-nix-unit-2.35.1' is required, but there is no substituter that can build it, asking the scheduler again
xa8c6fghflcc306ivg82jqlgm4khvwrg-nix-unit-check.drv: build01: build01: input not substitutable: error: path '/nix/store/wl748g7i5xrpd008gggal2qbkz5iwb9f-nix-unit-2.35.1' is required, but there is no substituter that can build it, asking the scheduler again
xa8c6fghflcc306ivg82jqlgm4khvwrg-nix-unit-check.drv: build01: build01: input not substitutable: error: path '/nix/store/wl748g7i5xrpd008gggal2qbkz5iwb9f-nix-unit-2.35.1' is required, but there is no substituter that can build it, asking the scheduler again
xa8c6fghflcc306ivg82jqlgm4khvwrg-nix-unit-check.drv: build01: build01: input not substitutable: error: path '/nix/store/wl748g7i5xrpd008gggal2qbkz5iwb9f-nix-unit-2.35.1' is required, but there is no substituter that can build it, asking the scheduler again
xa8c6fghflcc306ivg82jqlgm4khvwrg-nix-unit-check.drv: build01: build01: input not substitutable: error: path '/nix/store/wl748g7i5xrpd008gggal2qbkz5iwb9f-nix-unit-2.35.1' is required, but there is no substituter that can build it, asking the scheduler again
xa8c6fghflcc306ivg82jqlgm4khvwrg-nix-unit-check.drv: build01: build01: input not substitutable: error: path '/nix/store/wl748g7i5xrpd008gggal2qbkz5iwb9f-nix-unit-2.35.1' is required, but there is no substituter that can build it, asking the scheduler again
error: gave up after 9 reschedules
failed checks.aarch64-linux.pocket-id 3s
setup: /nix/store/s7mnqvr1ikjkqf0li81rsy3khjm8sl49-zlib-1.3.2 /nix/store/pwwpmwjdmk34smyfkf61ksyp7h5kdv45-zlib-1.3.2-static /nix/store/6fhxdm9f25c7h86nadf …
setup:
  /nix/store/s7mnqvr1ikjkqf0li81rsy3khjm8sl49-zlib-1.3.2
  /nix/store/pwwpmwjdmk34smyfkf61ksyp7h5kdv45-zlib-1.3.2-static
  /nix/store/6fhxdm9f25c7h86nadfy8qim4h9hq04d-zlib-ng-2.3.3
  /nix/store/i8f26lwk8i93hmiyrmsy752m6nwi4pmk-zstd-1.5.7
  /nix/store/01623a8kcyp04gbqsal6fys34yfigd02-zstd-1.5.7-bin
warning: ignoring the client-specified setting 'store', because it is a restricted setting and you are not a trusted user
g2zqgdq7g5vsfdpx6ry03k56fcx0cmwj-container-test-run-pocket-id.drv: error: gRPC AddMultipleToStore on 'nix-store.geninf.io:50051' failed: error: some references of path '/nix/store/n2p02gjiqfhl4sy08ay55klv7jbz845l-perl-5.42.0-env.drv' could not be realised
error: error: gRPC AddMultipleToStore on 'nix-store.geninf.io:50051' failed: error: some references of path '/nix/store/n2p02gjiqfhl4sy08ay55klv7jbz845l-perl-5.42.0-env.drv' could not be realised
failed checks.aarch64-linux.punchcard 56s
setup: don't know how to build these paths: /nix/store/7gj53ja5q1q6iklaf9d49bxvp3x9h005-container-test-run-punchcard.drv warning: ignoring the client-specifie …
setup:
don't know how to build these paths:
  /nix/store/7gj53ja5q1q6iklaf9d49bxvp3x9h005-container-test-run-punchcard.drv
warning: ignoring the client-specified setting 'store', because it is a restricted setting and you are not a trusted user
rfzhf8rakffbayvs7l76vadypw238fmx-Caddyfile-formatted.drv: error: gRPC AddMultipleToStore on 'nix-store.geninf.io:50051' failed: error: some references of path '/nix/store/vlxdk7ps0ym8fyskrbwvlrg5h40mj28s-caddy-2.11.4.drv' could not be realised
vknwnpjdjy8mlrfhc8hsf8r3hb1jc9yi-system-path.drv: error: gRPC AddMultipleToStore on 'nix-store.geninf.io:50051' failed: error: some references of path '/nix/store/n2p02gjiqfhl4sy08ay55klv7jbz845l-perl-5.42.0-env.drv' could not be realised
ypg0qm6s2pkwc56s0cq1ip8a5gp3y98m-unit-nix-daemon.service.drv: error: gRPC AddMultipleToStore on 'nix-store.geninf.io:50051' failed: error: some references of path '/nix/store/06jq3w0r6cp7vf0wzqqmp0dwzzhnaz02-X-Restart-Triggers-nix-daemon.drv' could not be realised
error: dependency '5bqq4bkrqqlg7rcql41w3hzzydvz70qv-nixos-test-driver-punchcard.drv' failed
failed checks.aarch64-linux.treefmt 4s
setup: br2pvnnaq50n01x6fcixqn284ykggnnp-treefmt-check.drv: build01: build01: input not substitutable: error: some references of path '/nix/store/b59rwab6z16av0h …
setup:
br2pvnnaq50n01x6fcixqn284ykggnnp-treefmt-check.drv: build01: build01: input not substitutable: error: some references of path '/nix/store/b59rwab6z16av0hxz93wv63kzwglyqq5-treefmt' could not be realised, asking the scheduler again
br2pvnnaq50n01x6fcixqn284ykggnnp-treefmt-check.drv: build01: build01: input not substitutable: error: some references of path '/nix/store/b59rwab6z16av0hxz93wv63kzwglyqq5-treefmt' could not be realised, asking the scheduler again
br2pvnnaq50n01x6fcixqn284ykggnnp-treefmt-check.drv: build01: build01: input not substitutable: error: some references of path '/nix/store/b59rwab6z16av0hxz93wv63kzwglyqq5-treefmt' could not be realised, asking the scheduler again
br2pvnnaq50n01x6fcixqn284ykggnnp-treefmt-check.drv: build01: build01: input not substitutable: error: some references of path '/nix/store/b59rwab6z16av0hxz93wv63kzwglyqq5-treefmt' could not be realised, asking the scheduler again
br2pvnnaq50n01x6fcixqn284ykggnnp-treefmt-check.drv: build01: build01: input not substitutable: error: some references of path '/nix/store/b59rwab6z16av0hxz93wv63kzwglyqq5-treefmt' could not be realised, asking the scheduler again
br2pvnnaq50n01x6fcixqn284ykggnnp-treefmt-check.drv: build01: build01: input not substitutable: error: some references of path '/nix/store/b59rwab6z16av0hxz93wv63kzwglyqq5-treefmt' could not be realised, asking the scheduler again
br2pvnnaq50n01x6fcixqn284ykggnnp-treefmt-check.drv: build01: build01: input not substitutable: error: some references of path '/nix/store/b59rwab6z16av0hxz93wv63kzwglyqq5-treefmt' could not be realised, asking the scheduler again
error: gave up after 9 reschedules
failed checks.x86_64-linux.authelia 36s
container-test-run-authelia: Status: "loading new config: loading http app module: provision http: getting tls app: loading tls app module: provision tls: …
container-test-run-authelia:
     Status: "loading new config: loading http app module: provision http: getting tls app: loading tls app module: provision tls: loading certificates: tls: private key does not match public key"
        CPU: 286ms
Oct 08 15:03:37 server systemd[1]: Starting Caddy...
Oct 08 15:03:37 server caddy[406]: Error: loading initial config: loading new config: loading http app module: provision http: getting tls app: loading tls app module: provision tls: loading certificates: tls: private key does not match public key
Oct 08 15:03:37 server systemd[1]: Started Caddy.
Oct 08 15:03:37 server systemd[1]: caddy.service: Main process exited, code=exited, status=1/FAILURE
Oct 08 15:03:37 server systemd[1]: caddy.service: Failed with result 'exit-code'.
failed eval checks.x86_64-linux.dm-wireguard-star —
error: … while evaluating the attribute 'drvPath' at «https://releases.nixos.org/nixos/26.05/nixos-26.05.11045.774debe7a0d1/nixexprs.tar.xz?narH …
error:
       … while evaluating the attribute 'drvPath'
         at «https://releases.nixos.org/nixos/26.05/nixos-26.05.11045.774debe7a0d1/nixexprs.tar.xz?narHash=sha256-S5MjznoY0gbQbcANPLz5RYjg%2B5/WQmFRgNbHcP%2Bydcg%3D»/lib/customisation.nix:427:7:
          426|     // {
          427|       drvPath =
             |       ^
          428|         assert condition;

       … while calling the 'derivationStrict' builtin
         at «nix-internal»/derivation-internal.nix:37:12:
           36|
           37|   strict = derivationStrict drvAttrs;
             |            ^
           38|

       … while evaluating the option `nodes.controller.networking.interfaces':

       … while evaluating definitions from `/nix/store/csk881ggvmifg4qf1cal0r1ffflbmlhp-source/nixos/modules/hardware/facter/networking':

       … while evaluating the option `nodes.controller.hardware.facter.enable':

       … while evaluating the option `nodes.controller.hardware.facter.report':

       … while evaluating the option `nodes.controller.hardware.facter.reportPath':

       … while evaluating definitions from `/nix/store/ws2m25334bs7klda239x7sd7y2kp07hc-source/nixosModules/clanCore/nixos-facter.nix':

       (stack trace truncated; use '--show-trace' to show the full, detailed trace)

       error: build of '/nix/store/h22vlvza8nhkbwqm498xd6lzbbb2mx9m-merged-test-dir-dm-wireguard-star.drv^out' failed: error: gave up after 9 reschedules
failed checks.x86_64-linux.pocket-id 4s
container-test-run-pocket-id: Oct 08 15:02:55 server systemd[1]: Starting Reconcile Pocket ID OIDC clients against the clan-declared spec... Oct 08 15:02:55 ser …
container-test-run-pocket-id:
Oct 08 15:02:55 server systemd[1]: Starting Reconcile Pocket ID OIDC clients against the clan-declared spec...
Oct 08 15:02:55 server pocket-id-clients-reconcile[320]: curl: (7) Failed to connect to 127.0.0.1:1411 after 0 ms: Could not connect to server
Oct 08 15:02:56 server pocket-id-clients-reconcile[381]: [dashboard] create
Oct 08 15:02:56 server pocket-id-clients-reconcile[389]: curl: (22) The requested URL returned error: 404
Oct 08 15:02:56 server systemd[1]: pocket-id-clients.service: Main process exited, code=exited, status=22/n/a
Oct 08 15:02:56 server systemd[1]: pocket-id-clients.service: Failed with result 'exit-code'.
Oct 08 15:02:56 server systemd[1]: Failed to start Reconcile Pocket ID OIDC clients against the clan-declared spec.
failed checks.x86_64-linux.punchcard 28s
container-test-run-punchcard: Status: "loading new config: loading http app module: provision http: getting tls app: loading tls app module: provision tls: …
container-test-run-punchcard:
     Status: "loading new config: loading http app module: provision http: getting tls app: loading tls app module: provision tls: loading certificates: tls: private key does not match public key"
        CPU: 282ms
Oct 08 15:03:29 server systemd[1]: Starting Caddy...
Oct 08 15:03:30 server caddy[387]: Error: loading initial config: loading new config: loading http app module: provision http: getting tls app: loading tls app module: provision tls: loading certificates: tls: private key does not match public key
Oct 08 15:03:30 server systemd[1]: Started Caddy.
Oct 08 15:03:30 server systemd[1]: caddy.service: Main process exited, code=exited, status=1/FAILURE
Oct 08 15:03:30 server systemd[1]: caddy.service: Failed with result 'exit-code'.
2 succeeded
succeeded attributes
status attribute duration
loading…
12 already built
skipped attributes
status attribute duration
loading…