nixbot

builds

clan/clan-core build #600 failed

branch 26.05 · PR #8050 · commit 4fa4e43b62 · · took 3h 5m · eval 7m 53s

eval warnings 40 kinds · 104 occurrences
  • warn /nix/var/nix does not exist, so Nix will use "/homeless-shelter/.local/share/nix/root" as a chroot store ×1
  • warn node/Capability.hpp:61:23: warning: 'void* memset(void*, int, size_t)' clearing an object of type 'struct ZeroTier::Capability::<unnamed>' with no trivial copy-assignment; use assignment or value-initialization instead [-Wclass-memaccess] ×22
  • warn node/NetworkConfig.cpp:53:15: warning: 'void* memset(void*, int, size_t)' clearing an object of type 'struct ZeroTier::InetAddress' with no trivial copy-assignment; use assignment or value-initialization instead [-Wclass-memaccess] ×1
  • warn ext/ed25519-amd64-asm/sc25519.h:18:34: warning: 'crypto_sign_ed25519_amd64_64_sc25519_window4' accessing 85 bytes in a region of size 64 [-Wstringop-overflow=] ×1
  • warn node/Network.hpp:484:31: warning: 'void* memset(void*, int, size_t)' clearing an object of type 'struct ZeroTier::Network::_IncomingConfigChunk' with no trivial copy-assignment; use assignment or value-initialization instead [-Wclass-memaccess] ×20
  • warn ext/ed25519-amd64-asm/sc25519_window4.c:3:34: warning: argument 1 of type 'signed char[64]' with mismatched bound [-Warray-parameter=] ×1
  • warn one.cpp:658:75: warning: comparison of integer expressions of different signedness: 'int' and 'nlohmann::basic_json<>::size_type' {aka 'long unsigned int'} [-Wsign-compare] ×1
  • warn one.cpp:674:75: warning: comparison of integer expressions of different signedness: 'int' and 'nlohmann::basic_json<>::size_type' {aka 'long unsigned int'} [-Wsign-compare] ×1
  • warn one.cpp:823:117: warning: format '%lld' expects argument of type 'long long int', but argument 2 has type 'int64_t' {aka 'long int'} [-Wformat=] ×1
  • warn one.cpp:1750:30: warning: 'int readdir_r(DIR*, dirent*, dirent**)' is deprecated [-Wdeprecated-declarations] ×1
  • warn selftest.cpp:1152:23: warning: variable 'salsaKey' set but not used [-Wunused-but-set-variable] ×1
  • warn selftest.cpp:1571:32: warning: comparison of integer expressions of different signedness: 'int64_t' {aka 'long int'} and 'uint64_t' {aka 'long unsigned int'} [-Wsign-compare] ×1
  • warn selftest.cpp:1587:32: warning: comparison of integer expressions of different signedness: 'int64_t' {aka 'long int'} and 'uint64_t' {aka 'long unsigned int'} [-Wsign-compare] ×1
  • warn node/Identity.hpp:42:63: warning: '<unnamed>.ZeroTier::World::Root::identity.ZeroTier::Identity::_publicKey' may be used uninitialized [-Wmaybe-uninitialized] ×4
  • warn node/../osdep/Phy.hpp:941:31: warning: ignoring return value of 'ssize_t read(int, void*, size_t)' declared with attribute 'warn_unused_result' [-Wunused-result] ×1
  • warn one.cpp:1349:23: warning: ignoring return value of 'char* getcwd(char*, size_t)' declared with attribute 'warn_unused_result' [-Wunused-result] ×1
  • warn one.cpp:1357:22: warning: ignoring return value of 'ssize_t write(int, const void*, size_t)' declared with attribute 'warn_unused_result' [-Wunused-result] ×1
  • warn one.cpp:1744:15: warning: ignoring return value of 'int lchown(const char*, __uid_t, __gid_t)' declared with attribute 'warn_unused_result' [-Wunused-result] ×1
  • warn /nix/store/…-gcc-15.2.0/include/c++/15.2.0/bits/new_allocator.h:191:11: warning: '<anonymous>' may be used uninitialized [-Wmaybe-uninitialized] ×19
  • warn /nix/store/…-glibc-2.42-84-dev/include/bits/string_fortified.h:29:33: warning: 'void* __builtin_memcpy(void*, const void*, long unsigned int)' forming offset [16, 27] is out of the bounds [0, 16] of object 'bindaddr' with type 'sockaddr_in' [-Warray-bounds=] ×2
  • warn /nix/store/…-glibc-2.42-84-dev/include/bits/string_fortified.h:29:33: warning: 'void* __builtin_memcpy(void*, const void*, long unsigned int)' forming offset [16, 27] is out of the bounds [0, 16] of object 'invalidAddr' with type 'sockaddr_in' [-Warray-bounds=] ×2
  • warn one.cpp:1350:49: warning: 'zerotier_dump.txt' directive output may be truncated writing 17 bytes into a region of size between 0 and 16383 [-Wformat-truncation=] ×1
  • warn /nix/store/…-glibc-2.42-84-dev/include/bits/stdio2.h:68:35: warning: '__builtin___snprintf_chk' argument 6 overlaps destination object 'cwd' [-Wrestrict] ×1
  • warn the following packages contain code that will be rejected by a future version of Rust: num-bigint-dig v0.8.4 ×1
  • warn osdep/LinuxNetLink.cpp:278:14: warning: unused variable 'ms' [-Wunused-variable] ×1
  • warn osdep/LinuxNetLink.cpp:364:14: warning: unused variable 'ms' [-Wunused-variable] ×1
  • warn nonfree/controller/../../node/Capability.hpp:61:23: warning: 'void* memset(void*, int, size_t)' clearing an object of type 'struct ZeroTier::Capability::<unnamed>' with no trivial copy-assignment; use assignment or value-initialization instead [-Wclass-memaccess] ×2
  • warn service/../node/Capability.hpp:61:23: warning: 'void* memset(void*, int, size_t)' clearing an object of type 'struct ZeroTier::Capability::<unnamed>' with no trivial copy-assignment; use assignment or value-initialization instead [-Wclass-memaccess] ×1
  • warn service/../node/Network.hpp:484:31: warning: 'void* memset(void*, int, size_t)' clearing an object of type 'struct ZeroTier::Network::_IncomingConfigChunk' with no trivial copy-assignment; use assignment or value-initialization instead [-Wclass-memaccess] ×1
  • warn osdep/LinuxEthernetTap.cpp:219:21: warning: ignoring return value of 'int pipe(int*)' declared with attribute 'warn_unused_result' [-Wunused-result] ×1
  • warn osdep/LinuxEthernetTap.cpp:361:22: warning: ignoring return value of 'ssize_t write(int, const void*, size_t)' declared with attribute 'warn_unused_result' [-Wunused-result] ×1
  • warn osdep/LinuxEthernetTap.cpp:512:30: warning: ignoring return value of 'ssize_t write(int, const void*, size_t)' declared with attribute 'warn_unused_result' [-Wunused-result] ×1
  • warn osdep/Phy.hpp:941:31: warning: ignoring return value of 'ssize_t read(int, void*, size_t)' declared with attribute 'warn_unused_result' [-Wunused-result] ×1
  • warn service/OneService.cpp:1046:22: warning: unused variable 'pinning' [-Wunused-variable] ×1
  • warn service/OneService.cpp:2456:43: warning: comparison of integer expressions of different signedness: 'int' and 'std::vector<ZeroTier::InetAddress>::size_type' {aka 'long unsigned int'} [-Wsign-compare] ×1
  • warn service/OneService.cpp:2465:43: warning: comparison of integer expressions of different signedness: 'int' and 'std::vector<ZeroTier::InetAddress>::size_type' {aka 'long unsigned int'} [-Wsign-compare] ×1
  • warn service/../node/../osdep/Phy.hpp:263:31: warning: ignoring return value of 'ssize_t write(int, const void*, size_t)' declared with attribute 'warn_unused_result' [-Wunused-result] ×1
  • warn service/../node/../osdep/Phy.hpp:941:31: warning: ignoring return value of 'ssize_t read(int, void*, size_t)' declared with attribute 'warn_unused_result' [-Wunused-result] ×1
  • warn service/OneService.cpp:1801:102: warning: '/' directive output may be truncated writing 1 byte into a region of size between 0 and 16383 [-Wformat-truncation=] ×1
  • warn service/OneService.cpp:1825:83: warning: '%s' directive output may be truncated writing 5 bytes into a region of size between 1 and 16384 [-Wformat-truncation=] ×1

9 failed
failed attributes
status attribute duration
failed checks.aarch64-linux.borgbackup 4m 39s
setup: error: Cannot build '/nix/store/gd54y01ary5xalh48q9zylw1xazlxq35-system-units.drv'. Reason: 17 dependencies failed. Output paths: …
setup:
error: Cannot build '/nix/store/gd54y01ary5xalh48q9zylw1xazlxq35-system-units.drv'.
       Reason: 17 dependencies failed.
       Output paths:
         /nix/store/hjf4f16l178m1c11yr3b55rvcin2v139-system-units
error: Cannot build '/nix/store/y5mnz3w0ij0jm0bb7d2akkx8fbgjsh1p-user-units.drv'.
       Reason: 1 dependency failed.
       Output paths:
         /nix/store/zn2qryncvd0djzi7mbdipvc6hi3yzj4p-user-units
error: Cannot build '/nix/store/iafqi825v12phhr6zlvc8sqgly11smha-etc.drv'.
       Reason: 13 dependencies failed.
       Output paths:
         /nix/store/v6wl50i7w0fj59znpmc8mypc2x3jja9c-etc
error: Cannot build '/nix/store/w3p6wzmgpf8qyqxfkgcii0ss1fdb1kzz-activate.drv'.
       Reason: 3 dependencies failed.
       Output paths:
         /nix/store/2ay874nbnl3q70cdr76z6n7jbxplxfas-activate
error: Cannot build '/nix/store/3cnp6a1a992bngdfsi5nj1lvg9a4mcqp-nixos-system-clientone-test.drv'.
       Reason: 4 dependencies failed.
       Output paths:
         /nix/store/dv7b2sfa0qqdpdd4ff4c2v8k1g82v3xg-nixos-system-clientone-test
error: Cannot build '/nix/store/xy1pvdqpd08pqnaq75jxz3igglpiryb9-closure-info.drv'.
       Reason: 2 dependencies failed.
       Output paths:
         /nix/store/wq35q3hq4m8bsbp68g57z10i62fqmrl5-closure-info
error: Cannot build '/nix/store/8s123wmpfw9f0bcgfiy2kiwvgzr7a8gj-nixos-test-driver-borgbackup.drv'.
       Reason: 4 dependencies failed.
       Output paths:
         /nix/store/m66faq8xydqj45p5jfsvqbcybc0qnf5c-nixos-test-driver-borgbackup
error: Cannot build '/nix/store/yjl06g4wifkahzkbdzw70isb039812l8-container-test-run-borgbackup.drv'.
       Reason: 1 dependency failed.
       Output paths:
         /nix/store/grbyvw01320s1acc1241pq5hk0a2wsq0-container-test-run-borgbackup
failed checks.aarch64-linux.dyndns 3m 4s
setup: error: Cannot build '/nix/store/fzqg5pb5qiyy0a3zvv0vjcdizksfqi23-unit-nginx.service.drv'. Reason: 2 dependencies failed. Output paths: …
setup:
error: Cannot build '/nix/store/fzqg5pb5qiyy0a3zvv0vjcdizksfqi23-unit-nginx.service.drv'.
       Reason: 2 dependencies failed.
       Output paths:
         /nix/store/0s66pr60v1aw71knhmv87bzwa2g1mnk0-unit-nginx.service
error: Cannot build '/nix/store/kn4di0wwxsvd4y7ikj2ync548gzqjpjn-system-units.drv'.
       Reason: 16 dependencies failed.
       Output paths:
         /nix/store/4jy0vbf1k9rncd6d4jmqsclmm4ci9bsf-system-units
error: Cannot build '/nix/store/5mxrv5n0x07aj4mswnpx7524rg44aikd-etc.drv'.
       Reason: 9 dependencies failed.
       Output paths:
         /nix/store/3ci2c1yq57anlznrr6izc0fa0dc31hmn-etc
error: Cannot build '/nix/store/7himm1gaqzkw9na9d4fl803ixn6l1dvw-activate.drv'.
       Reason: 3 dependencies failed.
       Output paths:
         /nix/store/zvihl25vcc29jrkkz1nq9r82w321yahq-activate
error: Cannot build '/nix/store/pldrzfxn1qj8i1aivbkbwwnbk497gcwj-nixos-system-server-test.drv'.
       Reason: 4 dependencies failed.
       Output paths:
         /nix/store/s4m3b4kga5j170y39pydxcskl71vr3jk-nixos-system-server-test
error: Cannot build '/nix/store/jpab004jb73jyixz9q0jzry1npz83hci-closure-info.drv'.
       Reason: 2 dependencies failed.
       Output paths:
         /nix/store/r38sivbhrbsc4b2f20dgnpd949ldb3r2-closure-info
error: Cannot build '/nix/store/aakkx27hmbg6c8xd2cq4vl0rpmk7i47d-nixos-test-driver-dyndns.drv'.
       Reason: 2 dependencies failed.
       Output paths:
         /nix/store/kawivc1clq0yiwsxyn2bzryyqpfckaxv-nixos-test-driver-dyndns
error: Cannot build '/nix/store/nbh9hhgr9dcrxlndfryrlp2lp8lx7hjg-container-test-run-dyndns.drv'.
       Reason: 1 dependency failed.
       Output paths:
         /nix/store/r8i1jqlzskz0yqbi577n07rcrwm4wwlg-container-test-run-dyndns
failed checks.aarch64-linux.mycelium 3m 4s
setup: error: Cannot build '/nix/store/r4wz47nfcaxw3qiqj0iiaplncsz5v0zz-activate.drv'. Reason: 3 dependencies failed. Output paths: /nix/ …
setup:
error: Cannot build '/nix/store/r4wz47nfcaxw3qiqj0iiaplncsz5v0zz-activate.drv'.
       Reason: 3 dependencies failed.
       Output paths:
         /nix/store/bvsyicnklvvhpwg3y1iz0xj1g6dpzfwi-activate
error: Cannot build '/nix/store/4fk7smfpy26wwfq0kvh1y16mwyp7cc46-nixos-system-server-test.drv'.
       Reason: 8 dependencies failed.
       Output paths:
         /nix/store/4cnlh2qp4y38mlbf4mvv69v3rqhs7qj1-nixos-system-server-test
error: Cannot build '/nix/store/fgibaxf3vd7bgjvdzmfk8axpn7mn7ggi-closure-info.drv'.
       Reason: 1 dependency failed.
       Output paths:
         /nix/store/nmm3vkm478p3r8iqq8609h1nm5vb1ynb-closure-info
error: Cannot build '/nix/store/51qjmk2draazjy1pkskb23j0zwm4dixm-run-nixos-vm.drv'.
       Reason: 3 dependencies failed.
       Output paths:
         /nix/store/z86jg8ibmcs889kvf2dh6px3p2w3pcz8-run-nixos-vm
error: Cannot build '/nix/store/jdf16lnd462s22z50s2kq6vxvvqwawj0-nixos-vm.drv'.
       Reason: 2 dependencies failed.
       Output paths:
         /nix/store/gsiw5x9w0p3qwvnhg6vgmi0f3n3yh8qh-nixos-vm
error: Cannot build '/nix/store/vsy3ra3q4b1g4ymadkbiwj89vwac6kxa-driverConfiguration.json.drv'.
       Reason: 2 dependencies failed.
       Output paths:
         /nix/store/q8c1jck356ybk2hsm6l1kgvdrj6szsnw-driverConfiguration.json
error: Cannot build '/nix/store/h2vc4g33vwb7273y7ccw5p57y7j94y10-nixos-test-driver-mycelium.drv'.
       Reason: 2 dependencies failed.
       Output paths:
         /nix/store/8g0kpihgg2vda6yh58bvl4q662cqmqym-nixos-test-driver-mycelium
error: Cannot build '/nix/store/x1dh2i6jkhfils5a2jcnav02ivbz03i1-vm-test-run-mycelium.drv'.
       Reason: 1 dependency failed.
       Output paths:
         /nix/store/w27db3ssnr5iy38296351dyanwpcdm59-vm-test-run-mycelium
failed checks.aarch64-linux.ncps 3m 49s
setup: error: Cannot build '/nix/store/41yyjf1zvmf67705gs1vaaqrkwn5kyw1-closure-info.drv'. Reason: 2 dependencies failed. Output paths: / …
setup:
error: Cannot build '/nix/store/41yyjf1zvmf67705gs1vaaqrkwn5kyw1-closure-info.drv'.
       Reason: 2 dependencies failed.
       Output paths:
         /nix/store/67x24sfzc676fjqf7pb886l52008w8l9-closure-info
error: Cannot build '/nix/store/z3ms1a9rg6imzrnla9j2gpjbkq4ivlq2-system-units.drv'.
       Reason: 10 dependencies failed.
       Output paths:
         /nix/store/zy76dy56pwkgdcwqbf4jkdcm57q1q6zx-system-units
error: Cannot build '/nix/store/0qxrkgp7kvl54dq1v8zk3mzrds9xh6c9-etc.drv'.
       Reason: 9 dependencies failed.
       Output paths:
         /nix/store/djh9s8fy70acx9d8yai73fl1v56rghr7-etc
error: Cannot build '/nix/store/j2znbyahhvhwyv51am6znd5cnybzjglx-activate.drv'.
       Reason: 2 dependencies failed.
       Output paths:
         /nix/store/p6zfamym8pgqhqz62hi37xxgr50b2595-activate
error: Cannot build '/nix/store/akyx1yyjm8f4nssr4q01h3f8v6jngak0-nixos-system-clare-test.drv'.
       Reason: 3 dependencies failed.
       Output paths:
         /nix/store/ll9lrz61yvrkpvcnclcj8csfyy2hpar6-nixos-system-clare-test
error: Cannot build '/nix/store/1l3lmzknnsawbca0pfhl91br5cb3wxfa-closure-info.drv'.
       Reason: 2 dependencies failed.
       Output paths:
         /nix/store/qy1jk6ydxwpic7zd91ykmbrp9761v8pn-closure-info
error: Cannot build '/nix/store/6bj2qm58bkj89qa2id4jb2aw1294wrgi-nixos-test-driver-ncps.drv'.
       Reason: 6 dependencies failed.
       Output paths:
         /nix/store/px4qgh8j2vr43b5xja3vfxj9d06xy0xz-nixos-test-driver-ncps
error: Cannot build '/nix/store/lxl8bmrj2lq1lmjl30kv4zily89gas3b-container-test-run-ncps.drv'.
       Reason: 1 dependency failed.
       Output paths:
         /nix/store/4j7b2147773zqs1314qzis9sh1dass82-container-test-run-ncps
failed checks.aarch64-linux.p2p-ssh-iroh 3m 49s
setup: error: Cannot build '/nix/store/1jk783gczv8sr717f5la2nwb3lawcps1-closure-info.drv'. Reason: 2 dependencies failed. Output paths: / …
setup:
error: Cannot build '/nix/store/1jk783gczv8sr717f5la2nwb3lawcps1-closure-info.drv'.
       Reason: 2 dependencies failed.
       Output paths:
         /nix/store/ckvwb9m7n7jv31cxgp8s1czkpqvpwnsz-closure-info
error: Cannot build '/nix/store/mszifxlvjd71pkdd7lv34lq6mji7qh6s-system-units.drv'.
       Reason: 8 dependencies failed.
       Output paths:
         /nix/store/9yv5xxic9wn84h6pqp8g32y0cc1gr4qp-system-units
error: Cannot build '/nix/store/77763vqqdcw0g8ndjzq4r37nz2641z21-etc.drv'.
       Reason: 7 dependencies failed.
       Output paths:
         /nix/store/96wicj2xfnxdjgss5bkk23864di9pwkm-etc
error: Cannot build '/nix/store/65gya6n87rdgvqdhsq8vqs8idda743k7-activate.drv'.
       Reason: 2 dependencies failed.
       Output paths:
         /nix/store/dc7ipkhw9k8yrxgzhdm2nl2f9jlqwajv-activate
error: Cannot build '/nix/store/qnbfsk7r17n3p6xjxdhlqs7ffwcp8ka2-nixos-system-client-test.drv'.
       Reason: 3 dependencies failed.
       Output paths:
         /nix/store/v7zxqwcy638njhs95rr2b7y4qvl6pkyn-nixos-system-client-test
error: Cannot build '/nix/store/wghr7fvfh9haz1pmpbim12qja89k022g-closure-info.drv'.
       Reason: 2 dependencies failed.
       Output paths:
         /nix/store/rr37hjv8fwkys67aq31b0f75ghdwdpi1-closure-info
error: Cannot build '/nix/store/03yiq8v5kfhv0l7gjhvzdn96czawgks0-nixos-test-driver-clan-test-p2p-ssh-iroh.drv'.
       Reason: 4 dependencies failed.
       Output paths:
         /nix/store/dp6ixn0waflk567201kmx19irfa0qzvg-nixos-test-driver-clan-test-p2p-ssh-iroh
error: Cannot build '/nix/store/h03r97ml22kjwpfqcr4z56404anccb8w-container-test-run-clan-test-p2p-ssh-iroh.drv'.
       Reason: 1 dependency failed.
       Output paths:
         /nix/store/9ziia2h96kjc580qn14ji2k0n69mq0mr-container-test-run-clan-test-p2p-ssh-iroh
failed checks.aarch64-linux.sshd 3m 38s
setup: error: Cannot build '/nix/store/h5nj0slrjx689m4gfhjmz1s2l71fvy60-closure-info.drv'. Reason: 2 dependencies failed. Output paths: / …
setup:
error: Cannot build '/nix/store/h5nj0slrjx689m4gfhjmz1s2l71fvy60-closure-info.drv'.
       Reason: 2 dependencies failed.
       Output paths:
         /nix/store/5v635nrpsks935yk2w2m2l72wp3v769r-closure-info
error: Cannot build '/nix/store/mszifxlvjd71pkdd7lv34lq6mji7qh6s-system-units.drv'.
       Reason: 7 dependencies failed.
       Output paths:
         /nix/store/9yv5xxic9wn84h6pqp8g32y0cc1gr4qp-system-units
error: Cannot build '/nix/store/zfwq5a33vmn0hfdf5r331r47fcqbcpr7-etc.drv'.
       Reason: 7 dependencies failed.
       Output paths:
         /nix/store/19lp42mw876yiicxbbs9pz5agbhgh0cl-etc
error: Cannot build '/nix/store/d6hh54szv2lhzzpa9yv6q0r7gcdjg2i7-activate.drv'.
       Reason: 2 dependencies failed.
       Output paths:
         /nix/store/qhx2bfmr2dxqpznwzf7r1nwj790nk9r5-activate
error: Cannot build '/nix/store/vn586v7gfk5iaqhliazw17q3lzvdjm47-nixos-system-client-test.drv'.
       Reason: 3 dependencies failed.
       Output paths:
         /nix/store/wa79k5mynl4c5w5x1ai4bhnbmcvw7sac-nixos-system-client-test
error: Cannot build '/nix/store/1h68ljx8i1039fl9az6gk6ylyrpr6arm-closure-info.drv'.
       Reason: 2 dependencies failed.
       Output paths:
         /nix/store/4vi49pak1y4ypldjvj17k27m1a560h0q-closure-info
error: Cannot build '/nix/store/rldaaphq7y4lvfkfvn2nfb3rb9i33f0g-nixos-test-driver-sshd.drv'.
       Reason: 4 dependencies failed.
       Output paths:
         /nix/store/qxw0hz6f19sw69ayp2x9kvk9aqb1lvfr-nixos-test-driver-sshd
error: Cannot build '/nix/store/11mva5m2vggsn84cgm77q29npdszgxwj-container-test-run-sshd.drv'.
       Reason: 1 dependency failed.
       Output paths:
         /nix/store/lq8grpv7d19fsjdp51ck2rvkqfgzyz3v-container-test-run-sshd
failed checks.aarch64-linux.syncthing-service 2m 39s
setup: error: Cannot build '/nix/store/0zyn2hnsv3gjll845gv0yp25910aabdz-nixos-system-machine3-test.drv'. Reason: 4 dependencies failed. Output pat …
setup:
error: Cannot build '/nix/store/0zyn2hnsv3gjll845gv0yp25910aabdz-nixos-system-machine3-test.drv'.
       Reason: 4 dependencies failed.
       Output paths:
         /nix/store/h48da0drnl0bb32yq30pjb035ny2js18-nixos-system-machine3-test
error: Cannot build '/nix/store/61mh4svi4mp40bym328rd01v92fbmhc0-nixos-system-machine4-test.drv'.
       Reason: 4 dependencies failed.
       Output paths:
         /nix/store/wblx0wb31xa53chi7972i5q0vrb5zmcr-nixos-system-machine4-test
error: Cannot build '/nix/store/3fnbkia21zlz6yhdvqr65amsri1q2mph-closure-info.drv'.
       Reason: 2 dependencies failed.
       Output paths:
         /nix/store/zhiy0b0z96hpyxcar6y8v91ckvzg9j0z-closure-info
error: Cannot build '/nix/store/akc03h9l36clf2ibddnc2fhpr6pkwdy8-closure-info.drv'.
       Reason: 2 dependencies failed.
       Output paths:
         /nix/store/nf3pf6d7syj0l136ky8kkav8rjrjfai4-closure-info
error: Cannot build '/nix/store/r5kf2zak85hz6wr6m5igbfa3x84b4l7v-closure-info.drv'.
       Reason: 2 dependencies failed.
       Output paths:
         /nix/store/k1zq1yq7q01z2r9g88krw8i2philj2qr-closure-info
error: Cannot build '/nix/store/zyzxlz17mqy2gsdz9ckl43m3p1055mdp-closure-info.drv'.
       Reason: 2 dependencies failed.
       Output paths:
         /nix/store/gqkb23ral37vjj1v9dj6b2mh77d2y8j2-closure-info
error: Cannot build '/nix/store/am8cy1i0v7j2br1razmw38qfy1nk5z9z-nixos-test-driver-syncthing-service.drv'.
       Reason: 8 dependencies failed.
       Output paths:
         /nix/store/2s6yykrgbwlglm3am3l9rrwz0w37mjgr-nixos-test-driver-syncthing-service
error: Cannot build '/nix/store/3ag1sivd2p99j9iiby5gkgwzla76g7hx-container-test-run-syncthing-service.drv'.
       Reason: 1 dependency failed.
       Output paths:
         /nix/store/vww1rhw9v6dhd74hycwgrmvv7q51cvmx-container-test-run-syncthing-service
failed checks.aarch64-linux.users 2m 43s
setup: error: Cannot build '/nix/store/59vyxsc40r8xqp475vp6aqp3h2l2g6z4-user-units.drv'. Reason: 1 dependency failed. Output paths: /nix/ …
setup:
error: Cannot build '/nix/store/59vyxsc40r8xqp475vp6aqp3h2l2g6z4-user-units.drv'.
       Reason: 1 dependency failed.
       Output paths:
         /nix/store/v39qfgs15kiq814kdlkaw6c4picqwfbz-user-units
error: Cannot build '/nix/store/4lx6mvf8wnr3w7p90bmfvrqvlf6rlw6g-system-units.drv'.
       Reason: 14 dependencies failed.
       Output paths:
         /nix/store/lxf9xlw30vgdgv6bi3p17f48wgvl6s62-system-units
error: Cannot build '/nix/store/sfz3280hwhc6mwv8qpyw0252l3h5rj1h-etc.drv'.
       Reason: 11 dependencies failed.
       Output paths:
         /nix/store/9skd731wbyqkjny7rzil4mjj6x59hwmg-etc
error: Cannot build '/nix/store/bv4vc12fw7j9n759ly5jaf4lwcgzlqxs-activate.drv'.
       Reason: 2 dependencies failed.
       Output paths:
         /nix/store/lr5cj1gxq1b0j6m2yrl3nqyrvgris2l0-activate
error: Cannot build '/nix/store/1sg5bv0k64rs5bsh5bvg5rhr24nxjljp-nixos-system-server-test.drv'.
       Reason: 4 dependencies failed.
       Output paths:
         /nix/store/wdaxzc3q2rcpfcl34d9j4midxz7gbm5k-nixos-system-server-test
error: Cannot build '/nix/store/xbxn37lj1sg7xpmaw2nygg7k0bn9lgwk-closure-info.drv'.
       Reason: 2 dependencies failed.
       Output paths:
         /nix/store/91pw2phbfpn9rqj7wdbykjbbph0r656f-closure-info
error: Cannot build '/nix/store/6prh76n7ax8a852zv9zrl2m4ypi2dccq-nixos-test-driver-users.drv'.
       Reason: 2 dependencies failed.
       Output paths:
         /nix/store/n4ys2i971z0jijikryl2jcc9w9l3p1g5-nixos-test-driver-users
error: Cannot build '/nix/store/vpi4ca88p2h48xnjxbh9qlpk954nzc9x-container-test-run-users.drv'.
       Reason: 1 dependency failed.
       Output paths:
         /nix/store/n8mn83m21daxbp4mn7hl6nn3nsnhyl1r-container-test-run-users
failed checks.aarch64-linux.wifi 2m 38s
setup: error: Cannot build '/nix/store/pawkfiz5zhlz5bvgc0ssih6qf29hhxgv-closure-info.drv'. Reason: 1 dependency failed. Output paths: /ni …
setup:
error: Cannot build '/nix/store/pawkfiz5zhlz5bvgc0ssih6qf29hhxgv-closure-info.drv'.
       Reason: 1 dependency failed.
       Output paths:
         /nix/store/y1fs16wpfw7mbxj7mwsh976bpxlxcziw-closure-info
error: Cannot build '/nix/store/5xkc4fh8wsb3iilx7b7647xhmifsalxd-run-nixos-vm.drv'.
       Reason: 3 dependencies failed.
       Output paths:
         /nix/store/8fjpj6r2pnc3pgss1m1gm43hvv1sb26j-run-nixos-vm
error: Cannot build '/nix/store/ix7hd1l6sp6k780f3rrsxgi71jhx3h39-run-nixos-vm.drv'.
       Reason: 3 dependencies failed.
       Output paths:
         /nix/store/bph75jrb4ipi5vrjcnanvkz7dwgd9kyv-run-nixos-vm
error: Cannot build '/nix/store/6lw3ysx26cam2w0j7aws1dvhxnicscyw-nixos-vm.drv'.
       Reason: 2 dependencies failed.
       Output paths:
         /nix/store/pplf0qhfh7323k8pzcgs8g2qvzv89nbh-nixos-vm
error: Cannot build '/nix/store/x5n6949y05pb6fpvr38fy4jadv42792s-nixos-vm.drv'.
       Reason: 2 dependencies failed.
       Output paths:
         /nix/store/gh1ki75zjlih7z3mq708mwjk2y6m73sn-nixos-vm
error: Cannot build '/nix/store/y6j3ilfdacwa59zljbk0ifmngwi5ai2s-driverConfiguration.json.drv'.
       Reason: 3 dependencies failed.
       Output paths:
         /nix/store/k6ypfwgwgfm8jjsbk82csqpxnii7jnc9-driverConfiguration.json
error: Cannot build '/nix/store/4d302l1nzs2558knvvaj4b059d4sc5dk-nixos-test-driver-wifi.drv'.
       Reason: 2 dependencies failed.
       Output paths:
         /nix/store/as4za83kx8lyw3r7gm9kgvv67d2fpjv0-nixos-test-driver-wifi
error: Cannot build '/nix/store/4j30cg570wwa9fzw32ja3yw92w1r01rz-vm-test-run-wifi.drv'.
       Reason: 1 dependency failed.
       Output paths:
         /nix/store/hp4rz5livx7gn75ilqyy2cpln96k9bhf-vm-test-run-wifi
156 succeeded
succeeded attributes
status attribute duration
loading…