nixbot

builds

clan/clan-core build #781 failed

branch main · PR #8136 · commit 30d16ead5d · · took 3h 0m · eval 44s

eval warnings 5 kinds · 164 occurrences
  • error gRPC Connect on 'nix-store.geninf.io:50051' failed: role 'write' may not call Connect ×26
  • error ×68
  • error cannot open connection to remote store 'grpc://nix-store.geninf.io:50051': error: Nix daemon disconnected unexpectedly (maybe it crashed?) ×26
  • error opening a connection to remote store 'grpc://nix-store.geninf.io:50051' previously failed ×42
  • warn stdenv.isDarwin is deprecated, use stdenv.hostPlatform.isDarwin instead ×2

103 failed ⚠ 1
failed attributes
status attribute duration
failed checks.x86_64-linux.all-packages
  • stdenv.isDarwin is deprecated, use stdenv.hostPlatform.isDarwin instead
3h 0m
setup: don't know how to build these paths: /nix/store/h7s8dl628qx6ijchxjs670m8rs9rh72f-all-packages.drv warning: ignoring the client-specified setting 'store …
setup:
don't know how to build these paths:
  /nix/store/h7s8dl628qx6ijchxjs670m8rs9rh72f-all-packages.drv
warning: ignoring the client-specified setting 'store', because it is a restricted setting and you are not a trusted user
yx4j6iv9mfcblbpmli81aljrzr9f6yqx-clan-runtime.drv: gi-build-x86-02: not scheduled here: yx4j6iv9mfcblbpmli81aljrzr9f6yqx-clan-runtime.drv, asking the scheduler again
j17vjc3n0s5i7xhhla20r5v2yx4br91m-clan-core-flake.drv: gi-build-x86-02: not scheduled here: j17vjc3n0s5i7xhhla20r5v2yx4br91m-clan-core-flake.drv, asking the scheduler again
z77xpflqalnqi846bz57l35jrvkhnfqk-disko.drv: gi-build-x86-02: not scheduled here: z77xpflqalnqi846bz57l35jrvkhnfqk-disko.drv, asking the scheduler again
j17vjc3n0s5i7xhhla20r5v2yx4br91m-clan-core-flake.drv: build-x86-01: not scheduled here: j17vjc3n0s5i7xhhla20r5v2yx4br91m-clan-core-flake.drv, asking the scheduler again
failed checks.aarch64-darwin.all-packages 3h 0m
setup: don't know how to build these paths: /nix/store/w4nry340pgvgrn3v8xqgj2pnb57zzsny-all-packages.drv warning: ignoring the client-specified setting 'store …
setup:
don't know how to build these paths:
  /nix/store/w4nry340pgvgrn3v8xqgj2pnb57zzsny-all-packages.drv
warning: ignoring the client-specified setting 'store', because it is a restricted setting and you are not a trusted user
failed checks.aarch64-darwin.clan-pytest-with-core 3h 0m
setup: don't know how to build these paths: /nix/store/ivwv4cwsmsndkixzrj5sbicys6djb6xn-clan-pytest-with-core.drv warning: ignoring the client-specified setti …
setup:
don't know how to build these paths:
  /nix/store/ivwv4cwsmsndkixzrj5sbicys6djb6xn-clan-pytest-with-core.drv
warning: ignoring the client-specified setting 'store', because it is a restricted setting and you are not a trusted user
failed checks.aarch64-darwin.clan-pytest-without-core 3h 0m
setup: don't know how to build these paths: /nix/store/g9qf1r2v0vq5w8n2chmp6fvyanrg7ci0-clan-pytest-without-core.drv warning: ignoring the client-specified se …
setup:
don't know how to build these paths:
  /nix/store/g9qf1r2v0vq5w8n2chmp6fvyanrg7ci0-clan-pytest-without-core.drv
warning: ignoring the client-specified setting 'store', because it is a restricted setting and you are not a trusted user
failed checks.aarch64-darwin.darwin-test-darwin-machine 3h 0m
setup: /nix/store/ywdv45aw33irs0qykcbkyr1xi82nv4kr-system-path.drv these 5 paths will be fetched (459.2 KiB download, 2.4 MiB unpacked): /nix/store/6z83w67z …
setup:
  /nix/store/ywdv45aw33irs0qykcbkyr1xi82nv4kr-system-path.drv
these 5 paths will be fetched (459.2 KiB download, 2.4 MiB unpacked):
  /nix/store/6z83w67z72j57j6gajhxsw93lkv7spl7-documentation-highlighter
  /nix/store/21qhxwlxh13fx7aqx60frkxcw88wpr8x-nixos-render-docs-0.0
  /nix/store/bb8xyxv0nm6ycdn2svbxnhxpcnxkygha-python3.14-markdown-it-py-4.2.0
  /nix/store/65alfcrkljwgi4jf6g2di4l0l34y0cdp-python3.14-mdit-py-plugins-0.6.1
  /nix/store/qx946xyy3kwldmqq2pc19jkaqqm09iz3-shellcheck-0.11.0
warning: ignoring the client-specified setting 'store', because it is a restricted setting and you are not a trusted user
dependency failed checks.aarch64-darwin.devshell —
failed checks.aarch64-darwin.devShell-clan-cli 3h 0m
setup: don't know how to build these paths: /nix/store/v06nfqxhvc9zazz8f31mwy7hq6wyg4cm-clan-cli.drv warning: ignoring the client-specified setting 'store', b …
setup:
don't know how to build these paths:
  /nix/store/v06nfqxhvc9zazz8f31mwy7hq6wyg4cm-clan-cli.drv
warning: ignoring the client-specified setting 'store', because it is a restricted setting and you are not a trusted user
failed checks.aarch64-darwin.devShell-clan-site 3h 0m
setup: don't know how to build these paths: /nix/store/npq5p3kycqy99ljnxhgis7pxs1c31kbb-nix-shell.drv warning: ignoring the client-specified setting 'store', …
setup:
don't know how to build these paths:
  /nix/store/npq5p3kycqy99ljnxhgis7pxs1c31kbb-nix-shell.drv
warning: ignoring the client-specified setting 'store', because it is a restricted setting and you are not a trusted user
failed checks.aarch64-darwin.devShell-default 3h 0m
setup: don't know how to build these paths: /nix/store/brz0c6gmmcym450g0kl9qijzjhxalm1w-clan.drv warning: ignoring the client-specified setting 'store', becau …
setup:
don't know how to build these paths:
  /nix/store/brz0c6gmmcym450g0kl9qijzjhxalm1w-clan.drv
warning: ignoring the client-specified setting 'store', because it is a restricted setting and you are not a trusted user
failed checks.aarch64-darwin.devShell-inventory-schema 3h 0m
setup: /nix/store/28dlw36xhlkjrizw15629qi4p7ajwmk4-clan-runtime.drv /nix/store/8h1vhzsli8jki4pscr5glyx5fz8zcbcj-treefmt.toml.drv /nix/store/sh18xkjs9qkv3b …
setup:
  /nix/store/28dlw36xhlkjrizw15629qi4p7ajwmk4-clan-runtime.drv
  /nix/store/8h1vhzsli8jki4pscr5glyx5fz8zcbcj-treefmt.toml.drv
  /nix/store/sh18xkjs9qkv3bp4gl78n0wrrd8r98j0-treefmt.drv
  /nix/store/zg61z9vxpdfnmgmcab1qyyw5wnxac7xf-clan-inventory-schema.drv
these 2 paths will be fetched (5.9 MiB download, 15.9 MiB unpacked):
  /nix/store/80pgv5h5aqh2y2bjwps83gaad6khgpv3-json2x-0.1.0
  /nix/store/xycva5d42r7pxfy791189qg971vyzh1b-rumdl-0.2.77
warning: ignoring the client-specified setting 'store', because it is a restricted setting and you are not a trusted user
failed checks.aarch64-darwin.eval-tests 3h 0m
setup: don't know how to build these paths: /nix/store/na207mm392jcs40xmn69dcmz76mvmaw0-eval-tests-aarch64-darwin.drv warning: ignoring the client-specified s …
setup:
don't know how to build these paths:
  /nix/store/na207mm392jcs40xmn69dcmz76mvmaw0-eval-tests-aarch64-darwin.drv
warning: ignoring the client-specified setting 'store', because it is a restricted setting and you are not a trusted user
failed checks.aarch64-darwin.nixos-flash-installer 3h 0m
setup: don't know how to build these paths: /nix/store/k9wbv1m8hh9r3lvn2cbswm9gvi4ybr9q-nixos-system-flash-installer-26.11.20260926.d54020a.drv warning: ignor …
setup:
don't know how to build these paths:
  /nix/store/k9wbv1m8hh9r3lvn2cbswm9gvi4ybr9q-nixos-system-flash-installer-26.11.20260926.d54020a.drv
warning: ignoring the client-specified setting 'store', because it is a restricted setting and you are not a trusted user
failed eval checks.aarch64-linux.admin —
error: … while evaluating the attribute 'drvPath' at «https://releases.nixos.org/nixpkgs/nixpkgs-26.11pre1079900.d54020a6ac32/nixexprs.tar.xz?na …
error:
       … while evaluating the attribute 'drvPath'
         at «https://releases.nixos.org/nixpkgs/nixpkgs-26.11pre1079900.d54020a6ac32/nixexprs.tar.xz?narHash=sha256-OjqPjipsKi79LA0IEgqlsRe2XlA4Q/6zsMKSwUfTi/8%3D»/lib/customisation.nix:416:11:
          415|         // {
          416|           drvPath =
             |           ^
          417|             assert condition;

       … while calling the 'derivationStrict' builtin
         at «nix-internal»/derivation-internal.nix:37:12:
           36|
           37|   strict = derivationStrict drvAttrs;
             |            ^
           38|

       … while evaluating the option `driverConfiguration.vlans':

       … while evaluating definitions from `/nix/store/6kx9hd4w6dvxsi401dp0jwnj8n5l9h7h-source/nixos/lib/testing/driver-configuration.nix':

       … while evaluating the option `containers.client.networking.interfaces':

       … while evaluating definitions from `/nix/store/6kx9hd4w6dvxsi401dp0jwnj8n5l9h7h-source/nixos/modules/hardware/facter/networking':

       … while evaluating the option `containers.client.hardware.facter.enable':

       … while evaluating the option `containers.client.hardware.facter.report':

       … while evaluating the option `containers.client.hardware.facter.reportPath':

       … while evaluating definitions from `/nix/store/74smld9y24m9yc7az735xzn555f6wni3-source/nixosModules/clanCore/nixos-facter.nix':

       (stack trace truncated; use '--show-trace' to show the full, detailed trace)

       error: cannot open connection to remote store 'grpc://nix-store.geninf.io:50051': error: Nix daemon disconnected unexpectedly (maybe it crashed?)
failed eval checks.aarch64-linux.borgbackup —
error: … while evaluating the attribute 'drvPath' at «https://releases.nixos.org/nixpkgs/nixpkgs-26.11pre1079900.d54020a6ac32/nixexprs.tar.xz?na …
error:
       … while evaluating the attribute 'drvPath'
         at «https://releases.nixos.org/nixpkgs/nixpkgs-26.11pre1079900.d54020a6ac32/nixexprs.tar.xz?narHash=sha256-OjqPjipsKi79LA0IEgqlsRe2XlA4Q/6zsMKSwUfTi/8%3D»/lib/customisation.nix:416:11:
          415|         // {
          416|           drvPath =
             |           ^
          417|             assert condition;

       … while calling the 'derivationStrict' builtin
         at «nix-internal»/derivation-internal.nix:37:12:
           36|
           37|   strict = derivationStrict drvAttrs;
             |            ^
           38|

       … while evaluating the option `driverConfiguration.vlans':

       … while evaluating definitions from `/nix/store/6kx9hd4w6dvxsi401dp0jwnj8n5l9h7h-source/nixos/lib/testing/driver-configuration.nix':

       … while evaluating the option `containers.clientone.networking.interfaces':

       … while evaluating definitions from `/nix/store/6kx9hd4w6dvxsi401dp0jwnj8n5l9h7h-source/nixos/modules/hardware/facter/networking':

       … while evaluating the option `containers.clientone.hardware.facter.enable':

       … while evaluating the option `containers.clientone.hardware.facter.report':

       … while evaluating the option `containers.clientone.hardware.facter.reportPath':

       … while evaluating definitions from `/nix/store/74smld9y24m9yc7az735xzn555f6wni3-source/nixosModules/clanCore/nixos-facter.nix':

       (stack trace truncated; use '--show-trace' to show the full, detailed trace)

       error: cannot open connection to remote store 'grpc://nix-store.geninf.io:50051': error: Nix daemon disconnected unexpectedly (maybe it crashed?)
failed eval checks.aarch64-linux.certificates —
error: … while evaluating the attribute 'drvPath' at «https://releases.nixos.org/nixpkgs/nixpkgs-26.11pre1079900.d54020a6ac32/nixexprs.tar.xz?na …
error:
       … while evaluating the attribute 'drvPath'
         at «https://releases.nixos.org/nixpkgs/nixpkgs-26.11pre1079900.d54020a6ac32/nixexprs.tar.xz?narHash=sha256-OjqPjipsKi79LA0IEgqlsRe2XlA4Q/6zsMKSwUfTi/8%3D»/lib/customisation.nix:416:11:
          415|         // {
          416|           drvPath =
             |           ^
          417|             assert condition;

       … while calling the 'derivationStrict' builtin
         at «nix-internal»/derivation-internal.nix:37:12:
           36|
           37|   strict = derivationStrict drvAttrs;
             |            ^
           38|

       … while evaluating the option `driverConfiguration.vlans':

       … while evaluating definitions from `/nix/store/6kx9hd4w6dvxsi401dp0jwnj8n5l9h7h-source/nixos/lib/testing/driver-configuration.nix':

       … while evaluating the option `containers.ca.networking.interfaces':

       … while evaluating definitions from `/nix/store/6kx9hd4w6dvxsi401dp0jwnj8n5l9h7h-source/nixos/modules/hardware/facter/networking':

       … while evaluating the option `containers.ca.hardware.facter.enable':

       … while evaluating the option `containers.ca.hardware.facter.report':

       … while evaluating the option `containers.ca.hardware.facter.reportPath':

       … while evaluating definitions from `/nix/store/74smld9y24m9yc7az735xzn555f6wni3-source/nixosModules/clanCore/nixos-facter.nix':

       (stack trace truncated; use '--show-trace' to show the full, detailed trace)

       error: cannot open connection to remote store 'grpc://nix-store.geninf.io:50051': error: Nix daemon disconnected unexpectedly (maybe it crashed?)
failed checks.aarch64-linux.darwin-test-darwin-machine 3h 0m
setup: don't know how to build these paths: /nix/store/y3ypx4j68qfkvibd94450xqz0iviayyj-darwin-system-26.11.4cff07d.drv warning: ignoring the client-specified …
setup:
don't know how to build these paths:
  /nix/store/y3ypx4j68qfkvibd94450xqz0iviayyj-darwin-system-26.11.4cff07d.drv
warning: ignoring the client-specified setting 'store', because it is a restricted setting and you are not a trusted user
failed eval checks.aarch64-linux.data-mesher —
error: … while evaluating the attribute 'drvPath' at «https://releases.nixos.org/nixpkgs/nixpkgs-26.11pre1079900.d54020a6ac32/nixexprs.tar.xz?na …
error:
       … while evaluating the attribute 'drvPath'
         at «https://releases.nixos.org/nixpkgs/nixpkgs-26.11pre1079900.d54020a6ac32/nixexprs.tar.xz?narHash=sha256-OjqPjipsKi79LA0IEgqlsRe2XlA4Q/6zsMKSwUfTi/8%3D»/lib/customisation.nix:416:11:
          415|         // {
          416|           drvPath =
             |           ^
          417|             assert condition;

       … while calling the 'derivationStrict' builtin
         at «nix-internal»/derivation-internal.nix:37:12:
           36|
           37|   strict = derivationStrict drvAttrs;
             |            ^
           38|

       … while evaluating the option `driverConfiguration.vlans':

       … while evaluating definitions from `/nix/store/6kx9hd4w6dvxsi401dp0jwnj8n5l9h7h-source/nixos/lib/testing/driver-configuration.nix':

       … while evaluating the option `containers.alpha.networking.interfaces':

       … while evaluating definitions from `/nix/store/6kx9hd4w6dvxsi401dp0jwnj8n5l9h7h-source/nixos/modules/hardware/facter/networking':

       … while evaluating the option `containers.alpha.hardware.facter.enable':

       … while evaluating the option `containers.alpha.hardware.facter.report':

       … while evaluating the option `containers.alpha.hardware.facter.reportPath':

       … while evaluating definitions from `/nix/store/74smld9y24m9yc7az735xzn555f6wni3-source/nixosModules/clanCore/nixos-facter.nix':

       (stack trace truncated; use '--show-trace' to show the full, detailed trace)

       error: opening a connection to remote store 'grpc://nix-store.geninf.io:50051' previously failed
failed eval checks.aarch64-linux.dm-dns —
error: … while evaluating the attribute 'drvPath' at «https://releases.nixos.org/nixpkgs/nixpkgs-26.11pre1079900.d54020a6ac32/nixexprs.tar.xz?na …
error:
       … while evaluating the attribute 'drvPath'
         at «https://releases.nixos.org/nixpkgs/nixpkgs-26.11pre1079900.d54020a6ac32/nixexprs.tar.xz?narHash=sha256-OjqPjipsKi79LA0IEgqlsRe2XlA4Q/6zsMKSwUfTi/8%3D»/lib/customisation.nix:416:11:
          415|         // {
          416|           drvPath =
             |           ^
          417|             assert condition;

       … while calling the 'derivationStrict' builtin
         at «nix-internal»/derivation-internal.nix:37:12:
           36|
           37|   strict = derivationStrict drvAttrs;
             |            ^
           38|

       … while evaluating the option `driverConfiguration.vlans':

       … while evaluating definitions from `/nix/store/6kx9hd4w6dvxsi401dp0jwnj8n5l9h7h-source/nixos/lib/testing/driver-configuration.nix':

       … while evaluating the option `containers.client.networking.interfaces':

       … while evaluating definitions from `/nix/store/6kx9hd4w6dvxsi401dp0jwnj8n5l9h7h-source/nixos/modules/hardware/facter/networking':

       … while evaluating the option `containers.client.hardware.facter.enable':

       … while evaluating the option `containers.client.hardware.facter.report':

       … while evaluating the option `containers.client.hardware.facter.reportPath':

       … while evaluating definitions from `/nix/store/74smld9y24m9yc7az735xzn555f6wni3-source/nixosModules/clanCore/nixos-facter.nix':

       (stack trace truncated; use '--show-trace' to show the full, detailed trace)

       error: cannot open connection to remote store 'grpc://nix-store.geninf.io:50051': error: Nix daemon disconnected unexpectedly (maybe it crashed?)
failed eval checks.aarch64-linux.dyndns —
error: … while evaluating the attribute 'drvPath' at «https://releases.nixos.org/nixpkgs/nixpkgs-26.11pre1079900.d54020a6ac32/nixexprs.tar.xz?na …
error:
       … while evaluating the attribute 'drvPath'
         at «https://releases.nixos.org/nixpkgs/nixpkgs-26.11pre1079900.d54020a6ac32/nixexprs.tar.xz?narHash=sha256-OjqPjipsKi79LA0IEgqlsRe2XlA4Q/6zsMKSwUfTi/8%3D»/lib/customisation.nix:416:11:
          415|         // {
          416|           drvPath =
             |           ^
          417|             assert condition;

       … while calling the 'derivationStrict' builtin
         at «nix-internal»/derivation-internal.nix:37:12:
           36|
           37|   strict = derivationStrict drvAttrs;
             |            ^
           38|

       … while evaluating the option `driverConfiguration.vlans':

       … while evaluating definitions from `/nix/store/6kx9hd4w6dvxsi401dp0jwnj8n5l9h7h-source/nixos/lib/testing/driver-configuration.nix':

       … while evaluating the option `containers.server.networking.interfaces':

       … while evaluating definitions from `/nix/store/6kx9hd4w6dvxsi401dp0jwnj8n5l9h7h-source/nixos/modules/hardware/facter/networking':

       … while evaluating the option `containers.server.hardware.facter.enable':

       … while evaluating the option `containers.server.hardware.facter.report':

       … while evaluating the option `containers.server.hardware.facter.reportPath':

       … while evaluating definitions from `/nix/store/74smld9y24m9yc7az735xzn555f6wni3-source/nixosModules/clanCore/nixos-facter.nix':

       (stack trace truncated; use '--show-trace' to show the full, detailed trace)

       error: cannot open connection to remote store 'grpc://nix-store.geninf.io:50051': error: Nix daemon disconnected unexpectedly (maybe it crashed?)
failed eval checks.aarch64-linux.garage —
error: … while evaluating the attribute 'drvPath' at «https://releases.nixos.org/nixpkgs/nixpkgs-26.11pre1079900.d54020a6ac32/nixexprs.tar.xz?na …
error:
       … while evaluating the attribute 'drvPath'
         at «https://releases.nixos.org/nixpkgs/nixpkgs-26.11pre1079900.d54020a6ac32/nixexprs.tar.xz?narHash=sha256-OjqPjipsKi79LA0IEgqlsRe2XlA4Q/6zsMKSwUfTi/8%3D»/lib/customisation.nix:416:11:
          415|         // {
          416|           drvPath =
             |           ^
          417|             assert condition;

       … while calling the 'derivationStrict' builtin
         at «nix-internal»/derivation-internal.nix:37:12:
           36|
           37|   strict = derivationStrict drvAttrs;
             |            ^
           38|

       … while evaluating the option `driverConfiguration.vlans':

       … while evaluating definitions from `/nix/store/6kx9hd4w6dvxsi401dp0jwnj8n5l9h7h-source/nixos/lib/testing/driver-configuration.nix':

       … while evaluating the option `containers.server.networking.interfaces':

       … while evaluating definitions from `/nix/store/6kx9hd4w6dvxsi401dp0jwnj8n5l9h7h-source/nixos/modules/hardware/facter/networking':

       … while evaluating the option `containers.server.hardware.facter.enable':

       … while evaluating the option `containers.server.hardware.facter.report':

       … while evaluating the option `containers.server.hardware.facter.reportPath':

       … while evaluating definitions from `/nix/store/74smld9y24m9yc7az735xzn555f6wni3-source/nixosModules/clanCore/nixos-facter.nix':

       (stack trace truncated; use '--show-trace' to show the full, detailed trace)

       error: cannot open connection to remote store 'grpc://nix-store.geninf.io:50051': error: Nix daemon disconnected unexpectedly (maybe it crashed?)
failed eval checks.aarch64-linux.hello-service —
error: … while evaluating the attribute 'drvPath' at «https://releases.nixos.org/nixpkgs/nixpkgs-26.11pre1079900.d54020a6ac32/nixexprs.tar.xz?na …
error:
       … while evaluating the attribute 'drvPath'
         at «https://releases.nixos.org/nixpkgs/nixpkgs-26.11pre1079900.d54020a6ac32/nixexprs.tar.xz?narHash=sha256-OjqPjipsKi79LA0IEgqlsRe2XlA4Q/6zsMKSwUfTi/8%3D»/lib/customisation.nix:416:11:
          415|         // {
          416|           drvPath =
             |           ^
          417|             assert condition;

       … while calling the 'derivationStrict' builtin
         at «nix-internal»/derivation-internal.nix:37:12:
           36|
           37|   strict = derivationStrict drvAttrs;
             |            ^
           38|

       … while evaluating the option `driverConfiguration.vlans':

       … while evaluating definitions from `/nix/store/6kx9hd4w6dvxsi401dp0jwnj8n5l9h7h-source/nixos/lib/testing/driver-configuration.nix':

       … while evaluating the option `containers.peer1.networking.interfaces':

       … while evaluating definitions from `/nix/store/6kx9hd4w6dvxsi401dp0jwnj8n5l9h7h-source/nixos/modules/hardware/facter/networking':

       … while evaluating the option `containers.peer1.hardware.facter.enable':

       … while evaluating the option `containers.peer1.hardware.facter.report':

       … while evaluating the option `containers.peer1.hardware.facter.reportPath':

       … while evaluating definitions from `/nix/store/74smld9y24m9yc7az735xzn555f6wni3-source/nixosModules/clanCore/nixos-facter.nix':

       (stack trace truncated; use '--show-trace' to show the full, detailed trace)

       error: cannot open connection to remote store 'grpc://nix-store.geninf.io:50051': error: Nix daemon disconnected unexpectedly (maybe it crashed?)
failed eval checks.aarch64-linux.kde —
error: … while evaluating the attribute 'drvPath' at «https://releases.nixos.org/nixpkgs/nixpkgs-26.11pre1079900.d54020a6ac32/nixexprs.tar.xz?na …
error:
       … while evaluating the attribute 'drvPath'
         at «https://releases.nixos.org/nixpkgs/nixpkgs-26.11pre1079900.d54020a6ac32/nixexprs.tar.xz?narHash=sha256-OjqPjipsKi79LA0IEgqlsRe2XlA4Q/6zsMKSwUfTi/8%3D»/lib/customisation.nix:416:11:
          415|         // {
          416|           drvPath =
             |           ^
          417|             assert condition;

       … while calling the 'derivationStrict' builtin
         at «nix-internal»/derivation-internal.nix:37:12:
           36|
           37|   strict = derivationStrict drvAttrs;
             |            ^
           38|

       … while evaluating the option `driverConfiguration.vlans':

       … while evaluating definitions from `/nix/store/6kx9hd4w6dvxsi401dp0jwnj8n5l9h7h-source/nixos/lib/testing/driver-configuration.nix':

       … while evaluating the option `containers.client.networking.interfaces':

       … while evaluating definitions from `/nix/store/6kx9hd4w6dvxsi401dp0jwnj8n5l9h7h-source/nixos/modules/hardware/facter/networking':

       … while evaluating the option `containers.client.hardware.facter.enable':

       … while evaluating the option `containers.client.hardware.facter.report':

       … while evaluating the option `containers.client.hardware.facter.reportPath':

       … while evaluating definitions from `/nix/store/74smld9y24m9yc7az735xzn555f6wni3-source/nixosModules/clanCore/nixos-facter.nix':

       (stack trace truncated; use '--show-trace' to show the full, detailed trace)

       error: cannot open connection to remote store 'grpc://nix-store.geninf.io:50051': error: Nix daemon disconnected unexpectedly (maybe it crashed?)
failed eval checks.aarch64-linux.localbackup —
error: … while evaluating the attribute 'drvPath' at «https://releases.nixos.org/nixpkgs/nixpkgs-26.11pre1079900.d54020a6ac32/nixexprs.tar.xz?na …
error:
       … while evaluating the attribute 'drvPath'
         at «https://releases.nixos.org/nixpkgs/nixpkgs-26.11pre1079900.d54020a6ac32/nixexprs.tar.xz?narHash=sha256-OjqPjipsKi79LA0IEgqlsRe2XlA4Q/6zsMKSwUfTi/8%3D»/lib/customisation.nix:416:11:
          415|         // {
          416|           drvPath =
             |           ^
          417|             assert condition;

       … while calling the 'derivationStrict' builtin
         at «nix-internal»/derivation-internal.nix:37:12:
           36|
           37|   strict = derivationStrict drvAttrs;
             |            ^
           38|

       … while evaluating the option `driverConfiguration.vlans':

       … while evaluating definitions from `/nix/store/6kx9hd4w6dvxsi401dp0jwnj8n5l9h7h-source/nixos/lib/testing/driver-configuration.nix':

       … while evaluating the option `containers.machine.networking.interfaces':

       … while evaluating definitions from `/nix/store/6kx9hd4w6dvxsi401dp0jwnj8n5l9h7h-source/nixos/modules/hardware/facter/networking':

       … while evaluating the option `containers.machine.hardware.facter.enable':

       … while evaluating the option `containers.machine.hardware.facter.report':

       … while evaluating the option `containers.machine.hardware.facter.reportPath':

       … while evaluating definitions from `/nix/store/74smld9y24m9yc7az735xzn555f6wni3-source/nixosModules/clanCore/nixos-facter.nix':

       (stack trace truncated; use '--show-trace' to show the full, detailed trace)

       error: cannot open connection to remote store 'grpc://nix-store.geninf.io:50051': error: Nix daemon disconnected unexpectedly (maybe it crashed?)
failed eval checks.aarch64-linux.machine-id —
error: … while evaluating the attribute 'drvPath' at «https://releases.nixos.org/nixpkgs/nixpkgs-26.11pre1079900.d54020a6ac32/nixexprs.tar.xz?na …
error:
       … while evaluating the attribute 'drvPath'
         at «https://releases.nixos.org/nixpkgs/nixpkgs-26.11pre1079900.d54020a6ac32/nixexprs.tar.xz?narHash=sha256-OjqPjipsKi79LA0IEgqlsRe2XlA4Q/6zsMKSwUfTi/8%3D»/lib/customisation.nix:416:11:
          415|         // {
          416|           drvPath =
             |           ^
          417|             assert condition;

       … while calling the 'derivationStrict' builtin
         at «nix-internal»/derivation-internal.nix:37:12:
           36|
           37|   strict = derivationStrict drvAttrs;
             |            ^
           38|

       … while evaluating the option `driverConfiguration.vlans':

       … while evaluating definitions from `/nix/store/6kx9hd4w6dvxsi401dp0jwnj8n5l9h7h-source/nixos/lib/testing/driver-configuration.nix':

       … while evaluating the option `containers.server.networking.interfaces':

       … while evaluating definitions from `/nix/store/6kx9hd4w6dvxsi401dp0jwnj8n5l9h7h-source/nixos/modules/hardware/facter/networking':

       … while evaluating the option `containers.server.hardware.facter.enable':

       … while evaluating the option `containers.server.hardware.facter.report':

       … while evaluating the option `containers.server.hardware.facter.reportPath':

       … while evaluating definitions from `/nix/store/74smld9y24m9yc7az735xzn555f6wni3-source/nixosModules/clanCore/nixos-facter.nix':

       (stack trace truncated; use '--show-trace' to show the full, detailed trace)

       error: opening a connection to remote store 'grpc://nix-store.geninf.io:50051' previously failed
failed eval checks.aarch64-linux.matrix-synapse —
error: … while evaluating the attribute 'drvPath' at «https://releases.nixos.org/nixpkgs/nixpkgs-26.11pre1079900.d54020a6ac32/nixexprs.tar.xz?na …
error:
       … while evaluating the attribute 'drvPath'
         at «https://releases.nixos.org/nixpkgs/nixpkgs-26.11pre1079900.d54020a6ac32/nixexprs.tar.xz?narHash=sha256-OjqPjipsKi79LA0IEgqlsRe2XlA4Q/6zsMKSwUfTi/8%3D»/lib/customisation.nix:416:11:
          415|         // {
          416|           drvPath =
             |           ^
          417|             assert condition;

       … while calling the 'derivationStrict' builtin
         at «nix-internal»/derivation-internal.nix:37:12:
           36|
           37|   strict = derivationStrict drvAttrs;
             |            ^
           38|

       … while evaluating the option `driverConfiguration.vlans':

       … while evaluating definitions from `/nix/store/6kx9hd4w6dvxsi401dp0jwnj8n5l9h7h-source/nixos/lib/testing/driver-configuration.nix':

       … while evaluating the option `containers.machine.networking.interfaces':

       … while evaluating definitions from `/nix/store/6kx9hd4w6dvxsi401dp0jwnj8n5l9h7h-source/nixos/modules/hardware/facter/networking':

       … while evaluating the option `containers.machine.hardware.facter.enable':

       … while evaluating the option `containers.machine.hardware.facter.report':

       … while evaluating the option `containers.machine.hardware.facter.reportPath':

       … while evaluating definitions from `/nix/store/74smld9y24m9yc7az735xzn555f6wni3-source/nixosModules/clanCore/nixos-facter.nix':

       (stack trace truncated; use '--show-trace' to show the full, detailed trace)

       error: opening a connection to remote store 'grpc://nix-store.geninf.io:50051' previously failed
failed eval checks.aarch64-linux.monitoring —
error: … while evaluating the attribute 'drvPath' at «https://releases.nixos.org/nixpkgs/nixpkgs-26.11pre1079900.d54020a6ac32/nixexprs.tar.xz?na …
error:
       … while evaluating the attribute 'drvPath'
         at «https://releases.nixos.org/nixpkgs/nixpkgs-26.11pre1079900.d54020a6ac32/nixexprs.tar.xz?narHash=sha256-OjqPjipsKi79LA0IEgqlsRe2XlA4Q/6zsMKSwUfTi/8%3D»/lib/customisation.nix:416:11:
          415|         // {
          416|           drvPath =
             |           ^
          417|             assert condition;

       … while calling the 'derivationStrict' builtin
         at «nix-internal»/derivation-internal.nix:37:12:
           36|
           37|   strict = derivationStrict drvAttrs;
             |            ^
           38|

       … while evaluating the option `driverConfiguration.vlans':

       … while evaluating definitions from `/nix/store/6kx9hd4w6dvxsi401dp0jwnj8n5l9h7h-source/nixos/lib/testing/driver-configuration.nix':

       … while evaluating the option `containers.machine1.networking.interfaces':

       … while evaluating definitions from `/nix/store/6kx9hd4w6dvxsi401dp0jwnj8n5l9h7h-source/nixos/modules/hardware/facter/networking':

       … while evaluating the option `containers.machine1.hardware.facter.enable':

       … while evaluating the option `containers.machine1.hardware.facter.report':

       … while evaluating the option `containers.machine1.hardware.facter.reportPath':

       … while evaluating definitions from `/nix/store/74smld9y24m9yc7az735xzn555f6wni3-source/nixosModules/clanCore/nixos-facter.nix':

       (stack trace truncated; use '--show-trace' to show the full, detailed trace)

       error: cannot open connection to remote store 'grpc://nix-store.geninf.io:50051': error: Nix daemon disconnected unexpectedly (maybe it crashed?)
failed eval checks.aarch64-linux.mycelium —
error: … while evaluating the attribute 'drvPath' at «https://releases.nixos.org/nixpkgs/nixpkgs-26.11pre1079900.d54020a6ac32/nixexprs.tar.xz?na …
error:
       … while evaluating the attribute 'drvPath'
         at «https://releases.nixos.org/nixpkgs/nixpkgs-26.11pre1079900.d54020a6ac32/nixexprs.tar.xz?narHash=sha256-OjqPjipsKi79LA0IEgqlsRe2XlA4Q/6zsMKSwUfTi/8%3D»/lib/customisation.nix:416:11:
          415|         // {
          416|           drvPath =
             |           ^
          417|             assert condition;

       … while calling the 'derivationStrict' builtin
         at «nix-internal»/derivation-internal.nix:37:12:
           36|
           37|   strict = derivationStrict drvAttrs;
             |            ^
           38|

       … while evaluating the option `driverConfiguration.vlans':

       … while evaluating definitions from `/nix/store/6kx9hd4w6dvxsi401dp0jwnj8n5l9h7h-source/nixos/lib/testing/driver-configuration.nix':

       … while evaluating the option `nodes.server.networking.interfaces':

       … while evaluating definitions from `/nix/store/6kx9hd4w6dvxsi401dp0jwnj8n5l9h7h-source/nixos/modules/hardware/facter/networking':

       … while evaluating the option `nodes.server.hardware.facter.enable':

       … while evaluating the option `nodes.server.hardware.facter.report':

       … while evaluating the option `nodes.server.hardware.facter.reportPath':

       … while evaluating definitions from `/nix/store/74smld9y24m9yc7az735xzn555f6wni3-source/nixosModules/clanCore/nixos-facter.nix':

       (stack trace truncated; use '--show-trace' to show the full, detailed trace)

       error: cannot open connection to remote store 'grpc://nix-store.geninf.io:50051': error: Nix daemon disconnected unexpectedly (maybe it crashed?)
failed eval checks.aarch64-linux.ncps —
error: … while evaluating the attribute 'drvPath' at «https://releases.nixos.org/nixpkgs/nixpkgs-26.11pre1079900.d54020a6ac32/nixexprs.tar.xz?na …
error:
       … while evaluating the attribute 'drvPath'
         at «https://releases.nixos.org/nixpkgs/nixpkgs-26.11pre1079900.d54020a6ac32/nixexprs.tar.xz?narHash=sha256-OjqPjipsKi79LA0IEgqlsRe2XlA4Q/6zsMKSwUfTi/8%3D»/lib/customisation.nix:416:11:
          415|         // {
          416|           drvPath =
             |           ^
          417|             assert condition;

       … while calling the 'derivationStrict' builtin
         at «nix-internal»/derivation-internal.nix:37:12:
           36|
           37|   strict = derivationStrict drvAttrs;
             |            ^
           38|

       … while evaluating the option `driverConfiguration.vlans':

       … while evaluating definitions from `/nix/store/6kx9hd4w6dvxsi401dp0jwnj8n5l9h7h-source/nixos/lib/testing/driver-configuration.nix':

       … while evaluating the option `nodes.alice.networking.interfaces':

       … while evaluating definitions from `/nix/store/6kx9hd4w6dvxsi401dp0jwnj8n5l9h7h-source/nixos/modules/hardware/facter/networking':

       … while evaluating the option `nodes.alice.hardware.facter.enable':

       … while evaluating the option `nodes.alice.hardware.facter.report':

       … while evaluating the option `nodes.alice.hardware.facter.reportPath':

       … while evaluating definitions from `/nix/store/74smld9y24m9yc7az735xzn555f6wni3-source/nixosModules/clanCore/nixos-facter.nix':

       (stack trace truncated; use '--show-trace' to show the full, detailed trace)

       error: opening a connection to remote store 'grpc://nix-store.geninf.io:50051' previously failed
failed checks.aarch64-linux.nixos-documentation 3h 0m
setup: don't know how to build these paths: /nix/store/2h6n4pg4p2xkgz5p1r2fgk3igb5pnrps-nixos-system-test-documentation-26.11.20260926.d54020a.drv warning: ig …
setup:
don't know how to build these paths:
  /nix/store/2h6n4pg4p2xkgz5p1r2fgk3igb5pnrps-nixos-system-test-documentation-26.11.20260926.d54020a.drv
warning: ignoring the client-specified setting 'store', because it is a restricted setting and you are not a trusted user
jzljwhkq80yvrbvf6f0pvi8xncsw40qs-etc-nix-registry.json.drv: gi-build-x86-02: not scheduled here: jzljwhkq80yvrbvf6f0pvi8xncsw40qs-etc-nix-registry.json.drv, asking the scheduler again
failed checks.aarch64-linux.nixos-flash-installer 3h 0m
setup: don't know how to build these paths: /nix/store/k9wbv1m8hh9r3lvn2cbswm9gvi4ybr9q-nixos-system-flash-installer-26.11.20260926.d54020a.drv warning: ignor …
setup:
don't know how to build these paths:
  /nix/store/k9wbv1m8hh9r3lvn2cbswm9gvi4ybr9q-nixos-system-flash-installer-26.11.20260926.d54020a.drv
warning: ignoring the client-specified setting 'store', because it is a restricted setting and you are not a trusted user
nl07f9p8vpvnlh7x4dw49pm2655fdml0-nixos-26.11.20260926.d54020a.drv: build-x86-01: not scheduled here: nl07f9p8vpvnlh7x4dw49pm2655fdml0-nixos-26.11.20260926.d54020a.drv, asking the scheduler again
failed eval checks.aarch64-linux.nixos-test-password-store-mounts —
error: … while evaluating the attribute 'drvPath' at «https://releases.nixos.org/nixpkgs/nixpkgs-26.11pre1079900.d54020a6ac32/nixexprs.tar.xz?na …
error:
       … while evaluating the attribute 'drvPath'
         at «https://releases.nixos.org/nixpkgs/nixpkgs-26.11pre1079900.d54020a6ac32/nixexprs.tar.xz?narHash=sha256-OjqPjipsKi79LA0IEgqlsRe2XlA4Q/6zsMKSwUfTi/8%3D»/lib/customisation.nix:416:11:
          415|         // {
          416|           drvPath =
             |           ^
          417|             assert condition;

       … while calling the 'derivationStrict' builtin
         at «nix-internal»/derivation-internal.nix:37:12:
           36|
           37|   strict = derivationStrict drvAttrs;
             |            ^
           38|

       … while evaluating the option `driverConfiguration.vlans':

       … while evaluating definitions from `/nix/store/6kx9hd4w6dvxsi401dp0jwnj8n5l9h7h-source/nixos/lib/testing/driver-configuration.nix':

       … while evaluating the option `nodes.machine.networking.interfaces':

       … while evaluating definitions from `/nix/store/6kx9hd4w6dvxsi401dp0jwnj8n5l9h7h-source/nixos/modules/hardware/facter/networking':

       … while evaluating the option `nodes.machine.hardware.facter.enable':

       … while evaluating the option `nodes.machine.hardware.facter.report':

       … while evaluating the option `nodes.machine.hardware.facter.reportPath':

       … while evaluating definitions from `/nix/store/74smld9y24m9yc7az735xzn555f6wni3-source/nixosModules/clanCore/nixos-facter.nix':

       (stack trace truncated; use '--show-trace' to show the full, detailed trace)

       error: opening a connection to remote store 'grpc://nix-store.geninf.io:50051' previously failed
failed eval checks.aarch64-linux.p2p-ssh-iroh —
error: … while evaluating the attribute 'drvPath' at «https://releases.nixos.org/nixpkgs/nixpkgs-26.11pre1079900.d54020a6ac32/nixexprs.tar.xz?na …
error:
       … while evaluating the attribute 'drvPath'
         at «https://releases.nixos.org/nixpkgs/nixpkgs-26.11pre1079900.d54020a6ac32/nixexprs.tar.xz?narHash=sha256-OjqPjipsKi79LA0IEgqlsRe2XlA4Q/6zsMKSwUfTi/8%3D»/lib/customisation.nix:416:11:
          415|         // {
          416|           drvPath =
             |           ^
          417|             assert condition;

       … while calling the 'derivationStrict' builtin
         at «nix-internal»/derivation-internal.nix:37:12:
           36|
           37|   strict = derivationStrict drvAttrs;
             |            ^
           38|

       … while evaluating the option `driverConfiguration.vlans':

       … while evaluating definitions from `/nix/store/6kx9hd4w6dvxsi401dp0jwnj8n5l9h7h-source/nixos/lib/testing/driver-configuration.nix':

       … while evaluating the option `containers.client.networking.interfaces':

       … while evaluating definitions from `/nix/store/6kx9hd4w6dvxsi401dp0jwnj8n5l9h7h-source/nixos/modules/hardware/facter/networking':

       … while evaluating the option `containers.client.hardware.facter.enable':

       … while evaluating the option `containers.client.hardware.facter.report':

       … while evaluating the option `containers.client.hardware.facter.reportPath':

       … while evaluating definitions from `/nix/store/74smld9y24m9yc7az735xzn555f6wni3-source/nixosModules/clanCore/nixos-facter.nix':

       (stack trace truncated; use '--show-trace' to show the full, detailed trace)

       error: opening a connection to remote store 'grpc://nix-store.geninf.io:50051' previously failed
failed eval checks.aarch64-linux.packages —
error: … while evaluating the attribute 'drvPath' at «https://releases.nixos.org/nixpkgs/nixpkgs-26.11pre1079900.d54020a6ac32/nixexprs.tar.xz?na …
error:
       … while evaluating the attribute 'drvPath'
         at «https://releases.nixos.org/nixpkgs/nixpkgs-26.11pre1079900.d54020a6ac32/nixexprs.tar.xz?narHash=sha256-OjqPjipsKi79LA0IEgqlsRe2XlA4Q/6zsMKSwUfTi/8%3D»/lib/customisation.nix:416:11:
          415|         // {
          416|           drvPath =
             |           ^
          417|             assert condition;

       … while calling the 'derivationStrict' builtin
         at «nix-internal»/derivation-internal.nix:37:12:
           36|
           37|   strict = derivationStrict drvAttrs;
             |            ^
           38|

       … while evaluating the option `driverConfiguration.vlans':

       … while evaluating definitions from `/nix/store/6kx9hd4w6dvxsi401dp0jwnj8n5l9h7h-source/nixos/lib/testing/driver-configuration.nix':

       … while evaluating the option `containers.server.networking.interfaces':

       … while evaluating definitions from `/nix/store/6kx9hd4w6dvxsi401dp0jwnj8n5l9h7h-source/nixos/modules/hardware/facter/networking':

       … while evaluating the option `containers.server.hardware.facter.enable':

       … while evaluating the option `containers.server.hardware.facter.report':

       … while evaluating the option `containers.server.hardware.facter.reportPath':

       … while evaluating definitions from `/nix/store/74smld9y24m9yc7az735xzn555f6wni3-source/nixosModules/clanCore/nixos-facter.nix':

       (stack trace truncated; use '--show-trace' to show the full, detailed trace)

       error: opening a connection to remote store 'grpc://nix-store.geninf.io:50051' previously failed
failed eval checks.aarch64-linux.pki —
error: … while evaluating the attribute 'drvPath' at «https://releases.nixos.org/nixpkgs/nixpkgs-26.11pre1079900.d54020a6ac32/nixexprs.tar.xz?na …
error:
       … while evaluating the attribute 'drvPath'
         at «https://releases.nixos.org/nixpkgs/nixpkgs-26.11pre1079900.d54020a6ac32/nixexprs.tar.xz?narHash=sha256-OjqPjipsKi79LA0IEgqlsRe2XlA4Q/6zsMKSwUfTi/8%3D»/lib/customisation.nix:416:11:
          415|         // {
          416|           drvPath =
             |           ^
          417|             assert condition;

       … while calling the 'derivationStrict' builtin
         at «nix-internal»/derivation-internal.nix:37:12:
           36|
           37|   strict = derivationStrict drvAttrs;
             |            ^
           38|

       … while evaluating the option `driverConfiguration.vlans':

       … while evaluating definitions from `/nix/store/6kx9hd4w6dvxsi401dp0jwnj8n5l9h7h-source/nixos/lib/testing/driver-configuration.nix':

       … while evaluating the option `nodes.caddy.networking.interfaces':

       … while evaluating definitions from `/nix/store/6kx9hd4w6dvxsi401dp0jwnj8n5l9h7h-source/nixos/modules/hardware/facter/networking':

       … while evaluating the option `nodes.caddy.hardware.facter.enable':

       … while evaluating the option `nodes.caddy.hardware.facter.report':

       … while evaluating the option `nodes.caddy.hardware.facter.reportPath':

       … while evaluating definitions from `/nix/store/74smld9y24m9yc7az735xzn555f6wni3-source/nixosModules/clanCore/nixos-facter.nix':

       (stack trace truncated; use '--show-trace' to show the full, detailed trace)

       error: cannot open connection to remote store 'grpc://nix-store.geninf.io:50051': error: Nix daemon disconnected unexpectedly (maybe it crashed?)
failed eval checks.aarch64-linux.postgresql —
error: … while evaluating the attribute 'drvPath' at «https://releases.nixos.org/nixpkgs/nixpkgs-26.11pre1079900.d54020a6ac32/nixexprs.tar.xz?na …
error:
       … while evaluating the attribute 'drvPath'
         at «https://releases.nixos.org/nixpkgs/nixpkgs-26.11pre1079900.d54020a6ac32/nixexprs.tar.xz?narHash=sha256-OjqPjipsKi79LA0IEgqlsRe2XlA4Q/6zsMKSwUfTi/8%3D»/lib/customisation.nix:416:11:
          415|         // {
          416|           drvPath =
             |           ^
          417|             assert condition;

       … while calling the 'derivationStrict' builtin
         at «nix-internal»/derivation-internal.nix:37:12:
           36|
           37|   strict = derivationStrict drvAttrs;
             |            ^
           38|

       … while evaluating the option `driverConfiguration.vlans':

       … while evaluating definitions from `/nix/store/6kx9hd4w6dvxsi401dp0jwnj8n5l9h7h-source/nixos/lib/testing/driver-configuration.nix':

       … while evaluating the option `containers.machine.networking.interfaces':

       … while evaluating definitions from `/nix/store/6kx9hd4w6dvxsi401dp0jwnj8n5l9h7h-source/nixos/modules/hardware/facter/networking':

       … while evaluating the option `containers.machine.hardware.facter.enable':

       … while evaluating the option `containers.machine.hardware.facter.report':

       … while evaluating the option `containers.machine.hardware.facter.reportPath':

       … while evaluating definitions from `/nix/store/74smld9y24m9yc7az735xzn555f6wni3-source/nixosModules/clanCore/nixos-facter.nix':

       (stack trace truncated; use '--show-trace' to show the full, detailed trace)

       error: opening a connection to remote store 'grpc://nix-store.geninf.io:50051' previously failed
failed eval checks.aarch64-linux.service-dummy-test —
error: … while evaluating the attribute 'drvPath' at «https://releases.nixos.org/nixpkgs/nixpkgs-26.11pre1079900.d54020a6ac32/nixexprs.tar.xz?na …
error:
       … while evaluating the attribute 'drvPath'
         at «https://releases.nixos.org/nixpkgs/nixpkgs-26.11pre1079900.d54020a6ac32/nixexprs.tar.xz?narHash=sha256-OjqPjipsKi79LA0IEgqlsRe2XlA4Q/6zsMKSwUfTi/8%3D»/lib/customisation.nix:416:11:
          415|         // {
          416|           drvPath =
             |           ^
          417|             assert condition;

       … while calling the 'derivationStrict' builtin
         at «nix-internal»/derivation-internal.nix:37:12:
           36|
           37|   strict = derivationStrict drvAttrs;
             |            ^
           38|

       … while evaluating the option `driverConfiguration.vlans':

       … while evaluating definitions from `/nix/store/6kx9hd4w6dvxsi401dp0jwnj8n5l9h7h-source/nixos/lib/testing/driver-configuration.nix':

       … while evaluating the option `containers.admin1.networking.interfaces':

       … while evaluating definitions from `/nix/store/6kx9hd4w6dvxsi401dp0jwnj8n5l9h7h-source/nixos/modules/hardware/facter/networking':

       … while evaluating the option `containers.admin1.hardware.facter.enable':

       … while evaluating the option `containers.admin1.hardware.facter.report':

       … while evaluating the option `containers.admin1.hardware.facter.reportPath':

       … while evaluating definitions from `/nix/store/74smld9y24m9yc7az735xzn555f6wni3-source/nixosModules/clanCore/nixos-facter.nix':

       (stack trace truncated; use '--show-trace' to show the full, detailed trace)

       error: opening a connection to remote store 'grpc://nix-store.geninf.io:50051' previously failed
failed eval checks.aarch64-linux.service-dummy-test-from-flake —
error: … while evaluating the attribute 'drvPath' at «https://releases.nixos.org/nixpkgs/nixpkgs-26.11pre1079900.d54020a6ac32/nixexprs.tar.xz?na …
error:
       … while evaluating the attribute 'drvPath'
         at «https://releases.nixos.org/nixpkgs/nixpkgs-26.11pre1079900.d54020a6ac32/nixexprs.tar.xz?narHash=sha256-OjqPjipsKi79LA0IEgqlsRe2XlA4Q/6zsMKSwUfTi/8%3D»/lib/customisation.nix:416:11:
          415|         // {
          416|           drvPath =
             |           ^
          417|             assert condition;

       … while calling the 'derivationStrict' builtin
         at «nix-internal»/derivation-internal.nix:37:12:
           36|
           37|   strict = derivationStrict drvAttrs;
             |            ^
           38|

       … while evaluating the option `driverConfiguration.vlans':

       … while evaluating definitions from `/nix/store/6kx9hd4w6dvxsi401dp0jwnj8n5l9h7h-source/nixos/lib/testing/driver-configuration.nix':

       … while evaluating the option `containers.admin1.networking.interfaces':

       … while evaluating definitions from `/nix/store/6kx9hd4w6dvxsi401dp0jwnj8n5l9h7h-source/nixos/modules/hardware/facter/networking':

       … while evaluating the option `containers.admin1.hardware.facter.enable':

       … while evaluating the option `containers.admin1.hardware.facter.report':

       … while evaluating the option `containers.admin1.hardware.facter.reportPath':

       … while evaluating definitions from `/nix/store/74smld9y24m9yc7az735xzn555f6wni3-source/nixosModules/clanCore/nixos-facter.nix':

       (stack trace truncated; use '--show-trace' to show the full, detailed trace)

       error: opening a connection to remote store 'grpc://nix-store.geninf.io:50051' previously failed
failed eval checks.aarch64-linux.sshd —
error: … while evaluating the attribute 'drvPath' at «https://releases.nixos.org/nixpkgs/nixpkgs-26.11pre1079900.d54020a6ac32/nixexprs.tar.xz?na …
error:
       … while evaluating the attribute 'drvPath'
         at «https://releases.nixos.org/nixpkgs/nixpkgs-26.11pre1079900.d54020a6ac32/nixexprs.tar.xz?narHash=sha256-OjqPjipsKi79LA0IEgqlsRe2XlA4Q/6zsMKSwUfTi/8%3D»/lib/customisation.nix:416:11:
          415|         // {
          416|           drvPath =
             |           ^
          417|             assert condition;

       … while calling the 'derivationStrict' builtin
         at «nix-internal»/derivation-internal.nix:37:12:
           36|
           37|   strict = derivationStrict drvAttrs;
             |            ^
           38|

       … while evaluating the option `driverConfiguration.vlans':

       … while evaluating definitions from `/nix/store/6kx9hd4w6dvxsi401dp0jwnj8n5l9h7h-source/nixos/lib/testing/driver-configuration.nix':

       … while evaluating the option `containers.client.networking.interfaces':

       … while evaluating definitions from `/nix/store/6kx9hd4w6dvxsi401dp0jwnj8n5l9h7h-source/nixos/modules/hardware/facter/networking':

       … while evaluating the option `containers.client.hardware.facter.enable':

       … while evaluating the option `containers.client.hardware.facter.report':

       … while evaluating the option `containers.client.hardware.facter.reportPath':

       … while evaluating definitions from `/nix/store/74smld9y24m9yc7az735xzn555f6wni3-source/nixosModules/clanCore/nixos-facter.nix':

       (stack trace truncated; use '--show-trace' to show the full, detailed trace)

       error: opening a connection to remote store 'grpc://nix-store.geninf.io:50051' previously failed
failed eval checks.aarch64-linux.sshd-no-ca —
error: … while evaluating the attribute 'drvPath' at «https://releases.nixos.org/nixpkgs/nixpkgs-26.11pre1079900.d54020a6ac32/nixexprs.tar.xz?na …
error:
       … while evaluating the attribute 'drvPath'
         at «https://releases.nixos.org/nixpkgs/nixpkgs-26.11pre1079900.d54020a6ac32/nixexprs.tar.xz?narHash=sha256-OjqPjipsKi79LA0IEgqlsRe2XlA4Q/6zsMKSwUfTi/8%3D»/lib/customisation.nix:416:11:
          415|         // {
          416|           drvPath =
             |           ^
          417|             assert condition;

       … while calling the 'derivationStrict' builtin
         at «nix-internal»/derivation-internal.nix:37:12:
           36|
           37|   strict = derivationStrict drvAttrs;
             |            ^
           38|

       … while evaluating the option `driverConfiguration.vlans':

       … while evaluating definitions from `/nix/store/6kx9hd4w6dvxsi401dp0jwnj8n5l9h7h-source/nixos/lib/testing/driver-configuration.nix':

       … while evaluating the option `containers.client.networking.interfaces':

       … while evaluating definitions from `/nix/store/6kx9hd4w6dvxsi401dp0jwnj8n5l9h7h-source/nixos/modules/hardware/facter/networking':

       … while evaluating the option `containers.client.hardware.facter.enable':

       … while evaluating the option `containers.client.hardware.facter.report':

       … while evaluating the option `containers.client.hardware.facter.reportPath':

       … while evaluating definitions from `/nix/store/74smld9y24m9yc7az735xzn555f6wni3-source/nixosModules/clanCore/nixos-facter.nix':

       (stack trace truncated; use '--show-trace' to show the full, detailed trace)

       error: cannot open connection to remote store 'grpc://nix-store.geninf.io:50051': error: Nix daemon disconnected unexpectedly (maybe it crashed?)
failed eval checks.aarch64-linux.state-version —
error: … while evaluating the attribute 'drvPath' at «https://releases.nixos.org/nixpkgs/nixpkgs-26.11pre1079900.d54020a6ac32/nixexprs.tar.xz?na …
error:
       … while evaluating the attribute 'drvPath'
         at «https://releases.nixos.org/nixpkgs/nixpkgs-26.11pre1079900.d54020a6ac32/nixexprs.tar.xz?narHash=sha256-OjqPjipsKi79LA0IEgqlsRe2XlA4Q/6zsMKSwUfTi/8%3D»/lib/customisation.nix:416:11:
          415|         // {
          416|           drvPath =
             |           ^
          417|             assert condition;

       … while calling the 'derivationStrict' builtin
         at «nix-internal»/derivation-internal.nix:37:12:
           36|
           37|   strict = derivationStrict drvAttrs;
             |            ^
           38|

       … while evaluating the option `driverConfiguration.vlans':

       … while evaluating definitions from `/nix/store/6kx9hd4w6dvxsi401dp0jwnj8n5l9h7h-source/nixos/lib/testing/driver-configuration.nix':

       … while evaluating the option `containers.server.networking.interfaces':

       … while evaluating definitions from `/nix/store/6kx9hd4w6dvxsi401dp0jwnj8n5l9h7h-source/nixos/modules/hardware/facter/networking':

       … while evaluating the option `containers.server.hardware.facter.enable':

       … while evaluating the option `containers.server.hardware.facter.report':

       … while evaluating the option `containers.server.hardware.facter.reportPath':

       … while evaluating definitions from `/nix/store/74smld9y24m9yc7az735xzn555f6wni3-source/nixosModules/clanCore/nixos-facter.nix':

       (stack trace truncated; use '--show-trace' to show the full, detailed trace)

       error: cannot open connection to remote store 'grpc://nix-store.geninf.io:50051': error: Nix daemon disconnected unexpectedly (maybe it crashed?)
failed eval checks.aarch64-linux.syncthing-service —
error: … while evaluating the attribute 'drvPath' at «https://releases.nixos.org/nixpkgs/nixpkgs-26.11pre1079900.d54020a6ac32/nixexprs.tar.xz?na …
error:
       … while evaluating the attribute 'drvPath'
         at «https://releases.nixos.org/nixpkgs/nixpkgs-26.11pre1079900.d54020a6ac32/nixexprs.tar.xz?narHash=sha256-OjqPjipsKi79LA0IEgqlsRe2XlA4Q/6zsMKSwUfTi/8%3D»/lib/customisation.nix:416:11:
          415|         // {
          416|           drvPath =
             |           ^
          417|             assert condition;

       … while calling the 'derivationStrict' builtin
         at «nix-internal»/derivation-internal.nix:37:12:
           36|
           37|   strict = derivationStrict drvAttrs;
             |            ^
           38|

       … while evaluating the option `driverConfiguration.vlans':

       … while evaluating definitions from `/nix/store/6kx9hd4w6dvxsi401dp0jwnj8n5l9h7h-source/nixos/lib/testing/driver-configuration.nix':

       … while evaluating the option `containers.machine1.networking.interfaces':

       … while evaluating definitions from `/nix/store/6kx9hd4w6dvxsi401dp0jwnj8n5l9h7h-source/nixos/modules/hardware/facter/networking':

       … while evaluating the option `containers.machine1.hardware.facter.enable':

       … while evaluating the option `containers.machine1.hardware.facter.report':

       … while evaluating the option `containers.machine1.hardware.facter.reportPath':

       … while evaluating definitions from `/nix/store/74smld9y24m9yc7az735xzn555f6wni3-source/nixosModules/clanCore/nixos-facter.nix':

       (stack trace truncated; use '--show-trace' to show the full, detailed trace)

       error: opening a connection to remote store 'grpc://nix-store.geninf.io:50051' previously failed
failed eval checks.aarch64-linux.trusted-nix-caches —
error: … while evaluating the attribute 'drvPath' at «https://releases.nixos.org/nixpkgs/nixpkgs-26.11pre1079900.d54020a6ac32/nixexprs.tar.xz?na …
error:
       … while evaluating the attribute 'drvPath'
         at «https://releases.nixos.org/nixpkgs/nixpkgs-26.11pre1079900.d54020a6ac32/nixexprs.tar.xz?narHash=sha256-OjqPjipsKi79LA0IEgqlsRe2XlA4Q/6zsMKSwUfTi/8%3D»/lib/customisation.nix:416:11:
          415|         // {
          416|           drvPath =
             |           ^
          417|             assert condition;

       … while calling the 'derivationStrict' builtin
         at «nix-internal»/derivation-internal.nix:37:12:
           36|
           37|   strict = derivationStrict drvAttrs;
             |            ^
           38|

       … while evaluating the option `driverConfiguration.vlans':

       … while evaluating definitions from `/nix/store/6kx9hd4w6dvxsi401dp0jwnj8n5l9h7h-source/nixos/lib/testing/driver-configuration.nix':

       … while evaluating the option `containers.server.networking.interfaces':

       … while evaluating definitions from `/nix/store/6kx9hd4w6dvxsi401dp0jwnj8n5l9h7h-source/nixos/modules/hardware/facter/networking':

       … while evaluating the option `containers.server.hardware.facter.enable':

       … while evaluating the option `containers.server.hardware.facter.report':

       … while evaluating the option `containers.server.hardware.facter.reportPath':

       … while evaluating definitions from `/nix/store/74smld9y24m9yc7az735xzn555f6wni3-source/nixosModules/clanCore/nixos-facter.nix':

       (stack trace truncated; use '--show-trace' to show the full, detailed trace)

       error: opening a connection to remote store 'grpc://nix-store.geninf.io:50051' previously failed
failed eval checks.aarch64-linux.users —
error: … while evaluating the attribute 'drvPath' at «https://releases.nixos.org/nixpkgs/nixpkgs-26.11pre1079900.d54020a6ac32/nixexprs.tar.xz?na …
error:
       … while evaluating the attribute 'drvPath'
         at «https://releases.nixos.org/nixpkgs/nixpkgs-26.11pre1079900.d54020a6ac32/nixexprs.tar.xz?narHash=sha256-OjqPjipsKi79LA0IEgqlsRe2XlA4Q/6zsMKSwUfTi/8%3D»/lib/customisation.nix:416:11:
          415|         // {
          416|           drvPath =
             |           ^
          417|             assert condition;

       … while calling the 'derivationStrict' builtin
         at «nix-internal»/derivation-internal.nix:37:12:
           36|
           37|   strict = derivationStrict drvAttrs;
             |            ^
           38|

       … while evaluating the option `driverConfiguration.vlans':

       … while evaluating definitions from `/nix/store/6kx9hd4w6dvxsi401dp0jwnj8n5l9h7h-source/nixos/lib/testing/driver-configuration.nix':

       … while evaluating the option `containers.server.networking.interfaces':

       … while evaluating definitions from `/nix/store/6kx9hd4w6dvxsi401dp0jwnj8n5l9h7h-source/nixos/modules/hardware/facter/networking':

       … while evaluating the option `containers.server.hardware.facter.enable':

       … while evaluating the option `containers.server.hardware.facter.report':

       … while evaluating the option `containers.server.hardware.facter.reportPath':

       … while evaluating definitions from `/nix/store/74smld9y24m9yc7az735xzn555f6wni3-source/nixosModules/clanCore/nixos-facter.nix':

       (stack trace truncated; use '--show-trace' to show the full, detailed trace)

       error: opening a connection to remote store 'grpc://nix-store.geninf.io:50051' previously failed
failed eval checks.aarch64-linux.wifi —
error: … while evaluating the attribute 'drvPath' at «https://releases.nixos.org/nixpkgs/nixpkgs-26.11pre1079900.d54020a6ac32/nixexprs.tar.xz?na …
error:
       … while evaluating the attribute 'drvPath'
         at «https://releases.nixos.org/nixpkgs/nixpkgs-26.11pre1079900.d54020a6ac32/nixexprs.tar.xz?narHash=sha256-OjqPjipsKi79LA0IEgqlsRe2XlA4Q/6zsMKSwUfTi/8%3D»/lib/customisation.nix:416:11:
          415|         // {
          416|           drvPath =
             |           ^
          417|             assert condition;

       … while calling the 'derivationStrict' builtin
         at «nix-internal»/derivation-internal.nix:37:12:
           36|
           37|   strict = derivationStrict drvAttrs;
             |            ^
           38|

       … while evaluating the option `driverConfiguration.vlans':

       … while evaluating definitions from `/nix/store/6kx9hd4w6dvxsi401dp0jwnj8n5l9h7h-source/nixos/lib/testing/driver-configuration.nix':

       … while evaluating the option `nodes.second.networking.interfaces':

       … while evaluating definitions from `/nix/store/6kx9hd4w6dvxsi401dp0jwnj8n5l9h7h-source/nixos/modules/hardware/facter/networking':

       … while evaluating the option `nodes.second.hardware.facter.enable':

       … while evaluating the option `nodes.second.hardware.facter.report':

       … while evaluating the option `nodes.second.hardware.facter.reportPath':

       … while evaluating definitions from `/nix/store/74smld9y24m9yc7az735xzn555f6wni3-source/nixosModules/clanCore/nixos-facter.nix':

       (stack trace truncated; use '--show-trace' to show the full, detailed trace)

       error: opening a connection to remote store 'grpc://nix-store.geninf.io:50051' previously failed
failed eval checks.aarch64-linux.wireguard —
error: … while evaluating the attribute 'drvPath' at «https://releases.nixos.org/nixpkgs/nixpkgs-26.11pre1079900.d54020a6ac32/nixexprs.tar.xz?na …
error:
       … while evaluating the attribute 'drvPath'
         at «https://releases.nixos.org/nixpkgs/nixpkgs-26.11pre1079900.d54020a6ac32/nixexprs.tar.xz?narHash=sha256-OjqPjipsKi79LA0IEgqlsRe2XlA4Q/6zsMKSwUfTi/8%3D»/lib/customisation.nix:416:11:
          415|         // {
          416|           drvPath =
             |           ^
          417|             assert condition;

       … while calling the 'derivationStrict' builtin
         at «nix-internal»/derivation-internal.nix:37:12:
           36|
           37|   strict = derivationStrict drvAttrs;
             |            ^
           38|

       … while evaluating the option `driverConfiguration.vlans':

       … while evaluating definitions from `/nix/store/6kx9hd4w6dvxsi401dp0jwnj8n5l9h7h-source/nixos/lib/testing/driver-configuration.nix':

       … while evaluating the option `containers.ctrl1.networking.interfaces':

       … while evaluating definitions from `/nix/store/6kx9hd4w6dvxsi401dp0jwnj8n5l9h7h-source/nixos/modules/hardware/facter/networking':

       … while evaluating the option `containers.ctrl1.hardware.facter.enable':

       … while evaluating the option `containers.ctrl1.hardware.facter.report':

       … while evaluating the option `containers.ctrl1.hardware.facter.reportPath':

       … while evaluating definitions from `/nix/store/74smld9y24m9yc7az735xzn555f6wni3-source/nixosModules/clanCore/nixos-facter.nix':

       (stack trace truncated; use '--show-trace' to show the full, detailed trace)

       error: opening a connection to remote store 'grpc://nix-store.geninf.io:50051' previously failed
failed eval checks.aarch64-linux.yggdrasil —
error: … while evaluating the attribute 'drvPath' at «https://releases.nixos.org/nixpkgs/nixpkgs-26.11pre1079900.d54020a6ac32/nixexprs.tar.xz?na …
error:
       … while evaluating the attribute 'drvPath'
         at «https://releases.nixos.org/nixpkgs/nixpkgs-26.11pre1079900.d54020a6ac32/nixexprs.tar.xz?narHash=sha256-OjqPjipsKi79LA0IEgqlsRe2XlA4Q/6zsMKSwUfTi/8%3D»/lib/customisation.nix:416:11:
          415|         // {
          416|           drvPath =
             |           ^
          417|             assert condition;

       … while calling the 'derivationStrict' builtin
         at «nix-internal»/derivation-internal.nix:37:12:
           36|
           37|   strict = derivationStrict drvAttrs;
             |            ^
           38|

       … while evaluating the option `driverConfiguration.vlans':

       … while evaluating definitions from `/nix/store/6kx9hd4w6dvxsi401dp0jwnj8n5l9h7h-source/nixos/lib/testing/driver-configuration.nix':

       … while evaluating the option `nodes.outsider.networking.interfaces':

       … while evaluating definitions from `/nix/store/6kx9hd4w6dvxsi401dp0jwnj8n5l9h7h-source/nixos/modules/hardware/facter/networking':

       … while evaluating the option `nodes.outsider.hardware.facter.enable':

       … while evaluating the option `nodes.outsider.hardware.facter.report':

       … while evaluating the option `nodes.outsider.hardware.facter.reportPath':

       … while evaluating definitions from `/nix/store/74smld9y24m9yc7az735xzn555f6wni3-source/nixosModules/clanCore/nixos-facter.nix':

       (stack trace truncated; use '--show-trace' to show the full, detailed trace)

       error: opening a connection to remote store 'grpc://nix-store.geninf.io:50051' previously failed
failed eval checks.aarch64-linux.zerotier —
error: … while evaluating the attribute 'drvPath' at «https://releases.nixos.org/nixpkgs/nixpkgs-26.11pre1079900.d54020a6ac32/nixexprs.tar.xz?na …
error:
       … while evaluating the attribute 'drvPath'
         at «https://releases.nixos.org/nixpkgs/nixpkgs-26.11pre1079900.d54020a6ac32/nixexprs.tar.xz?narHash=sha256-OjqPjipsKi79LA0IEgqlsRe2XlA4Q/6zsMKSwUfTi/8%3D»/lib/customisation.nix:416:11:
          415|         // {
          416|           drvPath =
             |           ^
          417|             assert condition;

       … while calling the 'derivationStrict' builtin
         at «nix-internal»/derivation-internal.nix:37:12:
           36|
           37|   strict = derivationStrict drvAttrs;
             |            ^
           38|

       … while evaluating the option `driverConfiguration.vlans':

       … while evaluating definitions from `/nix/store/6kx9hd4w6dvxsi401dp0jwnj8n5l9h7h-source/nixos/lib/testing/driver-configuration.nix':

       … while evaluating the option `nodes.controller.networking.interfaces':

       … while evaluating definitions from `/nix/store/6kx9hd4w6dvxsi401dp0jwnj8n5l9h7h-source/nixos/modules/hardware/facter/networking':

       … while evaluating the option `nodes.controller.hardware.facter.enable':

       … while evaluating the option `nodes.controller.hardware.facter.report':

       … while evaluating the option `nodes.controller.hardware.facter.reportPath':

       … while evaluating definitions from `/nix/store/74smld9y24m9yc7az735xzn555f6wni3-source/nixosModules/clanCore/nixos-facter.nix':

       (stack trace truncated; use '--show-trace' to show the full, detailed trace)

       error: opening a connection to remote store 'grpc://nix-store.geninf.io:50051' previously failed
failed eval checks.aarch64-linux.zerotier-multi-instance —
error: … while evaluating the attribute 'drvPath' at «https://releases.nixos.org/nixpkgs/nixpkgs-26.11pre1079900.d54020a6ac32/nixexprs.tar.xz?na …
error:
       … while evaluating the attribute 'drvPath'
         at «https://releases.nixos.org/nixpkgs/nixpkgs-26.11pre1079900.d54020a6ac32/nixexprs.tar.xz?narHash=sha256-OjqPjipsKi79LA0IEgqlsRe2XlA4Q/6zsMKSwUfTi/8%3D»/lib/customisation.nix:416:11:
          415|         // {
          416|           drvPath =
             |           ^
          417|             assert condition;

       … while calling the 'derivationStrict' builtin
         at «nix-internal»/derivation-internal.nix:37:12:
           36|
           37|   strict = derivationStrict drvAttrs;
             |            ^
           38|

       … while evaluating the option `driverConfiguration.vlans':

       … while evaluating definitions from `/nix/store/6kx9hd4w6dvxsi401dp0jwnj8n5l9h7h-source/nixos/lib/testing/driver-configuration.nix':

       … while evaluating the option `nodes.alpha.networking.interfaces':

       … while evaluating definitions from `/nix/store/6kx9hd4w6dvxsi401dp0jwnj8n5l9h7h-source/nixos/modules/hardware/facter/networking':

       … while evaluating the option `nodes.alpha.hardware.facter.enable':

       … while evaluating the option `nodes.alpha.hardware.facter.report':

       … while evaluating the option `nodes.alpha.hardware.facter.reportPath':

       … while evaluating definitions from `/nix/store/74smld9y24m9yc7az735xzn555f6wni3-source/nixosModules/clanCore/nixos-facter.nix':

       (stack trace truncated; use '--show-trace' to show the full, detailed trace)

       error: opening a connection to remote store 'grpc://nix-store.geninf.io:50051' previously failed
failed eval checks.x86_64-linux.admin —
error: … while evaluating the attribute 'drvPath' at «https://releases.nixos.org/nixpkgs/nixpkgs-26.11pre1079900.d54020a6ac32/nixexprs.tar.xz?na …
error:
       … while evaluating the attribute 'drvPath'
         at «https://releases.nixos.org/nixpkgs/nixpkgs-26.11pre1079900.d54020a6ac32/nixexprs.tar.xz?narHash=sha256-OjqPjipsKi79LA0IEgqlsRe2XlA4Q/6zsMKSwUfTi/8%3D»/lib/customisation.nix:416:11:
          415|         // {
          416|           drvPath =
             |           ^
          417|             assert condition;

       … while calling the 'derivationStrict' builtin
         at «nix-internal»/derivation-internal.nix:37:12:
           36|
           37|   strict = derivationStrict drvAttrs;
             |            ^
           38|

       … while evaluating the option `driverConfiguration.vlans':

       … while evaluating definitions from `/nix/store/6kx9hd4w6dvxsi401dp0jwnj8n5l9h7h-source/nixos/lib/testing/driver-configuration.nix':

       … while evaluating the option `containers.client.networking.interfaces':

       … while evaluating definitions from `/nix/store/6kx9hd4w6dvxsi401dp0jwnj8n5l9h7h-source/nixos/modules/hardware/facter/networking':

       … while evaluating the option `containers.client.hardware.facter.enable':

       … while evaluating the option `containers.client.hardware.facter.report':

       … while evaluating the option `containers.client.hardware.facter.reportPath':

       … while evaluating definitions from `/nix/store/74smld9y24m9yc7az735xzn555f6wni3-source/nixosModules/clanCore/nixos-facter.nix':

       (stack trace truncated; use '--show-trace' to show the full, detailed trace)

       error: opening a connection to remote store 'grpc://nix-store.geninf.io:50051' previously failed
failed eval checks.x86_64-linux.borgbackup —
error: … while evaluating the attribute 'drvPath' at «https://releases.nixos.org/nixpkgs/nixpkgs-26.11pre1079900.d54020a6ac32/nixexprs.tar.xz?na …
error:
       … while evaluating the attribute 'drvPath'
         at «https://releases.nixos.org/nixpkgs/nixpkgs-26.11pre1079900.d54020a6ac32/nixexprs.tar.xz?narHash=sha256-OjqPjipsKi79LA0IEgqlsRe2XlA4Q/6zsMKSwUfTi/8%3D»/lib/customisation.nix:416:11:
          415|         // {
          416|           drvPath =
             |           ^
          417|             assert condition;

       … while calling the 'derivationStrict' builtin
         at «nix-internal»/derivation-internal.nix:37:12:
           36|
           37|   strict = derivationStrict drvAttrs;
             |            ^
           38|

       … while evaluating the option `driverConfiguration.vlans':

       … while evaluating definitions from `/nix/store/6kx9hd4w6dvxsi401dp0jwnj8n5l9h7h-source/nixos/lib/testing/driver-configuration.nix':

       … while evaluating the option `containers.clientone.networking.interfaces':

       … while evaluating definitions from `/nix/store/6kx9hd4w6dvxsi401dp0jwnj8n5l9h7h-source/nixos/modules/hardware/facter/networking':

       … while evaluating the option `containers.clientone.hardware.facter.enable':

       … while evaluating the option `containers.clientone.hardware.facter.report':

       … while evaluating the option `containers.clientone.hardware.facter.reportPath':

       … while evaluating definitions from `/nix/store/74smld9y24m9yc7az735xzn555f6wni3-source/nixosModules/clanCore/nixos-facter.nix':

       (stack trace truncated; use '--show-trace' to show the full, detailed trace)

       error: opening a connection to remote store 'grpc://nix-store.geninf.io:50051' previously failed
failed eval checks.x86_64-linux.certificates —
error: … while evaluating the attribute 'drvPath' at «https://releases.nixos.org/nixpkgs/nixpkgs-26.11pre1079900.d54020a6ac32/nixexprs.tar.xz?na …
error:
       … while evaluating the attribute 'drvPath'
         at «https://releases.nixos.org/nixpkgs/nixpkgs-26.11pre1079900.d54020a6ac32/nixexprs.tar.xz?narHash=sha256-OjqPjipsKi79LA0IEgqlsRe2XlA4Q/6zsMKSwUfTi/8%3D»/lib/customisation.nix:416:11:
          415|         // {
          416|           drvPath =
             |           ^
          417|             assert condition;

       … while calling the 'derivationStrict' builtin
         at «nix-internal»/derivation-internal.nix:37:12:
           36|
           37|   strict = derivationStrict drvAttrs;
             |            ^
           38|

       … while evaluating the option `driverConfiguration.vlans':

       … while evaluating definitions from `/nix/store/6kx9hd4w6dvxsi401dp0jwnj8n5l9h7h-source/nixos/lib/testing/driver-configuration.nix':

       … while evaluating the option `containers.ca.networking.interfaces':

       … while evaluating definitions from `/nix/store/6kx9hd4w6dvxsi401dp0jwnj8n5l9h7h-source/nixos/modules/hardware/facter/networking':

       … while evaluating the option `containers.ca.hardware.facter.enable':

       … while evaluating the option `containers.ca.hardware.facter.report':

       … while evaluating the option `containers.ca.hardware.facter.reportPath':

       … while evaluating definitions from `/nix/store/74smld9y24m9yc7az735xzn555f6wni3-source/nixosModules/clanCore/nixos-facter.nix':

       (stack trace truncated; use '--show-trace' to show the full, detailed trace)

       error: opening a connection to remote store 'grpc://nix-store.geninf.io:50051' previously failed
failed checks.x86_64-linux.clan-pytest-with-core 3h 0m
setup: /nix/store/55w1wmglzz40qrma8scg6dzn2f6gc2fj-zlib-1.3.2 /nix/store/96r2n039x32s0qmcgabx19l7m7c0aq6j-zlib-1.3.2 /nix/store/6vdilqj08xqi91w72bvhxpxpmc …
setup:
  /nix/store/55w1wmglzz40qrma8scg6dzn2f6gc2fj-zlib-1.3.2
  /nix/store/96r2n039x32s0qmcgabx19l7m7c0aq6j-zlib-1.3.2
  /nix/store/6vdilqj08xqi91w72bvhxpxpmck591mh-zlib-1.3.2-dev
  /nix/store/qn3f3m8xmnwnsnbkldlmicgx6cmxls0y-zlib-1.3.2-static
  /nix/store/13vkic2v8zac4m6p38asdhasb3xylv07-zlib-1.3.2.tar.gz
  /nix/store/18agc3vzx1yqx1hz807wa4iflsy02ifw-zlib-1.3.2.tar.xz
warning: ignoring the client-specified setting 'store', because it is a restricted setting and you are not a trusted user
yx4j6iv9mfcblbpmli81aljrzr9f6yqx-clan-runtime.drv: gi-build-x86-02: not scheduled here: yx4j6iv9mfcblbpmli81aljrzr9f6yqx-clan-runtime.drv, asking the scheduler again
failed checks.x86_64-linux.clan-pytest-without-core 3h 0m
setup: don't know how to build these paths: /nix/store/9gn3abmh0cbnqswcj8zw2cbzn8angddk-clan-pytest-without-core.drv warning: ignoring the client-specified se …
setup:
don't know how to build these paths:
  /nix/store/9gn3abmh0cbnqswcj8zw2cbzn8angddk-clan-pytest-without-core.drv
warning: ignoring the client-specified setting 'store', because it is a restricted setting and you are not a trusted user
yx4j6iv9mfcblbpmli81aljrzr9f6yqx-clan-runtime.drv: gi-build-x86-02: not scheduled here: yx4j6iv9mfcblbpmli81aljrzr9f6yqx-clan-runtime.drv, asking the scheduler again
failed checks.x86_64-linux.clan-site-lint 3h 0m
setup: don't know how to build these paths: /nix/store/b4vir0p912p5290cz09vnjhd8v3wjyfy-clan-site-lint.drv warning: ignoring the client-specified setting 'sto …
setup:
don't know how to build these paths:
  /nix/store/b4vir0p912p5290cz09vnjhd8v3wjyfy-clan-site-lint.drv
warning: ignoring the client-specified setting 'store', because it is a restricted setting and you are not a trusted user
yx4j6iv9mfcblbpmli81aljrzr9f6yqx-clan-runtime.drv: gi-build-x86-02: not scheduled here: yx4j6iv9mfcblbpmli81aljrzr9f6yqx-clan-runtime.drv, asking the scheduler again
failed checks.x86_64-linux.clan-test-iso 3h 0m
setup: /nix/store/iq0n8d6al9akdfgc51mn2wj5mpmrqcj4-zopfli-0.4.0.tar.gz /nix/store/7hh71rn97ykqdg9lc4ypwa06ky1kdcdc-zopfli-1.0.3 /nix/store/dihkrr77yna61vy …
setup:
  /nix/store/iq0n8d6al9akdfgc51mn2wj5mpmrqcj4-zopfli-0.4.0.tar.gz
  /nix/store/7hh71rn97ykqdg9lc4ypwa06ky1kdcdc-zopfli-1.0.3
  /nix/store/dihkrr77yna61vy3xi3cqmdq4683vq86-zopfli-1.0.3-dev
  /nix/store/q3g52xr3i4d82c7v0insim8l245s4ycf-zopfli-1.0.3-lib
  /nix/store/vm34i9vrkmlbcianscikvdcid2d268gb-zopfli-1.0.3-src
warning: ignoring the client-specified setting 'store', because it is a restricted setting and you are not a trusted user
jzljwhkq80yvrbvf6f0pvi8xncsw40qs-etc-nix-registry.json.drv: gi-build-x86-02: not scheduled here: jzljwhkq80yvrbvf6f0pvi8xncsw40qs-etc-nix-registry.json.drv, asking the scheduler again
zv90g44sksf4a6rwxrc77qf3pnmh8nyx-closure-info.drv: build-x86-01: not scheduled here: zv90g44sksf4a6rwxrc77qf3pnmh8nyx-closure-info.drv, asking the scheduler again
failed eval checks.x86_64-linux.clan-test-update —
error: … while evaluating the attribute 'drvPath' at «https://releases.nixos.org/nixpkgs/nixpkgs-26.11pre1079900.d54020a6ac32/nixexprs.tar.xz?na …
error:
       … while evaluating the attribute 'drvPath'
         at «https://releases.nixos.org/nixpkgs/nixpkgs-26.11pre1079900.d54020a6ac32/nixexprs.tar.xz?narHash=sha256-OjqPjipsKi79LA0IEgqlsRe2XlA4Q/6zsMKSwUfTi/8%3D»/lib/customisation.nix:416:11:
          415|         // {
          416|           drvPath =
             |           ^
          417|             assert condition;

       … while calling the 'derivationStrict' builtin
         at «nix-internal»/derivation-internal.nix:37:12:
           36|
           37|   strict = derivationStrict drvAttrs;
             |            ^
           38|

       … while evaluating the option `driverConfiguration.vlans':

       … while evaluating definitions from `/nix/store/6kx9hd4w6dvxsi401dp0jwnj8n5l9h7h-source/nixos/lib/testing/driver-configuration.nix':

       … while evaluating the option `nodes.machine.networking.interfaces':

       … while evaluating definitions from `/nix/store/6kx9hd4w6dvxsi401dp0jwnj8n5l9h7h-source/nixos/modules/hardware/facter/networking':

       … while evaluating the option `nodes.machine.hardware.facter.enable':

       … while evaluating the option `nodes.machine.hardware.facter.report':

       … while evaluating the option `nodes.machine.hardware.facter.reportPath':

       … while evaluating definitions from `/nix/store/74smld9y24m9yc7az735xzn555f6wni3-source/nixosModules/clanCore/nixos-facter.nix':

       (stack trace truncated; use '--show-trace' to show the full, detailed trace)

       error: opening a connection to remote store 'grpc://nix-store.geninf.io:50051' previously failed
failed checks.x86_64-linux.darwin-test-darwin-machine 3h 0m
setup: don't know how to build these paths: /nix/store/y3ypx4j68qfkvibd94450xqz0iviayyj-darwin-system-26.11.4cff07d.drv warning: ignoring the client-specified …
setup:
don't know how to build these paths:
  /nix/store/y3ypx4j68qfkvibd94450xqz0iviayyj-darwin-system-26.11.4cff07d.drv
warning: ignoring the client-specified setting 'store', because it is a restricted setting and you are not a trusted user
failed eval checks.x86_64-linux.data-mesher —
error: … while evaluating the attribute 'drvPath' at «https://releases.nixos.org/nixpkgs/nixpkgs-26.11pre1079900.d54020a6ac32/nixexprs.tar.xz?na …
error:
       … while evaluating the attribute 'drvPath'
         at «https://releases.nixos.org/nixpkgs/nixpkgs-26.11pre1079900.d54020a6ac32/nixexprs.tar.xz?narHash=sha256-OjqPjipsKi79LA0IEgqlsRe2XlA4Q/6zsMKSwUfTi/8%3D»/lib/customisation.nix:416:11:
          415|         // {
          416|           drvPath =
             |           ^
          417|             assert condition;

       … while calling the 'derivationStrict' builtin
         at «nix-internal»/derivation-internal.nix:37:12:
           36|
           37|   strict = derivationStrict drvAttrs;
             |            ^
           38|

       … while evaluating the option `driverConfiguration.vlans':

       … while evaluating definitions from `/nix/store/6kx9hd4w6dvxsi401dp0jwnj8n5l9h7h-source/nixos/lib/testing/driver-configuration.nix':

       … while evaluating the option `containers.alpha.networking.interfaces':

       … while evaluating definitions from `/nix/store/6kx9hd4w6dvxsi401dp0jwnj8n5l9h7h-source/nixos/modules/hardware/facter/networking':

       … while evaluating the option `containers.alpha.hardware.facter.enable':

       … while evaluating the option `containers.alpha.hardware.facter.report':

       … while evaluating the option `containers.alpha.hardware.facter.reportPath':

       … while evaluating definitions from `/nix/store/74smld9y24m9yc7az735xzn555f6wni3-source/nixosModules/clanCore/nixos-facter.nix':

       (stack trace truncated; use '--show-trace' to show the full, detailed trace)

       error: opening a connection to remote store 'grpc://nix-store.geninf.io:50051' previously failed
dependency failed checks.x86_64-linux.devshell —
failed checks.x86_64-linux.devShell-clan-cli 3h 0m
setup: don't know how to build these paths: /nix/store/rr0g4mw49wkvlkhvijpssnfyyw7a8qhq-clan-cli.drv warning: ignoring the client-specified setting 'store', b …
setup:
don't know how to build these paths:
  /nix/store/rr0g4mw49wkvlkhvijpssnfyyw7a8qhq-clan-cli.drv
warning: ignoring the client-specified setting 'store', because it is a restricted setting and you are not a trusted user
yx4j6iv9mfcblbpmli81aljrzr9f6yqx-clan-runtime.drv: gi-build-x86-02: not scheduled here: yx4j6iv9mfcblbpmli81aljrzr9f6yqx-clan-runtime.drv, asking the scheduler again
failed checks.x86_64-linux.devShell-clan-site 3h 0m
setup: don't know how to build these paths: /nix/store/mjsmypms1ql8mpy4gra8xzdi90kkgs2h-nix-shell.drv warning: ignoring the client-specified setting 'store', …
setup:
don't know how to build these paths:
  /nix/store/mjsmypms1ql8mpy4gra8xzdi90kkgs2h-nix-shell.drv
warning: ignoring the client-specified setting 'store', because it is a restricted setting and you are not a trusted user
yx4j6iv9mfcblbpmli81aljrzr9f6yqx-clan-runtime.drv: gi-build-x86-02: not scheduled here: yx4j6iv9mfcblbpmli81aljrzr9f6yqx-clan-runtime.drv, asking the scheduler again
failed checks.x86_64-linux.devShell-default 3h 0m
setup: don't know how to build these paths: /nix/store/mmc2vxrf9fdvxrigwcnj0pipra41kq89-clan.drv warning: ignoring the client-specified setting 'store', becau …
setup:
don't know how to build these paths:
  /nix/store/mmc2vxrf9fdvxrigwcnj0pipra41kq89-clan.drv
warning: ignoring the client-specified setting 'store', because it is a restricted setting and you are not a trusted user
yx4j6iv9mfcblbpmli81aljrzr9f6yqx-clan-runtime.drv: gi-build-x86-02: not scheduled here: yx4j6iv9mfcblbpmli81aljrzr9f6yqx-clan-runtime.drv, asking the scheduler again
failed checks.x86_64-linux.devShell-docs 3h 0m
setup: don't know how to build these paths: /nix/store/s9aflgcqdzlacrz2cl5b88plh70vf2gn-nix-shell.drv warning: ignoring the client-specified setting 'store', …
setup:
don't know how to build these paths:
  /nix/store/s9aflgcqdzlacrz2cl5b88plh70vf2gn-nix-shell.drv
warning: ignoring the client-specified setting 'store', because it is a restricted setting and you are not a trusted user
yx4j6iv9mfcblbpmli81aljrzr9f6yqx-clan-runtime.drv: gi-build-x86-02: not scheduled here: yx4j6iv9mfcblbpmli81aljrzr9f6yqx-clan-runtime.drv, asking the scheduler again
failed checks.x86_64-linux.devShell-inventory-schema 3h 0m
setup: don't know how to build these paths: /nix/store/3rjq6sabsj6ky480q8l4gnm133prfmwc-clan-inventory-schema.drv warning: ignoring the client-specified setti …
setup:
don't know how to build these paths:
  /nix/store/3rjq6sabsj6ky480q8l4gnm133prfmwc-clan-inventory-schema.drv
warning: ignoring the client-specified setting 'store', because it is a restricted setting and you are not a trusted user
yx4j6iv9mfcblbpmli81aljrzr9f6yqx-clan-runtime.drv: gi-build-x86-02: not scheduled here: yx4j6iv9mfcblbpmli81aljrzr9f6yqx-clan-runtime.drv, asking the scheduler again
failed eval checks.x86_64-linux.dm-dns —
error: … while evaluating the attribute 'drvPath' at «https://releases.nixos.org/nixpkgs/nixpkgs-26.11pre1079900.d54020a6ac32/nixexprs.tar.xz?na …
error:
       … while evaluating the attribute 'drvPath'
         at «https://releases.nixos.org/nixpkgs/nixpkgs-26.11pre1079900.d54020a6ac32/nixexprs.tar.xz?narHash=sha256-OjqPjipsKi79LA0IEgqlsRe2XlA4Q/6zsMKSwUfTi/8%3D»/lib/customisation.nix:416:11:
          415|         // {
          416|           drvPath =
             |           ^
          417|             assert condition;

       … while calling the 'derivationStrict' builtin
         at «nix-internal»/derivation-internal.nix:37:12:
           36|
           37|   strict = derivationStrict drvAttrs;
             |            ^
           38|

       … while evaluating the option `driverConfiguration.vlans':

       … while evaluating definitions from `/nix/store/6kx9hd4w6dvxsi401dp0jwnj8n5l9h7h-source/nixos/lib/testing/driver-configuration.nix':

       … while evaluating the option `containers.client.networking.interfaces':

       … while evaluating definitions from `/nix/store/6kx9hd4w6dvxsi401dp0jwnj8n5l9h7h-source/nixos/modules/hardware/facter/networking':

       … while evaluating the option `containers.client.hardware.facter.enable':

       … while evaluating the option `containers.client.hardware.facter.report':

       … while evaluating the option `containers.client.hardware.facter.reportPath':

       … while evaluating definitions from `/nix/store/74smld9y24m9yc7az735xzn555f6wni3-source/nixosModules/clanCore/nixos-facter.nix':

       (stack trace truncated; use '--show-trace' to show the full, detailed trace)

       error: opening a connection to remote store 'grpc://nix-store.geninf.io:50051' previously failed
failed eval checks.x86_64-linux.dyndns —
error: … while evaluating the attribute 'drvPath' at «https://releases.nixos.org/nixpkgs/nixpkgs-26.11pre1079900.d54020a6ac32/nixexprs.tar.xz?na …
error:
       … while evaluating the attribute 'drvPath'
         at «https://releases.nixos.org/nixpkgs/nixpkgs-26.11pre1079900.d54020a6ac32/nixexprs.tar.xz?narHash=sha256-OjqPjipsKi79LA0IEgqlsRe2XlA4Q/6zsMKSwUfTi/8%3D»/lib/customisation.nix:416:11:
          415|         // {
          416|           drvPath =
             |           ^
          417|             assert condition;

       … while calling the 'derivationStrict' builtin
         at «nix-internal»/derivation-internal.nix:37:12:
           36|
           37|   strict = derivationStrict drvAttrs;
             |            ^
           38|

       … while evaluating the option `driverConfiguration.vlans':

       … while evaluating definitions from `/nix/store/6kx9hd4w6dvxsi401dp0jwnj8n5l9h7h-source/nixos/lib/testing/driver-configuration.nix':

       … while evaluating the option `containers.server.networking.interfaces':

       … while evaluating definitions from `/nix/store/6kx9hd4w6dvxsi401dp0jwnj8n5l9h7h-source/nixos/modules/hardware/facter/networking':

       … while evaluating the option `containers.server.hardware.facter.enable':

       … while evaluating the option `containers.server.hardware.facter.report':

       … while evaluating the option `containers.server.hardware.facter.reportPath':

       … while evaluating definitions from `/nix/store/74smld9y24m9yc7az735xzn555f6wni3-source/nixosModules/clanCore/nixos-facter.nix':

       (stack trace truncated; use '--show-trace' to show the full, detailed trace)

       error: opening a connection to remote store 'grpc://nix-store.geninf.io:50051' previously failed
failed checks.x86_64-linux.eval-tests 3h 0m
setup: don't know how to build these paths: /nix/store/qar9apdsgjdpgpizz7mldj76718xzc9l-eval-tests-x86_64-linux.drv warning: ignoring the client-specified set …
setup:
don't know how to build these paths:
  /nix/store/qar9apdsgjdpgpizz7mldj76718xzc9l-eval-tests-x86_64-linux.drv
warning: ignoring the client-specified setting 'store', because it is a restricted setting and you are not a trusted user
failed eval checks.x86_64-linux.garage —
error: … while evaluating the attribute 'drvPath' at «https://releases.nixos.org/nixpkgs/nixpkgs-26.11pre1079900.d54020a6ac32/nixexprs.tar.xz?na …
error:
       … while evaluating the attribute 'drvPath'
         at «https://releases.nixos.org/nixpkgs/nixpkgs-26.11pre1079900.d54020a6ac32/nixexprs.tar.xz?narHash=sha256-OjqPjipsKi79LA0IEgqlsRe2XlA4Q/6zsMKSwUfTi/8%3D»/lib/customisation.nix:416:11:
          415|         // {
          416|           drvPath =
             |           ^
          417|             assert condition;

       … while calling the 'derivationStrict' builtin
         at «nix-internal»/derivation-internal.nix:37:12:
           36|
           37|   strict = derivationStrict drvAttrs;
             |            ^
           38|

       … while evaluating the option `driverConfiguration.vlans':

       … while evaluating definitions from `/nix/store/6kx9hd4w6dvxsi401dp0jwnj8n5l9h7h-source/nixos/lib/testing/driver-configuration.nix':

       … while evaluating the option `containers.server.networking.interfaces':

       … while evaluating definitions from `/nix/store/6kx9hd4w6dvxsi401dp0jwnj8n5l9h7h-source/nixos/modules/hardware/facter/networking':

       … while evaluating the option `containers.server.hardware.facter.enable':

       … while evaluating the option `containers.server.hardware.facter.report':

       … while evaluating the option `containers.server.hardware.facter.reportPath':

       … while evaluating definitions from `/nix/store/74smld9y24m9yc7az735xzn555f6wni3-source/nixosModules/clanCore/nixos-facter.nix':

       (stack trace truncated; use '--show-trace' to show the full, detailed trace)

       error: cannot open connection to remote store 'grpc://nix-store.geninf.io:50051': error: Nix daemon disconnected unexpectedly (maybe it crashed?)
failed eval checks.x86_64-linux.hello-service —
error: … while evaluating the attribute 'drvPath' at «https://releases.nixos.org/nixpkgs/nixpkgs-26.11pre1079900.d54020a6ac32/nixexprs.tar.xz?na …
error:
       … while evaluating the attribute 'drvPath'
         at «https://releases.nixos.org/nixpkgs/nixpkgs-26.11pre1079900.d54020a6ac32/nixexprs.tar.xz?narHash=sha256-OjqPjipsKi79LA0IEgqlsRe2XlA4Q/6zsMKSwUfTi/8%3D»/lib/customisation.nix:416:11:
          415|         // {
          416|           drvPath =
             |           ^
          417|             assert condition;

       … while calling the 'derivationStrict' builtin
         at «nix-internal»/derivation-internal.nix:37:12:
           36|
           37|   strict = derivationStrict drvAttrs;
             |            ^
           38|

       … while evaluating the option `driverConfiguration.vlans':

       … while evaluating definitions from `/nix/store/6kx9hd4w6dvxsi401dp0jwnj8n5l9h7h-source/nixos/lib/testing/driver-configuration.nix':

       … while evaluating the option `containers.peer1.networking.interfaces':

       … while evaluating definitions from `/nix/store/6kx9hd4w6dvxsi401dp0jwnj8n5l9h7h-source/nixos/modules/hardware/facter/networking':

       … while evaluating the option `containers.peer1.hardware.facter.enable':

       … while evaluating the option `containers.peer1.hardware.facter.report':

       … while evaluating the option `containers.peer1.hardware.facter.reportPath':

       … while evaluating definitions from `/nix/store/74smld9y24m9yc7az735xzn555f6wni3-source/nixosModules/clanCore/nixos-facter.nix':

       (stack trace truncated; use '--show-trace' to show the full, detailed trace)

       error: opening a connection to remote store 'grpc://nix-store.geninf.io:50051' previously failed
failed eval checks.x86_64-linux.kde —
error: … while evaluating the attribute 'drvPath' at «https://releases.nixos.org/nixpkgs/nixpkgs-26.11pre1079900.d54020a6ac32/nixexprs.tar.xz?na …
error:
       … while evaluating the attribute 'drvPath'
         at «https://releases.nixos.org/nixpkgs/nixpkgs-26.11pre1079900.d54020a6ac32/nixexprs.tar.xz?narHash=sha256-OjqPjipsKi79LA0IEgqlsRe2XlA4Q/6zsMKSwUfTi/8%3D»/lib/customisation.nix:416:11:
          415|         // {
          416|           drvPath =
             |           ^
          417|             assert condition;

       … while calling the 'derivationStrict' builtin
         at «nix-internal»/derivation-internal.nix:37:12:
           36|
           37|   strict = derivationStrict drvAttrs;
             |            ^
           38|

       … while evaluating the option `driverConfiguration.vlans':

       … while evaluating definitions from `/nix/store/6kx9hd4w6dvxsi401dp0jwnj8n5l9h7h-source/nixos/lib/testing/driver-configuration.nix':

       … while evaluating the option `containers.client.networking.interfaces':

       … while evaluating definitions from `/nix/store/6kx9hd4w6dvxsi401dp0jwnj8n5l9h7h-source/nixos/modules/hardware/facter/networking':

       … while evaluating the option `containers.client.hardware.facter.enable':

       … while evaluating the option `containers.client.hardware.facter.report':

       … while evaluating the option `containers.client.hardware.facter.reportPath':

       … while evaluating definitions from `/nix/store/74smld9y24m9yc7az735xzn555f6wni3-source/nixosModules/clanCore/nixos-facter.nix':

       (stack trace truncated; use '--show-trace' to show the full, detailed trace)

       error: opening a connection to remote store 'grpc://nix-store.geninf.io:50051' previously failed
failed eval checks.x86_64-linux.localbackup —
error: … while evaluating the attribute 'drvPath' at «https://releases.nixos.org/nixpkgs/nixpkgs-26.11pre1079900.d54020a6ac32/nixexprs.tar.xz?na …
error:
       … while evaluating the attribute 'drvPath'
         at «https://releases.nixos.org/nixpkgs/nixpkgs-26.11pre1079900.d54020a6ac32/nixexprs.tar.xz?narHash=sha256-OjqPjipsKi79LA0IEgqlsRe2XlA4Q/6zsMKSwUfTi/8%3D»/lib/customisation.nix:416:11:
          415|         // {
          416|           drvPath =
             |           ^
          417|             assert condition;

       … while calling the 'derivationStrict' builtin
         at «nix-internal»/derivation-internal.nix:37:12:
           36|
           37|   strict = derivationStrict drvAttrs;
             |            ^
           38|

       … while evaluating the option `driverConfiguration.vlans':

       … while evaluating definitions from `/nix/store/6kx9hd4w6dvxsi401dp0jwnj8n5l9h7h-source/nixos/lib/testing/driver-configuration.nix':

       … while evaluating the option `containers.machine.networking.interfaces':

       … while evaluating definitions from `/nix/store/6kx9hd4w6dvxsi401dp0jwnj8n5l9h7h-source/nixos/modules/hardware/facter/networking':

       … while evaluating the option `containers.machine.hardware.facter.enable':

       … while evaluating the option `containers.machine.hardware.facter.report':

       … while evaluating the option `containers.machine.hardware.facter.reportPath':

       … while evaluating definitions from `/nix/store/74smld9y24m9yc7az735xzn555f6wni3-source/nixosModules/clanCore/nixos-facter.nix':

       (stack trace truncated; use '--show-trace' to show the full, detailed trace)

       error: opening a connection to remote store 'grpc://nix-store.geninf.io:50051' previously failed
failed eval checks.x86_64-linux.machine-id —
error: … while evaluating the attribute 'drvPath' at «https://releases.nixos.org/nixpkgs/nixpkgs-26.11pre1079900.d54020a6ac32/nixexprs.tar.xz?na …
error:
       … while evaluating the attribute 'drvPath'
         at «https://releases.nixos.org/nixpkgs/nixpkgs-26.11pre1079900.d54020a6ac32/nixexprs.tar.xz?narHash=sha256-OjqPjipsKi79LA0IEgqlsRe2XlA4Q/6zsMKSwUfTi/8%3D»/lib/customisation.nix:416:11:
          415|         // {
          416|           drvPath =
             |           ^
          417|             assert condition;

       … while calling the 'derivationStrict' builtin
         at «nix-internal»/derivation-internal.nix:37:12:
           36|
           37|   strict = derivationStrict drvAttrs;
             |            ^
           38|

       … while evaluating the option `driverConfiguration.vlans':

       … while evaluating definitions from `/nix/store/6kx9hd4w6dvxsi401dp0jwnj8n5l9h7h-source/nixos/lib/testing/driver-configuration.nix':

       … while evaluating the option `containers.server.networking.interfaces':

       … while evaluating definitions from `/nix/store/6kx9hd4w6dvxsi401dp0jwnj8n5l9h7h-source/nixos/modules/hardware/facter/networking':

       … while evaluating the option `containers.server.hardware.facter.enable':

       … while evaluating the option `containers.server.hardware.facter.report':

       … while evaluating the option `containers.server.hardware.facter.reportPath':

       … while evaluating definitions from `/nix/store/74smld9y24m9yc7az735xzn555f6wni3-source/nixosModules/clanCore/nixos-facter.nix':

       (stack trace truncated; use '--show-trace' to show the full, detailed trace)

       error: opening a connection to remote store 'grpc://nix-store.geninf.io:50051' previously failed
failed eval checks.x86_64-linux.matrix-synapse —
error: … while evaluating the attribute 'drvPath' at «https://releases.nixos.org/nixpkgs/nixpkgs-26.11pre1079900.d54020a6ac32/nixexprs.tar.xz?na …
error:
       … while evaluating the attribute 'drvPath'
         at «https://releases.nixos.org/nixpkgs/nixpkgs-26.11pre1079900.d54020a6ac32/nixexprs.tar.xz?narHash=sha256-OjqPjipsKi79LA0IEgqlsRe2XlA4Q/6zsMKSwUfTi/8%3D»/lib/customisation.nix:416:11:
          415|         // {
          416|           drvPath =
             |           ^
          417|             assert condition;

       … while calling the 'derivationStrict' builtin
         at «nix-internal»/derivation-internal.nix:37:12:
           36|
           37|   strict = derivationStrict drvAttrs;
             |            ^
           38|

       … while evaluating the option `driverConfiguration.vlans':

       … while evaluating definitions from `/nix/store/6kx9hd4w6dvxsi401dp0jwnj8n5l9h7h-source/nixos/lib/testing/driver-configuration.nix':

       … while evaluating the option `containers.machine.networking.interfaces':

       … while evaluating definitions from `/nix/store/6kx9hd4w6dvxsi401dp0jwnj8n5l9h7h-source/nixos/modules/hardware/facter/networking':

       … while evaluating the option `containers.machine.hardware.facter.enable':

       … while evaluating the option `containers.machine.hardware.facter.report':

       … while evaluating the option `containers.machine.hardware.facter.reportPath':

       … while evaluating definitions from `/nix/store/74smld9y24m9yc7az735xzn555f6wni3-source/nixosModules/clanCore/nixos-facter.nix':

       (stack trace truncated; use '--show-trace' to show the full, detailed trace)

       error: opening a connection to remote store 'grpc://nix-store.geninf.io:50051' previously failed
failed eval checks.x86_64-linux.monitoring —
error: … while evaluating the attribute 'drvPath' at «https://releases.nixos.org/nixpkgs/nixpkgs-26.11pre1079900.d54020a6ac32/nixexprs.tar.xz?na …
error:
       … while evaluating the attribute 'drvPath'
         at «https://releases.nixos.org/nixpkgs/nixpkgs-26.11pre1079900.d54020a6ac32/nixexprs.tar.xz?narHash=sha256-OjqPjipsKi79LA0IEgqlsRe2XlA4Q/6zsMKSwUfTi/8%3D»/lib/customisation.nix:416:11:
          415|         // {
          416|           drvPath =
             |           ^
          417|             assert condition;

       … while calling the 'derivationStrict' builtin
         at «nix-internal»/derivation-internal.nix:37:12:
           36|
           37|   strict = derivationStrict drvAttrs;
             |            ^
           38|

       … while evaluating the option `driverConfiguration.vlans':

       … while evaluating definitions from `/nix/store/6kx9hd4w6dvxsi401dp0jwnj8n5l9h7h-source/nixos/lib/testing/driver-configuration.nix':

       … while evaluating the option `containers.machine1.networking.interfaces':

       … while evaluating definitions from `/nix/store/6kx9hd4w6dvxsi401dp0jwnj8n5l9h7h-source/nixos/modules/hardware/facter/networking':

       … while evaluating the option `containers.machine1.hardware.facter.enable':

       … while evaluating the option `containers.machine1.hardware.facter.report':

       … while evaluating the option `containers.machine1.hardware.facter.reportPath':

       … while evaluating definitions from `/nix/store/74smld9y24m9yc7az735xzn555f6wni3-source/nixosModules/clanCore/nixos-facter.nix':

       (stack trace truncated; use '--show-trace' to show the full, detailed trace)

       error: opening a connection to remote store 'grpc://nix-store.geninf.io:50051' previously failed
failed eval checks.x86_64-linux.mycelium —
error: … while evaluating the attribute 'drvPath' at «https://releases.nixos.org/nixpkgs/nixpkgs-26.11pre1079900.d54020a6ac32/nixexprs.tar.xz?na …
error:
       … while evaluating the attribute 'drvPath'
         at «https://releases.nixos.org/nixpkgs/nixpkgs-26.11pre1079900.d54020a6ac32/nixexprs.tar.xz?narHash=sha256-OjqPjipsKi79LA0IEgqlsRe2XlA4Q/6zsMKSwUfTi/8%3D»/lib/customisation.nix:416:11:
          415|         // {
          416|           drvPath =
             |           ^
          417|             assert condition;

       … while calling the 'derivationStrict' builtin
         at «nix-internal»/derivation-internal.nix:37:12:
           36|
           37|   strict = derivationStrict drvAttrs;
             |            ^
           38|

       … while evaluating the option `driverConfiguration.vlans':

       … while evaluating definitions from `/nix/store/6kx9hd4w6dvxsi401dp0jwnj8n5l9h7h-source/nixos/lib/testing/driver-configuration.nix':

       … while evaluating the option `nodes.server.networking.interfaces':

       … while evaluating definitions from `/nix/store/6kx9hd4w6dvxsi401dp0jwnj8n5l9h7h-source/nixos/modules/hardware/facter/networking':

       … while evaluating the option `nodes.server.hardware.facter.enable':

       … while evaluating the option `nodes.server.hardware.facter.report':

       … while evaluating the option `nodes.server.hardware.facter.reportPath':

       … while evaluating definitions from `/nix/store/74smld9y24m9yc7az735xzn555f6wni3-source/nixosModules/clanCore/nixos-facter.nix':

       (stack trace truncated; use '--show-trace' to show the full, detailed trace)

       error: cannot open connection to remote store 'grpc://nix-store.geninf.io:50051': error: Nix daemon disconnected unexpectedly (maybe it crashed?)
failed eval checks.x86_64-linux.ncps —
error: … while evaluating the attribute 'drvPath' at «https://releases.nixos.org/nixpkgs/nixpkgs-26.11pre1079900.d54020a6ac32/nixexprs.tar.xz?na …
error:
       … while evaluating the attribute 'drvPath'
         at «https://releases.nixos.org/nixpkgs/nixpkgs-26.11pre1079900.d54020a6ac32/nixexprs.tar.xz?narHash=sha256-OjqPjipsKi79LA0IEgqlsRe2XlA4Q/6zsMKSwUfTi/8%3D»/lib/customisation.nix:416:11:
          415|         // {
          416|           drvPath =
             |           ^
          417|             assert condition;

       … while calling the 'derivationStrict' builtin
         at «nix-internal»/derivation-internal.nix:37:12:
           36|
           37|   strict = derivationStrict drvAttrs;
             |            ^
           38|

       … while evaluating the option `driverConfiguration.vlans':

       … while evaluating definitions from `/nix/store/6kx9hd4w6dvxsi401dp0jwnj8n5l9h7h-source/nixos/lib/testing/driver-configuration.nix':

       … while evaluating the option `nodes.alice.networking.interfaces':

       … while evaluating definitions from `/nix/store/6kx9hd4w6dvxsi401dp0jwnj8n5l9h7h-source/nixos/modules/hardware/facter/networking':

       … while evaluating the option `nodes.alice.hardware.facter.enable':

       … while evaluating the option `nodes.alice.hardware.facter.report':

       … while evaluating the option `nodes.alice.hardware.facter.reportPath':

       … while evaluating definitions from `/nix/store/74smld9y24m9yc7az735xzn555f6wni3-source/nixosModules/clanCore/nixos-facter.nix':

       (stack trace truncated; use '--show-trace' to show the full, detailed trace)

       error: cannot open connection to remote store 'grpc://nix-store.geninf.io:50051': error: Nix daemon disconnected unexpectedly (maybe it crashed?)
failed checks.x86_64-linux.nixos-documentation 3h 0m
setup: don't know how to build these paths: /nix/store/2h6n4pg4p2xkgz5p1r2fgk3igb5pnrps-nixos-system-test-documentation-26.11.20260926.d54020a.drv warning: ig …
setup:
don't know how to build these paths:
  /nix/store/2h6n4pg4p2xkgz5p1r2fgk3igb5pnrps-nixos-system-test-documentation-26.11.20260926.d54020a.drv
warning: ignoring the client-specified setting 'store', because it is a restricted setting and you are not a trusted user
jzljwhkq80yvrbvf6f0pvi8xncsw40qs-etc-nix-registry.json.drv: gi-build-x86-02: not scheduled here: jzljwhkq80yvrbvf6f0pvi8xncsw40qs-etc-nix-registry.json.drv, asking the scheduler again
failed checks.x86_64-linux.nixos-flash-installer 3h 0m
setup: /nix/store/ihyn63wm57i6mnrbndn91gpw2vsvs0zz-linux-7.2.8-modules /nix/store/nwg32z82nwl31hlpv13wcbvjynsksczq-nixos-configuration-reference-manpage / …
setup:
  /nix/store/ihyn63wm57i6mnrbndn91gpw2vsvs0zz-linux-7.2.8-modules
  /nix/store/nwg32z82nwl31hlpv13wcbvjynsksczq-nixos-configuration-reference-manpage
  /nix/store/44njr78zh3kggfssnfrjqbmnwmq43m50-parted-3.8
  /nix/store/6frdz3wxshzri1f4wx4301wgzjil1ncl-parted-3.8-man
  /nix/store/lglivnxwpinc046nlzv9nspdl37b0a3a-tor-0.4.9.13-geoip
  /nix/store/frf7b4rqmyq2s1ccp2qxyxnyzhk134rc-udev-fido2
  /nix/store/263jgp1f6d11r4jgjbcf0ylnpxs139wp-zfs-kernel-2.4.4-7.2.8
warning: ignoring the client-specified setting 'store', because it is a restricted setting and you are not a trusted user
failed checks.x86_64-linux.nixos-test-flash 3h 0m
setup: don't know how to build these paths: /nix/store/md1iicw6yxzbzk76xfdqld6728gxjbkc-vm-test-run-flash.drv warning: ignoring the client-specified setting ' …
setup:
don't know how to build these paths:
  /nix/store/md1iicw6yxzbzk76xfdqld6728gxjbkc-vm-test-run-flash.drv
warning: ignoring the client-specified setting 'store', because it is a restricted setting and you are not a trusted user
my5nc3ki1py2hqvpns3anrsqh53h2xhx-flash-test-flake-x86_64-linux.drv: gi-build-x86-02: not scheduled here: my5nc3ki1py2hqvpns3anrsqh53h2xhx-flash-test-flake-x86_64-linux.drv, asking the scheduler again
failed checks.x86_64-linux.nixos-test-flash-installer-boot 3h 0m
setup: /nix/store/6frdz3wxshzri1f4wx4301wgzjil1ncl-parted-3.8-man /nix/store/lglivnxwpinc046nlzv9nspdl37b0a3a-tor-0.4.9.13-geoip /nix/store/vjnnnkjlplrhx0 …
setup:
  /nix/store/6frdz3wxshzri1f4wx4301wgzjil1ncl-parted-3.8-man
  /nix/store/lglivnxwpinc046nlzv9nspdl37b0a3a-tor-0.4.9.13-geoip
  /nix/store/vjnnnkjlplrhx031y0ys5q2qvyiqclz7-ty-0.0.84
  /nix/store/frf7b4rqmyq2s1ccp2qxyxnyzhk134rc-udev-fido2
  /nix/store/wfqcg62dadknanwcvk7ac5k3hlnjzvxz-users-groups.json
  /nix/store/263jgp1f6d11r4jgjbcf0ylnpxs139wp-zfs-kernel-2.4.4-7.2.8
warning: ignoring the client-specified setting 'store', because it is a restricted setting and you are not a trusted user
axvyrglnh4d0h3a7jmn3nawnjkfvpgs9-nixos-.drv: build-x86-01: not scheduled here: axvyrglnh4d0h3a7jmn3nawnjkfvpgs9-nixos-.drv, asking the scheduler again
failed checks.x86_64-linux.nixos-test-installation 3h 0m
setup: don't know how to build these paths: /nix/store/r20cfd5zndh5wwksxw27hp3h3cg4hsb6-vm-test-run-installation.drv warning: ignoring the client-specified se …
setup:
don't know how to build these paths:
  /nix/store/r20cfd5zndh5wwksxw27hp3h3cg4hsb6-vm-test-run-installation.drv
warning: ignoring the client-specified setting 'store', because it is a restricted setting and you are not a trusted user
ynkz13h9dsa0wkl8413hqqyq5b8kg6gb-installation-test-flake-x86_64-linux.drv: gi-build-x86-01: not scheduled here: ynkz13h9dsa0wkl8413hqqyq5b8kg6gb-installation-test-flake-x86_64-linux.drv, asking the scheduler again
failed checks.x86_64-linux.nixos-test-installation-age 3h 0m
setup: /nix/store/96r2n039x32s0qmcgabx19l7m7c0aq6j-zlib-1.3.2 /nix/store/6vdilqj08xqi91w72bvhxpxpmck591mh-zlib-1.3.2-dev /nix/store/qn3f3m8xmnwnsnbkldlmic …
setup:
  /nix/store/96r2n039x32s0qmcgabx19l7m7c0aq6j-zlib-1.3.2
  /nix/store/6vdilqj08xqi91w72bvhxpxpmck591mh-zlib-1.3.2-dev
  /nix/store/qn3f3m8xmnwnsnbkldlmicgx6cmxls0y-zlib-1.3.2-static
  /nix/store/13vkic2v8zac4m6p38asdhasb3xylv07-zlib-1.3.2.tar.gz
  /nix/store/18agc3vzx1yqx1hz807wa4iflsy02ifw-zlib-1.3.2.tar.xz
warning: ignoring the client-specified setting 'store', because it is a restricted setting and you are not a trusted user
ynkz13h9dsa0wkl8413hqqyq5b8kg6gb-installation-test-flake-x86_64-linux.drv: gi-build-x86-01: not scheduled here: ynkz13h9dsa0wkl8413hqqyq5b8kg6gb-installation-test-flake-x86_64-linux.drv, asking the scheduler again
dk6njdlibq62ls7jdbg7sgb7k5q4rcq2-clan-runtime.drv: build-x86-01: not scheduled here: dk6njdlibq62ls7jdbg7sgb7k5q4rcq2-clan-runtime.drv, asking the scheduler again
failed checks.x86_64-linux.nixos-test-installation-password-store 3h 0m
setup: don't know how to build these paths: /nix/store/xiya8fj5qbk90qyn3rgx59r61rjkpn4r-vm-test-run-installation.drv warning: ignoring the client-specified se …
setup:
don't know how to build these paths:
  /nix/store/xiya8fj5qbk90qyn3rgx59r61rjkpn4r-vm-test-run-installation.drv
warning: ignoring the client-specified setting 'store', because it is a restricted setting and you are not a trusted user
ynkz13h9dsa0wkl8413hqqyq5b8kg6gb-installation-test-flake-x86_64-linux.drv: gi-build-x86-01: not scheduled here: ynkz13h9dsa0wkl8413hqqyq5b8kg6gb-installation-test-flake-x86_64-linux.drv, asking the scheduler again
failed eval checks.x86_64-linux.nixos-test-password-store-mounts —
error: … while evaluating the attribute 'drvPath' at «https://releases.nixos.org/nixpkgs/nixpkgs-26.11pre1079900.d54020a6ac32/nixexprs.tar.xz?na …
error:
       … while evaluating the attribute 'drvPath'
         at «https://releases.nixos.org/nixpkgs/nixpkgs-26.11pre1079900.d54020a6ac32/nixexprs.tar.xz?narHash=sha256-OjqPjipsKi79LA0IEgqlsRe2XlA4Q/6zsMKSwUfTi/8%3D»/lib/customisation.nix:416:11:
          415|         // {
          416|           drvPath =
             |           ^
          417|             assert condition;

       … while calling the 'derivationStrict' builtin
         at «nix-internal»/derivation-internal.nix:37:12:
           36|
           37|   strict = derivationStrict drvAttrs;
             |            ^
           38|

       … while evaluating the option `driverConfiguration.vlans':

       … while evaluating definitions from `/nix/store/6kx9hd4w6dvxsi401dp0jwnj8n5l9h7h-source/nixos/lib/testing/driver-configuration.nix':

       … while evaluating the option `nodes.machine.networking.interfaces':

       … while evaluating definitions from `/nix/store/6kx9hd4w6dvxsi401dp0jwnj8n5l9h7h-source/nixos/modules/hardware/facter/networking':

       … while evaluating the option `nodes.machine.hardware.facter.enable':

       … while evaluating the option `nodes.machine.hardware.facter.report':

       … while evaluating the option `nodes.machine.hardware.facter.reportPath':

       … while evaluating definitions from `/nix/store/74smld9y24m9yc7az735xzn555f6wni3-source/nixosModules/clanCore/nixos-facter.nix':

       (stack trace truncated; use '--show-trace' to show the full, detailed trace)

       error: cannot open connection to remote store 'grpc://nix-store.geninf.io:50051': error: Nix daemon disconnected unexpectedly (maybe it crashed?)
failed checks.x86_64-linux.nixos-test-update-hardware-configuration 3h 0m
setup: don't know how to build these paths: /nix/store/4kkprk7icgix1iacv52w1jbs03sixcjv-vm-test-run-update-hardware-configuration.drv warning: ignoring the cl …
setup:
don't know how to build these paths:
  /nix/store/4kkprk7icgix1iacv52w1jbs03sixcjv-vm-test-run-update-hardware-configuration.drv
warning: ignoring the client-specified setting 'store', because it is a restricted setting and you are not a trusted user
ynkz13h9dsa0wkl8413hqqyq5b8kg6gb-installation-test-flake-x86_64-linux.drv: gi-build-x86-01: not scheduled here: ynkz13h9dsa0wkl8413hqqyq5b8kg6gb-installation-test-flake-x86_64-linux.drv, asking the scheduler again
failed eval checks.x86_64-linux.p2p-ssh-iroh —
error: … while evaluating the attribute 'drvPath' at «https://releases.nixos.org/nixpkgs/nixpkgs-26.11pre1079900.d54020a6ac32/nixexprs.tar.xz?na …
error:
       … while evaluating the attribute 'drvPath'
         at «https://releases.nixos.org/nixpkgs/nixpkgs-26.11pre1079900.d54020a6ac32/nixexprs.tar.xz?narHash=sha256-OjqPjipsKi79LA0IEgqlsRe2XlA4Q/6zsMKSwUfTi/8%3D»/lib/customisation.nix:416:11:
          415|         // {
          416|           drvPath =
             |           ^
          417|             assert condition;

       … while calling the 'derivationStrict' builtin
         at «nix-internal»/derivation-internal.nix:37:12:
           36|
           37|   strict = derivationStrict drvAttrs;
             |            ^
           38|

       … while evaluating the option `driverConfiguration.vlans':

       … while evaluating definitions from `/nix/store/6kx9hd4w6dvxsi401dp0jwnj8n5l9h7h-source/nixos/lib/testing/driver-configuration.nix':

       … while evaluating the option `containers.client.networking.interfaces':

       … while evaluating definitions from `/nix/store/6kx9hd4w6dvxsi401dp0jwnj8n5l9h7h-source/nixos/modules/hardware/facter/networking':

       … while evaluating the option `containers.client.hardware.facter.enable':

       … while evaluating the option `containers.client.hardware.facter.report':

       … while evaluating the option `containers.client.hardware.facter.reportPath':

       … while evaluating definitions from `/nix/store/74smld9y24m9yc7az735xzn555f6wni3-source/nixosModules/clanCore/nixos-facter.nix':

       (stack trace truncated; use '--show-trace' to show the full, detailed trace)

       error: opening a connection to remote store 'grpc://nix-store.geninf.io:50051' previously failed
failed eval checks.x86_64-linux.packages —
error: … while evaluating the attribute 'drvPath' at «https://releases.nixos.org/nixpkgs/nixpkgs-26.11pre1079900.d54020a6ac32/nixexprs.tar.xz?na …
error:
       … while evaluating the attribute 'drvPath'
         at «https://releases.nixos.org/nixpkgs/nixpkgs-26.11pre1079900.d54020a6ac32/nixexprs.tar.xz?narHash=sha256-OjqPjipsKi79LA0IEgqlsRe2XlA4Q/6zsMKSwUfTi/8%3D»/lib/customisation.nix:416:11:
          415|         // {
          416|           drvPath =
             |           ^
          417|             assert condition;

       … while calling the 'derivationStrict' builtin
         at «nix-internal»/derivation-internal.nix:37:12:
           36|
           37|   strict = derivationStrict drvAttrs;
             |            ^
           38|

       … while evaluating the option `driverConfiguration.vlans':

       … while evaluating definitions from `/nix/store/6kx9hd4w6dvxsi401dp0jwnj8n5l9h7h-source/nixos/lib/testing/driver-configuration.nix':

       … while evaluating the option `containers.server.networking.interfaces':

       … while evaluating definitions from `/nix/store/6kx9hd4w6dvxsi401dp0jwnj8n5l9h7h-source/nixos/modules/hardware/facter/networking':

       … while evaluating the option `containers.server.hardware.facter.enable':

       … while evaluating the option `containers.server.hardware.facter.report':

       … while evaluating the option `containers.server.hardware.facter.reportPath':

       … while evaluating definitions from `/nix/store/74smld9y24m9yc7az735xzn555f6wni3-source/nixosModules/clanCore/nixos-facter.nix':

       (stack trace truncated; use '--show-trace' to show the full, detailed trace)

       error: opening a connection to remote store 'grpc://nix-store.geninf.io:50051' previously failed
failed eval checks.x86_64-linux.pki —
error: … while evaluating the attribute 'drvPath' at «https://releases.nixos.org/nixpkgs/nixpkgs-26.11pre1079900.d54020a6ac32/nixexprs.tar.xz?na …
error:
       … while evaluating the attribute 'drvPath'
         at «https://releases.nixos.org/nixpkgs/nixpkgs-26.11pre1079900.d54020a6ac32/nixexprs.tar.xz?narHash=sha256-OjqPjipsKi79LA0IEgqlsRe2XlA4Q/6zsMKSwUfTi/8%3D»/lib/customisation.nix:416:11:
          415|         // {
          416|           drvPath =
             |           ^
          417|             assert condition;

       … while calling the 'derivationStrict' builtin
         at «nix-internal»/derivation-internal.nix:37:12:
           36|
           37|   strict = derivationStrict drvAttrs;
             |            ^
           38|

       … while evaluating the option `driverConfiguration.vlans':

       … while evaluating definitions from `/nix/store/6kx9hd4w6dvxsi401dp0jwnj8n5l9h7h-source/nixos/lib/testing/driver-configuration.nix':

       … while evaluating the option `nodes.caddy.networking.interfaces':

       … while evaluating definitions from `/nix/store/6kx9hd4w6dvxsi401dp0jwnj8n5l9h7h-source/nixos/modules/hardware/facter/networking':

       … while evaluating the option `nodes.caddy.hardware.facter.enable':

       … while evaluating the option `nodes.caddy.hardware.facter.report':

       … while evaluating the option `nodes.caddy.hardware.facter.reportPath':

       … while evaluating definitions from `/nix/store/74smld9y24m9yc7az735xzn555f6wni3-source/nixosModules/clanCore/nixos-facter.nix':

       (stack trace truncated; use '--show-trace' to show the full, detailed trace)

       error: cannot open connection to remote store 'grpc://nix-store.geninf.io:50051': error: Nix daemon disconnected unexpectedly (maybe it crashed?)
failed eval checks.x86_64-linux.postgresql —
error: … while evaluating the attribute 'drvPath' at «https://releases.nixos.org/nixpkgs/nixpkgs-26.11pre1079900.d54020a6ac32/nixexprs.tar.xz?na …
error:
       … while evaluating the attribute 'drvPath'
         at «https://releases.nixos.org/nixpkgs/nixpkgs-26.11pre1079900.d54020a6ac32/nixexprs.tar.xz?narHash=sha256-OjqPjipsKi79LA0IEgqlsRe2XlA4Q/6zsMKSwUfTi/8%3D»/lib/customisation.nix:416:11:
          415|         // {
          416|           drvPath =
             |           ^
          417|             assert condition;

       … while calling the 'derivationStrict' builtin
         at «nix-internal»/derivation-internal.nix:37:12:
           36|
           37|   strict = derivationStrict drvAttrs;
             |            ^
           38|

       … while evaluating the option `driverConfiguration.vlans':

       … while evaluating definitions from `/nix/store/6kx9hd4w6dvxsi401dp0jwnj8n5l9h7h-source/nixos/lib/testing/driver-configuration.nix':

       … while evaluating the option `containers.machine.networking.interfaces':

       … while evaluating definitions from `/nix/store/6kx9hd4w6dvxsi401dp0jwnj8n5l9h7h-source/nixos/modules/hardware/facter/networking':

       … while evaluating the option `containers.machine.hardware.facter.enable':

       … while evaluating the option `containers.machine.hardware.facter.report':

       … while evaluating the option `containers.machine.hardware.facter.reportPath':

       … while evaluating definitions from `/nix/store/74smld9y24m9yc7az735xzn555f6wni3-source/nixosModules/clanCore/nixos-facter.nix':

       (stack trace truncated; use '--show-trace' to show the full, detailed trace)

       error: cannot open connection to remote store 'grpc://nix-store.geninf.io:50051': error: Nix daemon disconnected unexpectedly (maybe it crashed?)
failed eval checks.x86_64-linux.service-dummy-test —
error: … while evaluating the attribute 'drvPath' at «https://releases.nixos.org/nixpkgs/nixpkgs-26.11pre1079900.d54020a6ac32/nixexprs.tar.xz?na …
error:
       … while evaluating the attribute 'drvPath'
         at «https://releases.nixos.org/nixpkgs/nixpkgs-26.11pre1079900.d54020a6ac32/nixexprs.tar.xz?narHash=sha256-OjqPjipsKi79LA0IEgqlsRe2XlA4Q/6zsMKSwUfTi/8%3D»/lib/customisation.nix:416:11:
          415|         // {
          416|           drvPath =
             |           ^
          417|             assert condition;

       … while calling the 'derivationStrict' builtin
         at «nix-internal»/derivation-internal.nix:37:12:
           36|
           37|   strict = derivationStrict drvAttrs;
             |            ^
           38|

       … while evaluating the option `driverConfiguration.vlans':

       … while evaluating definitions from `/nix/store/6kx9hd4w6dvxsi401dp0jwnj8n5l9h7h-source/nixos/lib/testing/driver-configuration.nix':

       … while evaluating the option `containers.admin1.networking.interfaces':

       … while evaluating definitions from `/nix/store/6kx9hd4w6dvxsi401dp0jwnj8n5l9h7h-source/nixos/modules/hardware/facter/networking':

       … while evaluating the option `containers.admin1.hardware.facter.enable':

       … while evaluating the option `containers.admin1.hardware.facter.report':

       … while evaluating the option `containers.admin1.hardware.facter.reportPath':

       … while evaluating definitions from `/nix/store/74smld9y24m9yc7az735xzn555f6wni3-source/nixosModules/clanCore/nixos-facter.nix':

       (stack trace truncated; use '--show-trace' to show the full, detailed trace)

       error: cannot open connection to remote store 'grpc://nix-store.geninf.io:50051': error: Nix daemon disconnected unexpectedly (maybe it crashed?)
failed eval checks.x86_64-linux.service-dummy-test-from-flake —
error: … while evaluating the attribute 'drvPath' at «https://releases.nixos.org/nixpkgs/nixpkgs-26.11pre1079900.d54020a6ac32/nixexprs.tar.xz?na …
error:
       … while evaluating the attribute 'drvPath'
         at «https://releases.nixos.org/nixpkgs/nixpkgs-26.11pre1079900.d54020a6ac32/nixexprs.tar.xz?narHash=sha256-OjqPjipsKi79LA0IEgqlsRe2XlA4Q/6zsMKSwUfTi/8%3D»/lib/customisation.nix:416:11:
          415|         // {
          416|           drvPath =
             |           ^
          417|             assert condition;

       … while calling the 'derivationStrict' builtin
         at «nix-internal»/derivation-internal.nix:37:12:
           36|
           37|   strict = derivationStrict drvAttrs;
             |            ^
           38|

       … while evaluating the option `driverConfiguration.vlans':

       … while evaluating definitions from `/nix/store/6kx9hd4w6dvxsi401dp0jwnj8n5l9h7h-source/nixos/lib/testing/driver-configuration.nix':

       … while evaluating the option `containers.admin1.networking.interfaces':

       … while evaluating definitions from `/nix/store/6kx9hd4w6dvxsi401dp0jwnj8n5l9h7h-source/nixos/modules/hardware/facter/networking':

       … while evaluating the option `containers.admin1.hardware.facter.enable':

       … while evaluating the option `containers.admin1.hardware.facter.report':

       … while evaluating the option `containers.admin1.hardware.facter.reportPath':

       … while evaluating definitions from `/nix/store/74smld9y24m9yc7az735xzn555f6wni3-source/nixosModules/clanCore/nixos-facter.nix':

       (stack trace truncated; use '--show-trace' to show the full, detailed trace)

       error: opening a connection to remote store 'grpc://nix-store.geninf.io:50051' previously failed
failed eval checks.x86_64-linux.sshd —
error: … while evaluating the attribute 'drvPath' at «https://releases.nixos.org/nixpkgs/nixpkgs-26.11pre1079900.d54020a6ac32/nixexprs.tar.xz?na …
error:
       … while evaluating the attribute 'drvPath'
         at «https://releases.nixos.org/nixpkgs/nixpkgs-26.11pre1079900.d54020a6ac32/nixexprs.tar.xz?narHash=sha256-OjqPjipsKi79LA0IEgqlsRe2XlA4Q/6zsMKSwUfTi/8%3D»/lib/customisation.nix:416:11:
          415|         // {
          416|           drvPath =
             |           ^
          417|             assert condition;

       … while calling the 'derivationStrict' builtin
         at «nix-internal»/derivation-internal.nix:37:12:
           36|
           37|   strict = derivationStrict drvAttrs;
             |            ^
           38|

       … while evaluating the option `driverConfiguration.vlans':

       … while evaluating definitions from `/nix/store/6kx9hd4w6dvxsi401dp0jwnj8n5l9h7h-source/nixos/lib/testing/driver-configuration.nix':

       … while evaluating the option `containers.client.networking.interfaces':

       … while evaluating definitions from `/nix/store/6kx9hd4w6dvxsi401dp0jwnj8n5l9h7h-source/nixos/modules/hardware/facter/networking':

       … while evaluating the option `containers.client.hardware.facter.enable':

       … while evaluating the option `containers.client.hardware.facter.report':

       … while evaluating the option `containers.client.hardware.facter.reportPath':

       … while evaluating definitions from `/nix/store/74smld9y24m9yc7az735xzn555f6wni3-source/nixosModules/clanCore/nixos-facter.nix':

       (stack trace truncated; use '--show-trace' to show the full, detailed trace)

       error: opening a connection to remote store 'grpc://nix-store.geninf.io:50051' previously failed
failed eval checks.x86_64-linux.sshd-no-ca —
error: … while evaluating the attribute 'drvPath' at «https://releases.nixos.org/nixpkgs/nixpkgs-26.11pre1079900.d54020a6ac32/nixexprs.tar.xz?na …
error:
       … while evaluating the attribute 'drvPath'
         at «https://releases.nixos.org/nixpkgs/nixpkgs-26.11pre1079900.d54020a6ac32/nixexprs.tar.xz?narHash=sha256-OjqPjipsKi79LA0IEgqlsRe2XlA4Q/6zsMKSwUfTi/8%3D»/lib/customisation.nix:416:11:
          415|         // {
          416|           drvPath =
             |           ^
          417|             assert condition;

       … while calling the 'derivationStrict' builtin
         at «nix-internal»/derivation-internal.nix:37:12:
           36|
           37|   strict = derivationStrict drvAttrs;
             |            ^
           38|

       … while evaluating the option `driverConfiguration.vlans':

       … while evaluating definitions from `/nix/store/6kx9hd4w6dvxsi401dp0jwnj8n5l9h7h-source/nixos/lib/testing/driver-configuration.nix':

       … while evaluating the option `containers.client.networking.interfaces':

       … while evaluating definitions from `/nix/store/6kx9hd4w6dvxsi401dp0jwnj8n5l9h7h-source/nixos/modules/hardware/facter/networking':

       … while evaluating the option `containers.client.hardware.facter.enable':

       … while evaluating the option `containers.client.hardware.facter.report':

       … while evaluating the option `containers.client.hardware.facter.reportPath':

       … while evaluating definitions from `/nix/store/74smld9y24m9yc7az735xzn555f6wni3-source/nixosModules/clanCore/nixos-facter.nix':

       (stack trace truncated; use '--show-trace' to show the full, detailed trace)

       error: cannot open connection to remote store 'grpc://nix-store.geninf.io:50051': error: Nix daemon disconnected unexpectedly (maybe it crashed?)
failed eval checks.x86_64-linux.state-version —
error: … while evaluating the attribute 'drvPath' at «https://releases.nixos.org/nixpkgs/nixpkgs-26.11pre1079900.d54020a6ac32/nixexprs.tar.xz?na …
error:
       … while evaluating the attribute 'drvPath'
         at «https://releases.nixos.org/nixpkgs/nixpkgs-26.11pre1079900.d54020a6ac32/nixexprs.tar.xz?narHash=sha256-OjqPjipsKi79LA0IEgqlsRe2XlA4Q/6zsMKSwUfTi/8%3D»/lib/customisation.nix:416:11:
          415|         // {
          416|           drvPath =
             |           ^
          417|             assert condition;

       … while calling the 'derivationStrict' builtin
         at «nix-internal»/derivation-internal.nix:37:12:
           36|
           37|   strict = derivationStrict drvAttrs;
             |            ^
           38|

       … while evaluating the option `driverConfiguration.vlans':

       … while evaluating definitions from `/nix/store/6kx9hd4w6dvxsi401dp0jwnj8n5l9h7h-source/nixos/lib/testing/driver-configuration.nix':

       … while evaluating the option `containers.server.networking.interfaces':

       … while evaluating definitions from `/nix/store/6kx9hd4w6dvxsi401dp0jwnj8n5l9h7h-source/nixos/modules/hardware/facter/networking':

       … while evaluating the option `containers.server.hardware.facter.enable':

       … while evaluating the option `containers.server.hardware.facter.report':

       … while evaluating the option `containers.server.hardware.facter.reportPath':

       … while evaluating definitions from `/nix/store/74smld9y24m9yc7az735xzn555f6wni3-source/nixosModules/clanCore/nixos-facter.nix':

       (stack trace truncated; use '--show-trace' to show the full, detailed trace)

       error: opening a connection to remote store 'grpc://nix-store.geninf.io:50051' previously failed
failed eval checks.x86_64-linux.syncthing-service —
error: … while evaluating the attribute 'drvPath' at «https://releases.nixos.org/nixpkgs/nixpkgs-26.11pre1079900.d54020a6ac32/nixexprs.tar.xz?na …
error:
       … while evaluating the attribute 'drvPath'
         at «https://releases.nixos.org/nixpkgs/nixpkgs-26.11pre1079900.d54020a6ac32/nixexprs.tar.xz?narHash=sha256-OjqPjipsKi79LA0IEgqlsRe2XlA4Q/6zsMKSwUfTi/8%3D»/lib/customisation.nix:416:11:
          415|         // {
          416|           drvPath =
             |           ^
          417|             assert condition;

       … while calling the 'derivationStrict' builtin
         at «nix-internal»/derivation-internal.nix:37:12:
           36|
           37|   strict = derivationStrict drvAttrs;
             |            ^
           38|

       … while evaluating the option `driverConfiguration.vlans':

       … while evaluating definitions from `/nix/store/6kx9hd4w6dvxsi401dp0jwnj8n5l9h7h-source/nixos/lib/testing/driver-configuration.nix':

       … while evaluating the option `containers.machine1.networking.interfaces':

       … while evaluating definitions from `/nix/store/6kx9hd4w6dvxsi401dp0jwnj8n5l9h7h-source/nixos/modules/hardware/facter/networking':

       … while evaluating the option `containers.machine1.hardware.facter.enable':

       … while evaluating the option `containers.machine1.hardware.facter.report':

       … while evaluating the option `containers.machine1.hardware.facter.reportPath':

       … while evaluating definitions from `/nix/store/74smld9y24m9yc7az735xzn555f6wni3-source/nixosModules/clanCore/nixos-facter.nix':

       (stack trace truncated; use '--show-trace' to show the full, detailed trace)

       error: opening a connection to remote store 'grpc://nix-store.geninf.io:50051' previously failed
failed eval checks.x86_64-linux.template-minimal —
error: … while calling the 'import' builtin at «git+file:///var/lib/nixbot/worktrees/5-30d16ead5d0b-29?ref=HEAD&rev=7bfdf6d7461685c6a67ace66bcaa …
error:
       … while calling the 'import' builtin
         at «git+file:///var/lib/nixbot/worktrees/5-30d16ead5d0b-29?ref=HEAD&rev=7bfdf6d7461685c6a67ace66bcaa62c9ff6f2b07»/templates/flake-module.nix:50:19:
           49|         '';
           50|         evaled = (import "${initialized}/flake.nix").outputs {
             |                   ^
           51|           self = evaled // {

       … while realising the context of path '/nix/store/ix4rhpnw2f728ndbpsbchli8syap3smf-minimal-clan-flake/flake.nix'

       error: cannot open connection to remote store 'grpc://nix-store.geninf.io:50051': error: Nix daemon disconnected unexpectedly (maybe it crashed?)
failed eval checks.x86_64-linux.trusted-nix-caches —
error: … while evaluating the attribute 'drvPath' at «https://releases.nixos.org/nixpkgs/nixpkgs-26.11pre1079900.d54020a6ac32/nixexprs.tar.xz?na …
error:
       … while evaluating the attribute 'drvPath'
         at «https://releases.nixos.org/nixpkgs/nixpkgs-26.11pre1079900.d54020a6ac32/nixexprs.tar.xz?narHash=sha256-OjqPjipsKi79LA0IEgqlsRe2XlA4Q/6zsMKSwUfTi/8%3D»/lib/customisation.nix:416:11:
          415|         // {
          416|           drvPath =
             |           ^
          417|             assert condition;

       … while calling the 'derivationStrict' builtin
         at «nix-internal»/derivation-internal.nix:37:12:
           36|
           37|   strict = derivationStrict drvAttrs;
             |            ^
           38|

       … while evaluating the option `driverConfiguration.vlans':

       … while evaluating definitions from `/nix/store/6kx9hd4w6dvxsi401dp0jwnj8n5l9h7h-source/nixos/lib/testing/driver-configuration.nix':

       … while evaluating the option `containers.server.networking.interfaces':

       … while evaluating definitions from `/nix/store/6kx9hd4w6dvxsi401dp0jwnj8n5l9h7h-source/nixos/modules/hardware/facter/networking':

       … while evaluating the option `containers.server.hardware.facter.enable':

       … while evaluating the option `containers.server.hardware.facter.report':

       … while evaluating the option `containers.server.hardware.facter.reportPath':

       … while evaluating definitions from `/nix/store/74smld9y24m9yc7az735xzn555f6wni3-source/nixosModules/clanCore/nixos-facter.nix':

       (stack trace truncated; use '--show-trace' to show the full, detailed trace)

       error: opening a connection to remote store 'grpc://nix-store.geninf.io:50051' previously failed
failed eval checks.x86_64-linux.users —
error: … while evaluating the attribute 'drvPath' at «https://releases.nixos.org/nixpkgs/nixpkgs-26.11pre1079900.d54020a6ac32/nixexprs.tar.xz?na …
error:
       … while evaluating the attribute 'drvPath'
         at «https://releases.nixos.org/nixpkgs/nixpkgs-26.11pre1079900.d54020a6ac32/nixexprs.tar.xz?narHash=sha256-OjqPjipsKi79LA0IEgqlsRe2XlA4Q/6zsMKSwUfTi/8%3D»/lib/customisation.nix:416:11:
          415|         // {
          416|           drvPath =
             |           ^
          417|             assert condition;

       … while calling the 'derivationStrict' builtin
         at «nix-internal»/derivation-internal.nix:37:12:
           36|
           37|   strict = derivationStrict drvAttrs;
             |            ^
           38|

       … while evaluating the option `driverConfiguration.vlans':

       … while evaluating definitions from `/nix/store/6kx9hd4w6dvxsi401dp0jwnj8n5l9h7h-source/nixos/lib/testing/driver-configuration.nix':

       … while evaluating the option `containers.server.networking.interfaces':

       … while evaluating definitions from `/nix/store/6kx9hd4w6dvxsi401dp0jwnj8n5l9h7h-source/nixos/modules/hardware/facter/networking':

       … while evaluating the option `containers.server.hardware.facter.enable':

       … while evaluating the option `containers.server.hardware.facter.report':

       … while evaluating the option `containers.server.hardware.facter.reportPath':

       … while evaluating definitions from `/nix/store/74smld9y24m9yc7az735xzn555f6wni3-source/nixosModules/clanCore/nixos-facter.nix':

       (stack trace truncated; use '--show-trace' to show the full, detailed trace)

       error: cannot open connection to remote store 'grpc://nix-store.geninf.io:50051': error: Nix daemon disconnected unexpectedly (maybe it crashed?)
failed eval checks.x86_64-linux.wifi —
error: … while evaluating the attribute 'drvPath' at «https://releases.nixos.org/nixpkgs/nixpkgs-26.11pre1079900.d54020a6ac32/nixexprs.tar.xz?na …
error:
       … while evaluating the attribute 'drvPath'
         at «https://releases.nixos.org/nixpkgs/nixpkgs-26.11pre1079900.d54020a6ac32/nixexprs.tar.xz?narHash=sha256-OjqPjipsKi79LA0IEgqlsRe2XlA4Q/6zsMKSwUfTi/8%3D»/lib/customisation.nix:416:11:
          415|         // {
          416|           drvPath =
             |           ^
          417|             assert condition;

       … while calling the 'derivationStrict' builtin
         at «nix-internal»/derivation-internal.nix:37:12:
           36|
           37|   strict = derivationStrict drvAttrs;
             |            ^
           38|

       … while evaluating the option `driverConfiguration.vlans':

       … while evaluating definitions from `/nix/store/6kx9hd4w6dvxsi401dp0jwnj8n5l9h7h-source/nixos/lib/testing/driver-configuration.nix':

       … while evaluating the option `nodes.second.networking.interfaces':

       … while evaluating definitions from `/nix/store/6kx9hd4w6dvxsi401dp0jwnj8n5l9h7h-source/nixos/modules/hardware/facter/networking':

       … while evaluating the option `nodes.second.hardware.facter.enable':

       … while evaluating the option `nodes.second.hardware.facter.report':

       … while evaluating the option `nodes.second.hardware.facter.reportPath':

       … while evaluating definitions from `/nix/store/74smld9y24m9yc7az735xzn555f6wni3-source/nixosModules/clanCore/nixos-facter.nix':

       (stack trace truncated; use '--show-trace' to show the full, detailed trace)

       error: cannot open connection to remote store 'grpc://nix-store.geninf.io:50051': error: Nix daemon disconnected unexpectedly (maybe it crashed?)
failed eval checks.x86_64-linux.wireguard —
error: … while evaluating the attribute 'drvPath' at «https://releases.nixos.org/nixpkgs/nixpkgs-26.11pre1079900.d54020a6ac32/nixexprs.tar.xz?na …
error:
       … while evaluating the attribute 'drvPath'
         at «https://releases.nixos.org/nixpkgs/nixpkgs-26.11pre1079900.d54020a6ac32/nixexprs.tar.xz?narHash=sha256-OjqPjipsKi79LA0IEgqlsRe2XlA4Q/6zsMKSwUfTi/8%3D»/lib/customisation.nix:416:11:
          415|         // {
          416|           drvPath =
             |           ^
          417|             assert condition;

       … while calling the 'derivationStrict' builtin
         at «nix-internal»/derivation-internal.nix:37:12:
           36|
           37|   strict = derivationStrict drvAttrs;
             |            ^
           38|

       … while evaluating the option `driverConfiguration.vlans':

       … while evaluating definitions from `/nix/store/6kx9hd4w6dvxsi401dp0jwnj8n5l9h7h-source/nixos/lib/testing/driver-configuration.nix':

       … while evaluating the option `containers.ctrl1.networking.interfaces':

       … while evaluating definitions from `/nix/store/6kx9hd4w6dvxsi401dp0jwnj8n5l9h7h-source/nixos/modules/hardware/facter/networking':

       … while evaluating the option `containers.ctrl1.hardware.facter.enable':

       … while evaluating the option `containers.ctrl1.hardware.facter.report':

       … while evaluating the option `containers.ctrl1.hardware.facter.reportPath':

       … while evaluating definitions from `/nix/store/74smld9y24m9yc7az735xzn555f6wni3-source/nixosModules/clanCore/nixos-facter.nix':

       (stack trace truncated; use '--show-trace' to show the full, detailed trace)

       error: opening a connection to remote store 'grpc://nix-store.geninf.io:50051' previously failed
failed eval checks.x86_64-linux.yggdrasil —
error: … while evaluating the attribute 'drvPath' at «https://releases.nixos.org/nixpkgs/nixpkgs-26.11pre1079900.d54020a6ac32/nixexprs.tar.xz?na …
error:
       … while evaluating the attribute 'drvPath'
         at «https://releases.nixos.org/nixpkgs/nixpkgs-26.11pre1079900.d54020a6ac32/nixexprs.tar.xz?narHash=sha256-OjqPjipsKi79LA0IEgqlsRe2XlA4Q/6zsMKSwUfTi/8%3D»/lib/customisation.nix:416:11:
          415|         // {
          416|           drvPath =
             |           ^
          417|             assert condition;

       … while calling the 'derivationStrict' builtin
         at «nix-internal»/derivation-internal.nix:37:12:
           36|
           37|   strict = derivationStrict drvAttrs;
             |            ^
           38|

       … while evaluating the option `driverConfiguration.vlans':

       … while evaluating definitions from `/nix/store/6kx9hd4w6dvxsi401dp0jwnj8n5l9h7h-source/nixos/lib/testing/driver-configuration.nix':

       … while evaluating the option `nodes.outsider.networking.interfaces':

       … while evaluating definitions from `/nix/store/6kx9hd4w6dvxsi401dp0jwnj8n5l9h7h-source/nixos/modules/hardware/facter/networking':

       … while evaluating the option `nodes.outsider.hardware.facter.enable':

       … while evaluating the option `nodes.outsider.hardware.facter.report':

       … while evaluating the option `nodes.outsider.hardware.facter.reportPath':

       … while evaluating definitions from `/nix/store/74smld9y24m9yc7az735xzn555f6wni3-source/nixosModules/clanCore/nixos-facter.nix':

       (stack trace truncated; use '--show-trace' to show the full, detailed trace)

       error: opening a connection to remote store 'grpc://nix-store.geninf.io:50051' previously failed
failed eval checks.x86_64-linux.zerotier —
error: … while evaluating the attribute 'drvPath' at «https://releases.nixos.org/nixpkgs/nixpkgs-26.11pre1079900.d54020a6ac32/nixexprs.tar.xz?na …
error:
       … while evaluating the attribute 'drvPath'
         at «https://releases.nixos.org/nixpkgs/nixpkgs-26.11pre1079900.d54020a6ac32/nixexprs.tar.xz?narHash=sha256-OjqPjipsKi79LA0IEgqlsRe2XlA4Q/6zsMKSwUfTi/8%3D»/lib/customisation.nix:416:11:
          415|         // {
          416|           drvPath =
             |           ^
          417|             assert condition;

       … while calling the 'derivationStrict' builtin
         at «nix-internal»/derivation-internal.nix:37:12:
           36|
           37|   strict = derivationStrict drvAttrs;
             |            ^
           38|

       … while evaluating the option `driverConfiguration.vlans':

       … while evaluating definitions from `/nix/store/6kx9hd4w6dvxsi401dp0jwnj8n5l9h7h-source/nixos/lib/testing/driver-configuration.nix':

       … while evaluating the option `nodes.controller.networking.interfaces':

       … while evaluating definitions from `/nix/store/6kx9hd4w6dvxsi401dp0jwnj8n5l9h7h-source/nixos/modules/hardware/facter/networking':

       … while evaluating the option `nodes.controller.hardware.facter.enable':

       … while evaluating the option `nodes.controller.hardware.facter.report':

       … while evaluating the option `nodes.controller.hardware.facter.reportPath':

       … while evaluating definitions from `/nix/store/74smld9y24m9yc7az735xzn555f6wni3-source/nixosModules/clanCore/nixos-facter.nix':

       (stack trace truncated; use '--show-trace' to show the full, detailed trace)

       error: cannot open connection to remote store 'grpc://nix-store.geninf.io:50051': error: Nix daemon disconnected unexpectedly (maybe it crashed?)
failed eval checks.x86_64-linux.zerotier-multi-instance —
error: … while evaluating the attribute 'drvPath' at «https://releases.nixos.org/nixpkgs/nixpkgs-26.11pre1079900.d54020a6ac32/nixexprs.tar.xz?na …
error:
       … while evaluating the attribute 'drvPath'
         at «https://releases.nixos.org/nixpkgs/nixpkgs-26.11pre1079900.d54020a6ac32/nixexprs.tar.xz?narHash=sha256-OjqPjipsKi79LA0IEgqlsRe2XlA4Q/6zsMKSwUfTi/8%3D»/lib/customisation.nix:416:11:
          415|         // {
          416|           drvPath =
             |           ^
          417|             assert condition;

       … while calling the 'derivationStrict' builtin
         at «nix-internal»/derivation-internal.nix:37:12:
           36|
           37|   strict = derivationStrict drvAttrs;
             |            ^
           38|

       … while evaluating the option `driverConfiguration.vlans':

       … while evaluating definitions from `/nix/store/6kx9hd4w6dvxsi401dp0jwnj8n5l9h7h-source/nixos/lib/testing/driver-configuration.nix':

       … while evaluating the option `nodes.alpha.networking.interfaces':

       … while evaluating definitions from `/nix/store/6kx9hd4w6dvxsi401dp0jwnj8n5l9h7h-source/nixos/modules/hardware/facter/networking':

       … while evaluating the option `nodes.alpha.hardware.facter.enable':

       … while evaluating the option `nodes.alpha.hardware.facter.report':

       … while evaluating the option `nodes.alpha.hardware.facter.reportPath':

       … while evaluating definitions from `/nix/store/74smld9y24m9yc7az735xzn555f6wni3-source/nixosModules/clanCore/nixos-facter.nix':

       (stack trace truncated; use '--show-trace' to show the full, detailed trace)

       error: opening a connection to remote store 'grpc://nix-store.geninf.io:50051' previously failed
29 succeeded ⚠ 1
succeeded attributes
status attribute duration
succeeded checks.aarch64-linux.all-packages
  • stdenv.isDarwin is deprecated, use stdenv.hostPlatform.isDarwin instead
11m 54s
succeeded checks.aarch64-darwin.treefmt 1m 21s
succeeded checks.aarch64-linux.clan-pytest-with-core 10m 17s
succeeded checks.aarch64-linux.clan-pytest-without-core 7m 46s
succeeded checks.aarch64-linux.clan-site-lint 9m 10s
succeeded checks.aarch64-linux.clan-test-iso 16m 47s
succeeded checks.aarch64-linux.devshell 52s
succeeded checks.aarch64-linux.devShell-clan-cli 7m 45s
succeeded checks.aarch64-linux.devShell-clan-site 7m 46s
succeeded checks.aarch64-linux.devShell-default 7m 44s
succeeded checks.aarch64-linux.devShell-docs 6m 34s
succeeded checks.aarch64-linux.devShell-inventory-schema 7m 47s
succeeded checks.aarch64-linux.eval-tests 14m 38s
succeeded checks.aarch64-linux.nixos-test-age-backend 2m 12s
succeeded checks.aarch64-linux.nixos-test-container 1m 57s
succeeded checks.aarch64-linux.nixos-test-extra-python-packages 1m 45s
succeeded checks.aarch64-linux.nixos-test-secrets 2m 10s
succeeded checks.aarch64-linux.nixos-test-user-firewall-iptables 2m 3s
succeeded checks.aarch64-linux.nixos-test-user-firewall-nftables 1m 48s
succeeded checks.aarch64-linux.nixos-test-wayland-proxy-virtwl 2m 18s
succeeded checks.aarch64-linux.treefmt 57s
succeeded checks.x86_64-linux.nixos-test-age-backend 1m 3s
succeeded checks.x86_64-linux.nixos-test-container 51s
succeeded checks.x86_64-linux.nixos-test-extra-python-packages 51s
succeeded checks.x86_64-linux.nixos-test-secrets 1m 5s
succeeded checks.x86_64-linux.nixos-test-user-firewall-iptables 52s
succeeded checks.x86_64-linux.nixos-test-user-firewall-nftables 53s
succeeded checks.x86_64-linux.nixos-test-wayland-proxy-virtwl 1m 4s
succeeded checks.x86_64-linux.treefmt 24s
18 already built
skipped attributes
status attribute duration
loading…