nixbot

builds

clan/clan-core build #783 failed

branch main · PR #8136 · commit 14fef36177 · · took 3h 0m · eval 36s

eval warnings 5 kinds · 162 occurrences
  • error gRPC Connect on 'nix-store.geninf.io:50051' failed: role 'write' may not call Connect ×24
  • error ×68
  • error cannot open connection to remote store 'grpc://nix-store.geninf.io:50051': error: Nix daemon disconnected unexpectedly (maybe it crashed?) ×24
  • error opening a connection to remote store 'grpc://nix-store.geninf.io:50051' previously failed ×44
  • warn stdenv.isDarwin is deprecated, use stdenv.hostPlatform.isDarwin instead ×2

80 failed
failed attributes
status attribute duration
failed checks.aarch64-darwin.all-packages 3h 0m
setup: don't know how to build these paths: /nix/store/vh3szqwhd1gqa7z70m6cyckp3rbwrs6a-all-packages.drv warning: ignoring the client-specified setting 'store …
setup:
don't know how to build these paths:
  /nix/store/vh3szqwhd1gqa7z70m6cyckp3rbwrs6a-all-packages.drv
warning: ignoring the client-specified setting 'store', because it is a restricted setting and you are not a trusted user
paj4ihg1z5iay93mj80rndq162nl7pzy-clan-runtime.drv: build02: not scheduled here: paj4ihg1z5iay93mj80rndq162nl7pzy-clan-runtime.drv, asking the scheduler again
jz7idi137h44538hhmwx0vihjfa148h5-clan-core-flake.drv: build02: not scheduled here: jz7idi137h44538hhmwx0vihjfa148h5-clan-core-flake.drv, asking the scheduler again
failed checks.aarch64-darwin.clan-pytest-with-core 3h 0m
setup: don't know how to build these paths: /nix/store/yhfqlwimb5b6q364ymd1flr6a8a3va87-clan-pytest-with-core.drv warning: ignoring the client-specified setti …
setup:
don't know how to build these paths:
  /nix/store/yhfqlwimb5b6q364ymd1flr6a8a3va87-clan-pytest-with-core.drv
warning: ignoring the client-specified setting 'store', because it is a restricted setting and you are not a trusted user
rjm1mnf633k3b34xx7ws5bgjvl1903a7-clan-core-flake.drv: build02: not scheduled here: rjm1mnf633k3b34xx7ws5bgjvl1903a7-clan-core-flake.drv, asking the scheduler again
failed checks.aarch64-darwin.clan-pytest-without-core 3h 0m
setup: don't know how to build these paths: /nix/store/l8v6gvgk2zcw8zk5rprgw028bp9r7ggv-clan-pytest-without-core.drv warning: ignoring the client-specified se …
setup:
don't know how to build these paths:
  /nix/store/l8v6gvgk2zcw8zk5rprgw028bp9r7ggv-clan-pytest-without-core.drv
warning: ignoring the client-specified setting 'store', because it is a restricted setting and you are not a trusted user
failed checks.aarch64-darwin.darwin-test-darwin-machine 3h 0m
setup: don't know how to build these paths: /nix/store/fn8mxjn6jf2d0kn8h4q1bbnj7wan2wmc-darwin-system-26.11.4cff07d.drv warning: ignoring the client-specified …
setup:
don't know how to build these paths:
  /nix/store/fn8mxjn6jf2d0kn8h4q1bbnj7wan2wmc-darwin-system-26.11.4cff07d.drv
warning: ignoring the client-specified setting 'store', because it is a restricted setting and you are not a trusted user
dependency failed checks.aarch64-darwin.devshell —
failed checks.aarch64-darwin.devShell-clan-cli 3h 0m
setup: don't know how to build these paths: /nix/store/ay3sxnn5xprl9il4sr2pvjabnsnajgg2-clan-cli.drv warning: ignoring the client-specified setting 'store', b …
setup:
don't know how to build these paths:
  /nix/store/ay3sxnn5xprl9il4sr2pvjabnsnajgg2-clan-cli.drv
warning: ignoring the client-specified setting 'store', because it is a restricted setting and you are not a trusted user
failed checks.aarch64-darwin.devShell-clan-site 3h 0m
setup: don't know how to build these paths: /nix/store/cl3m2zhfnc8k1nci7k9vvs5ir4wmy1fj-nix-shell.drv warning: ignoring the client-specified setting 'store', …
setup:
don't know how to build these paths:
  /nix/store/cl3m2zhfnc8k1nci7k9vvs5ir4wmy1fj-nix-shell.drv
warning: ignoring the client-specified setting 'store', because it is a restricted setting and you are not a trusted user
failed checks.aarch64-darwin.devShell-default 3h 0m
setup: don't know how to build these paths: /nix/store/yf3r2wcj6zapyqlsnjnwb6cabb6ncxcb-clan.drv warning: ignoring the client-specified setting 'store', becau …
setup:
don't know how to build these paths:
  /nix/store/yf3r2wcj6zapyqlsnjnwb6cabb6ncxcb-clan.drv
warning: ignoring the client-specified setting 'store', because it is a restricted setting and you are not a trusted user
failed checks.aarch64-darwin.devShell-inventory-schema 3h 0m
setup: don't know how to build these paths: /nix/store/19bhxf9lbv0zbwc9w3hs1jykdayzdj20-clan-inventory-schema.drv warning: ignoring the client-specified setti …
setup:
don't know how to build these paths:
  /nix/store/19bhxf9lbv0zbwc9w3hs1jykdayzdj20-clan-inventory-schema.drv
warning: ignoring the client-specified setting 'store', because it is a restricted setting and you are not a trusted user
failed checks.aarch64-darwin.eval-tests 3h 0m
setup: don't know how to build these paths: /nix/store/jkngv8cvdcmc483jy0qi05sswcwvq37x-eval-tests-aarch64-darwin.drv warning: ignoring the client-specified s …
setup:
don't know how to build these paths:
  /nix/store/jkngv8cvdcmc483jy0qi05sswcwvq37x-eval-tests-aarch64-darwin.drv
warning: ignoring the client-specified setting 'store', because it is a restricted setting and you are not a trusted user
failed eval checks.aarch64-linux.admin —
error: … while evaluating the attribute 'drvPath' at «https://releases.nixos.org/nixpkgs/nixpkgs-26.11pre1080018.74435dcdae84/nixexprs.tar.xz?na …
error:
       … while evaluating the attribute 'drvPath'
         at «https://releases.nixos.org/nixpkgs/nixpkgs-26.11pre1080018.74435dcdae84/nixexprs.tar.xz?narHash=sha256-jeK2GCq4qI7IEHzPPjVKu/6A6A1KtrDCmRHubVOva3Y%3D»/lib/customisation.nix:416:11:
          415|         // {
          416|           drvPath =
             |           ^
          417|             assert condition;

       … while calling the 'derivationStrict' builtin
         at «nix-internal»/derivation-internal.nix:37:12:
           36|
           37|   strict = derivationStrict drvAttrs;
             |            ^
           38|

       … while evaluating the option `driverConfiguration.vlans':

       … while evaluating definitions from `/nix/store/l8kkq7bs1z6573zhjmvp3i95va6dckvv-source/nixos/lib/testing/driver-configuration.nix':

       … while evaluating the option `containers.client.networking.interfaces':

       … while evaluating definitions from `/nix/store/l8kkq7bs1z6573zhjmvp3i95va6dckvv-source/nixos/modules/hardware/facter/networking':

       … while evaluating the option `containers.client.hardware.facter.enable':

       … while evaluating the option `containers.client.hardware.facter.report':

       … while evaluating the option `containers.client.hardware.facter.reportPath':

       … while evaluating definitions from `/nix/store/09vi3r2iqhksnqjiw1z9d9yv3v6adbzi-source/nixosModules/clanCore/nixos-facter.nix':

       (stack trace truncated; use '--show-trace' to show the full, detailed trace)

       error: cannot open connection to remote store 'grpc://nix-store.geninf.io:50051': error: Nix daemon disconnected unexpectedly (maybe it crashed?)
failed eval checks.aarch64-linux.borgbackup —
error: … while evaluating the attribute 'drvPath' at «https://releases.nixos.org/nixpkgs/nixpkgs-26.11pre1080018.74435dcdae84/nixexprs.tar.xz?na …
error:
       … while evaluating the attribute 'drvPath'
         at «https://releases.nixos.org/nixpkgs/nixpkgs-26.11pre1080018.74435dcdae84/nixexprs.tar.xz?narHash=sha256-jeK2GCq4qI7IEHzPPjVKu/6A6A1KtrDCmRHubVOva3Y%3D»/lib/customisation.nix:416:11:
          415|         // {
          416|           drvPath =
             |           ^
          417|             assert condition;

       … while calling the 'derivationStrict' builtin
         at «nix-internal»/derivation-internal.nix:37:12:
           36|
           37|   strict = derivationStrict drvAttrs;
             |            ^
           38|

       … while evaluating the option `driverConfiguration.vlans':

       … while evaluating definitions from `/nix/store/l8kkq7bs1z6573zhjmvp3i95va6dckvv-source/nixos/lib/testing/driver-configuration.nix':

       … while evaluating the option `containers.clientone.networking.interfaces':

       … while evaluating definitions from `/nix/store/l8kkq7bs1z6573zhjmvp3i95va6dckvv-source/nixos/modules/hardware/facter/networking':

       … while evaluating the option `containers.clientone.hardware.facter.enable':

       … while evaluating the option `containers.clientone.hardware.facter.report':

       … while evaluating the option `containers.clientone.hardware.facter.reportPath':

       … while evaluating definitions from `/nix/store/09vi3r2iqhksnqjiw1z9d9yv3v6adbzi-source/nixosModules/clanCore/nixos-facter.nix':

       (stack trace truncated; use '--show-trace' to show the full, detailed trace)

       error: cannot open connection to remote store 'grpc://nix-store.geninf.io:50051': error: Nix daemon disconnected unexpectedly (maybe it crashed?)
failed eval checks.aarch64-linux.certificates —
error: … while evaluating the attribute 'drvPath' at «https://releases.nixos.org/nixpkgs/nixpkgs-26.11pre1080018.74435dcdae84/nixexprs.tar.xz?na …
error:
       … while evaluating the attribute 'drvPath'
         at «https://releases.nixos.org/nixpkgs/nixpkgs-26.11pre1080018.74435dcdae84/nixexprs.tar.xz?narHash=sha256-jeK2GCq4qI7IEHzPPjVKu/6A6A1KtrDCmRHubVOva3Y%3D»/lib/customisation.nix:416:11:
          415|         // {
          416|           drvPath =
             |           ^
          417|             assert condition;

       … while calling the 'derivationStrict' builtin
         at «nix-internal»/derivation-internal.nix:37:12:
           36|
           37|   strict = derivationStrict drvAttrs;
             |            ^
           38|

       … while evaluating the option `driverConfiguration.vlans':

       … while evaluating definitions from `/nix/store/l8kkq7bs1z6573zhjmvp3i95va6dckvv-source/nixos/lib/testing/driver-configuration.nix':

       … while evaluating the option `containers.ca.networking.interfaces':

       … while evaluating definitions from `/nix/store/l8kkq7bs1z6573zhjmvp3i95va6dckvv-source/nixos/modules/hardware/facter/networking':

       … while evaluating the option `containers.ca.hardware.facter.enable':

       … while evaluating the option `containers.ca.hardware.facter.report':

       … while evaluating the option `containers.ca.hardware.facter.reportPath':

       … while evaluating definitions from `/nix/store/09vi3r2iqhksnqjiw1z9d9yv3v6adbzi-source/nixosModules/clanCore/nixos-facter.nix':

       (stack trace truncated; use '--show-trace' to show the full, detailed trace)

       error: cannot open connection to remote store 'grpc://nix-store.geninf.io:50051': error: Nix daemon disconnected unexpectedly (maybe it crashed?)
failed checks.aarch64-linux.darwin-test-darwin-machine 3h 0m
setup: don't know how to build these paths: /nix/store/fn8mxjn6jf2d0kn8h4q1bbnj7wan2wmc-darwin-system-26.11.4cff07d.drv warning: ignoring the client-specified …
setup:
don't know how to build these paths:
  /nix/store/fn8mxjn6jf2d0kn8h4q1bbnj7wan2wmc-darwin-system-26.11.4cff07d.drv
warning: ignoring the client-specified setting 'store', because it is a restricted setting and you are not a trusted user
failed eval checks.aarch64-linux.data-mesher —
error: … while evaluating the attribute 'drvPath' at «https://releases.nixos.org/nixpkgs/nixpkgs-26.11pre1080018.74435dcdae84/nixexprs.tar.xz?na …
error:
       … while evaluating the attribute 'drvPath'
         at «https://releases.nixos.org/nixpkgs/nixpkgs-26.11pre1080018.74435dcdae84/nixexprs.tar.xz?narHash=sha256-jeK2GCq4qI7IEHzPPjVKu/6A6A1KtrDCmRHubVOva3Y%3D»/lib/customisation.nix:416:11:
          415|         // {
          416|           drvPath =
             |           ^
          417|             assert condition;

       … while calling the 'derivationStrict' builtin
         at «nix-internal»/derivation-internal.nix:37:12:
           36|
           37|   strict = derivationStrict drvAttrs;
             |            ^
           38|

       … while evaluating the option `driverConfiguration.vlans':

       … while evaluating definitions from `/nix/store/l8kkq7bs1z6573zhjmvp3i95va6dckvv-source/nixos/lib/testing/driver-configuration.nix':

       … while evaluating the option `containers.alpha.networking.interfaces':

       … while evaluating definitions from `/nix/store/l8kkq7bs1z6573zhjmvp3i95va6dckvv-source/nixos/modules/hardware/facter/networking':

       … while evaluating the option `containers.alpha.hardware.facter.enable':

       … while evaluating the option `containers.alpha.hardware.facter.report':

       … while evaluating the option `containers.alpha.hardware.facter.reportPath':

       … while evaluating definitions from `/nix/store/09vi3r2iqhksnqjiw1z9d9yv3v6adbzi-source/nixosModules/clanCore/nixos-facter.nix':

       (stack trace truncated; use '--show-trace' to show the full, detailed trace)

       error: opening a connection to remote store 'grpc://nix-store.geninf.io:50051' previously failed
failed eval checks.aarch64-linux.dm-dns —
error: … while evaluating the attribute 'drvPath' at «https://releases.nixos.org/nixpkgs/nixpkgs-26.11pre1080018.74435dcdae84/nixexprs.tar.xz?na …
error:
       … while evaluating the attribute 'drvPath'
         at «https://releases.nixos.org/nixpkgs/nixpkgs-26.11pre1080018.74435dcdae84/nixexprs.tar.xz?narHash=sha256-jeK2GCq4qI7IEHzPPjVKu/6A6A1KtrDCmRHubVOva3Y%3D»/lib/customisation.nix:416:11:
          415|         // {
          416|           drvPath =
             |           ^
          417|             assert condition;

       … while calling the 'derivationStrict' builtin
         at «nix-internal»/derivation-internal.nix:37:12:
           36|
           37|   strict = derivationStrict drvAttrs;
             |            ^
           38|

       … while evaluating the option `driverConfiguration.vlans':

       … while evaluating definitions from `/nix/store/l8kkq7bs1z6573zhjmvp3i95va6dckvv-source/nixos/lib/testing/driver-configuration.nix':

       … while evaluating the option `containers.client.networking.interfaces':

       … while evaluating definitions from `/nix/store/l8kkq7bs1z6573zhjmvp3i95va6dckvv-source/nixos/modules/hardware/facter/networking':

       … while evaluating the option `containers.client.hardware.facter.enable':

       … while evaluating the option `containers.client.hardware.facter.report':

       … while evaluating the option `containers.client.hardware.facter.reportPath':

       … while evaluating definitions from `/nix/store/09vi3r2iqhksnqjiw1z9d9yv3v6adbzi-source/nixosModules/clanCore/nixos-facter.nix':

       (stack trace truncated; use '--show-trace' to show the full, detailed trace)

       error: cannot open connection to remote store 'grpc://nix-store.geninf.io:50051': error: Nix daemon disconnected unexpectedly (maybe it crashed?)
failed eval checks.aarch64-linux.dyndns —
error: … while evaluating the attribute 'drvPath' at «https://releases.nixos.org/nixpkgs/nixpkgs-26.11pre1080018.74435dcdae84/nixexprs.tar.xz?na …
error:
       … while evaluating the attribute 'drvPath'
         at «https://releases.nixos.org/nixpkgs/nixpkgs-26.11pre1080018.74435dcdae84/nixexprs.tar.xz?narHash=sha256-jeK2GCq4qI7IEHzPPjVKu/6A6A1KtrDCmRHubVOva3Y%3D»/lib/customisation.nix:416:11:
          415|         // {
          416|           drvPath =
             |           ^
          417|             assert condition;

       … while calling the 'derivationStrict' builtin
         at «nix-internal»/derivation-internal.nix:37:12:
           36|
           37|   strict = derivationStrict drvAttrs;
             |            ^
           38|

       … while evaluating the option `driverConfiguration.vlans':

       … while evaluating definitions from `/nix/store/l8kkq7bs1z6573zhjmvp3i95va6dckvv-source/nixos/lib/testing/driver-configuration.nix':

       … while evaluating the option `containers.server.networking.interfaces':

       … while evaluating definitions from `/nix/store/l8kkq7bs1z6573zhjmvp3i95va6dckvv-source/nixos/modules/hardware/facter/networking':

       … while evaluating the option `containers.server.hardware.facter.enable':

       … while evaluating the option `containers.server.hardware.facter.report':

       … while evaluating the option `containers.server.hardware.facter.reportPath':

       … while evaluating definitions from `/nix/store/09vi3r2iqhksnqjiw1z9d9yv3v6adbzi-source/nixosModules/clanCore/nixos-facter.nix':

       (stack trace truncated; use '--show-trace' to show the full, detailed trace)

       error: cannot open connection to remote store 'grpc://nix-store.geninf.io:50051': error: Nix daemon disconnected unexpectedly (maybe it crashed?)
failed eval checks.aarch64-linux.garage —
error: … while evaluating the attribute 'drvPath' at «https://releases.nixos.org/nixpkgs/nixpkgs-26.11pre1080018.74435dcdae84/nixexprs.tar.xz?na …
error:
       … while evaluating the attribute 'drvPath'
         at «https://releases.nixos.org/nixpkgs/nixpkgs-26.11pre1080018.74435dcdae84/nixexprs.tar.xz?narHash=sha256-jeK2GCq4qI7IEHzPPjVKu/6A6A1KtrDCmRHubVOva3Y%3D»/lib/customisation.nix:416:11:
          415|         // {
          416|           drvPath =
             |           ^
          417|             assert condition;

       … while calling the 'derivationStrict' builtin
         at «nix-internal»/derivation-internal.nix:37:12:
           36|
           37|   strict = derivationStrict drvAttrs;
             |            ^
           38|

       … while evaluating the option `driverConfiguration.vlans':

       … while evaluating definitions from `/nix/store/l8kkq7bs1z6573zhjmvp3i95va6dckvv-source/nixos/lib/testing/driver-configuration.nix':

       … while evaluating the option `containers.server.networking.interfaces':

       … while evaluating definitions from `/nix/store/l8kkq7bs1z6573zhjmvp3i95va6dckvv-source/nixos/modules/hardware/facter/networking':

       … while evaluating the option `containers.server.hardware.facter.enable':

       … while evaluating the option `containers.server.hardware.facter.report':

       … while evaluating the option `containers.server.hardware.facter.reportPath':

       … while evaluating definitions from `/nix/store/09vi3r2iqhksnqjiw1z9d9yv3v6adbzi-source/nixosModules/clanCore/nixos-facter.nix':

       (stack trace truncated; use '--show-trace' to show the full, detailed trace)

       error: cannot open connection to remote store 'grpc://nix-store.geninf.io:50051': error: Nix daemon disconnected unexpectedly (maybe it crashed?)
failed eval checks.aarch64-linux.hello-service —
error: … while evaluating the attribute 'drvPath' at «https://releases.nixos.org/nixpkgs/nixpkgs-26.11pre1080018.74435dcdae84/nixexprs.tar.xz?na …
error:
       … while evaluating the attribute 'drvPath'
         at «https://releases.nixos.org/nixpkgs/nixpkgs-26.11pre1080018.74435dcdae84/nixexprs.tar.xz?narHash=sha256-jeK2GCq4qI7IEHzPPjVKu/6A6A1KtrDCmRHubVOva3Y%3D»/lib/customisation.nix:416:11:
          415|         // {
          416|           drvPath =
             |           ^
          417|             assert condition;

       … while calling the 'derivationStrict' builtin
         at «nix-internal»/derivation-internal.nix:37:12:
           36|
           37|   strict = derivationStrict drvAttrs;
             |            ^
           38|

       … while evaluating the option `driverConfiguration.vlans':

       … while evaluating definitions from `/nix/store/l8kkq7bs1z6573zhjmvp3i95va6dckvv-source/nixos/lib/testing/driver-configuration.nix':

       … while evaluating the option `containers.peer1.networking.interfaces':

       … while evaluating definitions from `/nix/store/l8kkq7bs1z6573zhjmvp3i95va6dckvv-source/nixos/modules/hardware/facter/networking':

       … while evaluating the option `containers.peer1.hardware.facter.enable':

       … while evaluating the option `containers.peer1.hardware.facter.report':

       … while evaluating the option `containers.peer1.hardware.facter.reportPath':

       … while evaluating definitions from `/nix/store/09vi3r2iqhksnqjiw1z9d9yv3v6adbzi-source/nixosModules/clanCore/nixos-facter.nix':

       (stack trace truncated; use '--show-trace' to show the full, detailed trace)

       error: opening a connection to remote store 'grpc://nix-store.geninf.io:50051' previously failed
failed eval checks.aarch64-linux.kde —
error: … while evaluating the attribute 'drvPath' at «https://releases.nixos.org/nixpkgs/nixpkgs-26.11pre1080018.74435dcdae84/nixexprs.tar.xz?na …
error:
       … while evaluating the attribute 'drvPath'
         at «https://releases.nixos.org/nixpkgs/nixpkgs-26.11pre1080018.74435dcdae84/nixexprs.tar.xz?narHash=sha256-jeK2GCq4qI7IEHzPPjVKu/6A6A1KtrDCmRHubVOva3Y%3D»/lib/customisation.nix:416:11:
          415|         // {
          416|           drvPath =
             |           ^
          417|             assert condition;

       … while calling the 'derivationStrict' builtin
         at «nix-internal»/derivation-internal.nix:37:12:
           36|
           37|   strict = derivationStrict drvAttrs;
             |            ^
           38|

       … while evaluating the option `driverConfiguration.vlans':

       … while evaluating definitions from `/nix/store/l8kkq7bs1z6573zhjmvp3i95va6dckvv-source/nixos/lib/testing/driver-configuration.nix':

       … while evaluating the option `containers.client.networking.interfaces':

       … while evaluating definitions from `/nix/store/l8kkq7bs1z6573zhjmvp3i95va6dckvv-source/nixos/modules/hardware/facter/networking':

       … while evaluating the option `containers.client.hardware.facter.enable':

       … while evaluating the option `containers.client.hardware.facter.report':

       … while evaluating the option `containers.client.hardware.facter.reportPath':

       … while evaluating definitions from `/nix/store/09vi3r2iqhksnqjiw1z9d9yv3v6adbzi-source/nixosModules/clanCore/nixos-facter.nix':

       (stack trace truncated; use '--show-trace' to show the full, detailed trace)

       error: cannot open connection to remote store 'grpc://nix-store.geninf.io:50051': error: Nix daemon disconnected unexpectedly (maybe it crashed?)
failed eval checks.aarch64-linux.localbackup —
error: … while evaluating the attribute 'drvPath' at «https://releases.nixos.org/nixpkgs/nixpkgs-26.11pre1080018.74435dcdae84/nixexprs.tar.xz?na …
error:
       … while evaluating the attribute 'drvPath'
         at «https://releases.nixos.org/nixpkgs/nixpkgs-26.11pre1080018.74435dcdae84/nixexprs.tar.xz?narHash=sha256-jeK2GCq4qI7IEHzPPjVKu/6A6A1KtrDCmRHubVOva3Y%3D»/lib/customisation.nix:416:11:
          415|         // {
          416|           drvPath =
             |           ^
          417|             assert condition;

       … while calling the 'derivationStrict' builtin
         at «nix-internal»/derivation-internal.nix:37:12:
           36|
           37|   strict = derivationStrict drvAttrs;
             |            ^
           38|

       … while evaluating the option `driverConfiguration.vlans':

       … while evaluating definitions from `/nix/store/l8kkq7bs1z6573zhjmvp3i95va6dckvv-source/nixos/lib/testing/driver-configuration.nix':

       … while evaluating the option `containers.machine.networking.interfaces':

       … while evaluating definitions from `/nix/store/l8kkq7bs1z6573zhjmvp3i95va6dckvv-source/nixos/modules/hardware/facter/networking':

       … while evaluating the option `containers.machine.hardware.facter.enable':

       … while evaluating the option `containers.machine.hardware.facter.report':

       … while evaluating the option `containers.machine.hardware.facter.reportPath':

       … while evaluating definitions from `/nix/store/09vi3r2iqhksnqjiw1z9d9yv3v6adbzi-source/nixosModules/clanCore/nixos-facter.nix':

       (stack trace truncated; use '--show-trace' to show the full, detailed trace)

       error: cannot open connection to remote store 'grpc://nix-store.geninf.io:50051': error: Nix daemon disconnected unexpectedly (maybe it crashed?)
failed eval checks.aarch64-linux.machine-id —
error: … while evaluating the attribute 'drvPath' at «https://releases.nixos.org/nixpkgs/nixpkgs-26.11pre1080018.74435dcdae84/nixexprs.tar.xz?na …
error:
       … while evaluating the attribute 'drvPath'
         at «https://releases.nixos.org/nixpkgs/nixpkgs-26.11pre1080018.74435dcdae84/nixexprs.tar.xz?narHash=sha256-jeK2GCq4qI7IEHzPPjVKu/6A6A1KtrDCmRHubVOva3Y%3D»/lib/customisation.nix:416:11:
          415|         // {
          416|           drvPath =
             |           ^
          417|             assert condition;

       … while calling the 'derivationStrict' builtin
         at «nix-internal»/derivation-internal.nix:37:12:
           36|
           37|   strict = derivationStrict drvAttrs;
             |            ^
           38|

       … while evaluating the option `driverConfiguration.vlans':

       … while evaluating definitions from `/nix/store/l8kkq7bs1z6573zhjmvp3i95va6dckvv-source/nixos/lib/testing/driver-configuration.nix':

       … while evaluating the option `containers.server.networking.interfaces':

       … while evaluating definitions from `/nix/store/l8kkq7bs1z6573zhjmvp3i95va6dckvv-source/nixos/modules/hardware/facter/networking':

       … while evaluating the option `containers.server.hardware.facter.enable':

       … while evaluating the option `containers.server.hardware.facter.report':

       … while evaluating the option `containers.server.hardware.facter.reportPath':

       … while evaluating definitions from `/nix/store/09vi3r2iqhksnqjiw1z9d9yv3v6adbzi-source/nixosModules/clanCore/nixos-facter.nix':

       (stack trace truncated; use '--show-trace' to show the full, detailed trace)

       error: cannot open connection to remote store 'grpc://nix-store.geninf.io:50051': error: Nix daemon disconnected unexpectedly (maybe it crashed?)
failed eval checks.aarch64-linux.matrix-synapse —
error: … while evaluating the attribute 'drvPath' at «https://releases.nixos.org/nixpkgs/nixpkgs-26.11pre1080018.74435dcdae84/nixexprs.tar.xz?na …
error:
       … while evaluating the attribute 'drvPath'
         at «https://releases.nixos.org/nixpkgs/nixpkgs-26.11pre1080018.74435dcdae84/nixexprs.tar.xz?narHash=sha256-jeK2GCq4qI7IEHzPPjVKu/6A6A1KtrDCmRHubVOva3Y%3D»/lib/customisation.nix:416:11:
          415|         // {
          416|           drvPath =
             |           ^
          417|             assert condition;

       … while calling the 'derivationStrict' builtin
         at «nix-internal»/derivation-internal.nix:37:12:
           36|
           37|   strict = derivationStrict drvAttrs;
             |            ^
           38|

       … while evaluating the option `driverConfiguration.vlans':

       … while evaluating definitions from `/nix/store/l8kkq7bs1z6573zhjmvp3i95va6dckvv-source/nixos/lib/testing/driver-configuration.nix':

       … while evaluating the option `containers.machine.networking.interfaces':

       … while evaluating definitions from `/nix/store/l8kkq7bs1z6573zhjmvp3i95va6dckvv-source/nixos/modules/hardware/facter/networking':

       … while evaluating the option `containers.machine.hardware.facter.enable':

       … while evaluating the option `containers.machine.hardware.facter.report':

       … while evaluating the option `containers.machine.hardware.facter.reportPath':

       … while evaluating definitions from `/nix/store/09vi3r2iqhksnqjiw1z9d9yv3v6adbzi-source/nixosModules/clanCore/nixos-facter.nix':

       (stack trace truncated; use '--show-trace' to show the full, detailed trace)

       error: opening a connection to remote store 'grpc://nix-store.geninf.io:50051' previously failed
failed eval checks.aarch64-linux.monitoring —
error: … while evaluating the attribute 'drvPath' at «https://releases.nixos.org/nixpkgs/nixpkgs-26.11pre1080018.74435dcdae84/nixexprs.tar.xz?na …
error:
       … while evaluating the attribute 'drvPath'
         at «https://releases.nixos.org/nixpkgs/nixpkgs-26.11pre1080018.74435dcdae84/nixexprs.tar.xz?narHash=sha256-jeK2GCq4qI7IEHzPPjVKu/6A6A1KtrDCmRHubVOva3Y%3D»/lib/customisation.nix:416:11:
          415|         // {
          416|           drvPath =
             |           ^
          417|             assert condition;

       … while calling the 'derivationStrict' builtin
         at «nix-internal»/derivation-internal.nix:37:12:
           36|
           37|   strict = derivationStrict drvAttrs;
             |            ^
           38|

       … while evaluating the option `driverConfiguration.vlans':

       … while evaluating definitions from `/nix/store/l8kkq7bs1z6573zhjmvp3i95va6dckvv-source/nixos/lib/testing/driver-configuration.nix':

       … while evaluating the option `containers.machine1.networking.interfaces':

       … while evaluating definitions from `/nix/store/l8kkq7bs1z6573zhjmvp3i95va6dckvv-source/nixos/modules/hardware/facter/networking':

       … while evaluating the option `containers.machine1.hardware.facter.enable':

       … while evaluating the option `containers.machine1.hardware.facter.report':

       … while evaluating the option `containers.machine1.hardware.facter.reportPath':

       … while evaluating definitions from `/nix/store/09vi3r2iqhksnqjiw1z9d9yv3v6adbzi-source/nixosModules/clanCore/nixos-facter.nix':

       (stack trace truncated; use '--show-trace' to show the full, detailed trace)

       error: opening a connection to remote store 'grpc://nix-store.geninf.io:50051' previously failed
failed eval checks.aarch64-linux.mycelium —
error: … while evaluating the attribute 'drvPath' at «https://releases.nixos.org/nixpkgs/nixpkgs-26.11pre1080018.74435dcdae84/nixexprs.tar.xz?na …
error:
       … while evaluating the attribute 'drvPath'
         at «https://releases.nixos.org/nixpkgs/nixpkgs-26.11pre1080018.74435dcdae84/nixexprs.tar.xz?narHash=sha256-jeK2GCq4qI7IEHzPPjVKu/6A6A1KtrDCmRHubVOva3Y%3D»/lib/customisation.nix:416:11:
          415|         // {
          416|           drvPath =
             |           ^
          417|             assert condition;

       … while calling the 'derivationStrict' builtin
         at «nix-internal»/derivation-internal.nix:37:12:
           36|
           37|   strict = derivationStrict drvAttrs;
             |            ^
           38|

       … while evaluating the option `driverConfiguration.vlans':

       … while evaluating definitions from `/nix/store/l8kkq7bs1z6573zhjmvp3i95va6dckvv-source/nixos/lib/testing/driver-configuration.nix':

       … while evaluating the option `nodes.server.networking.interfaces':

       … while evaluating definitions from `/nix/store/l8kkq7bs1z6573zhjmvp3i95va6dckvv-source/nixos/modules/hardware/facter/networking':

       … while evaluating the option `nodes.server.hardware.facter.enable':

       … while evaluating the option `nodes.server.hardware.facter.report':

       … while evaluating the option `nodes.server.hardware.facter.reportPath':

       … while evaluating definitions from `/nix/store/09vi3r2iqhksnqjiw1z9d9yv3v6adbzi-source/nixosModules/clanCore/nixos-facter.nix':

       (stack trace truncated; use '--show-trace' to show the full, detailed trace)

       error: opening a connection to remote store 'grpc://nix-store.geninf.io:50051' previously failed
failed eval checks.aarch64-linux.ncps —
error: … while evaluating the attribute 'drvPath' at «https://releases.nixos.org/nixpkgs/nixpkgs-26.11pre1080018.74435dcdae84/nixexprs.tar.xz?na …
error:
       … while evaluating the attribute 'drvPath'
         at «https://releases.nixos.org/nixpkgs/nixpkgs-26.11pre1080018.74435dcdae84/nixexprs.tar.xz?narHash=sha256-jeK2GCq4qI7IEHzPPjVKu/6A6A1KtrDCmRHubVOva3Y%3D»/lib/customisation.nix:416:11:
          415|         // {
          416|           drvPath =
             |           ^
          417|             assert condition;

       … while calling the 'derivationStrict' builtin
         at «nix-internal»/derivation-internal.nix:37:12:
           36|
           37|   strict = derivationStrict drvAttrs;
             |            ^
           38|

       … while evaluating the option `driverConfiguration.vlans':

       … while evaluating definitions from `/nix/store/l8kkq7bs1z6573zhjmvp3i95va6dckvv-source/nixos/lib/testing/driver-configuration.nix':

       … while evaluating the option `nodes.alice.networking.interfaces':

       … while evaluating definitions from `/nix/store/l8kkq7bs1z6573zhjmvp3i95va6dckvv-source/nixos/modules/hardware/facter/networking':

       … while evaluating the option `nodes.alice.hardware.facter.enable':

       … while evaluating the option `nodes.alice.hardware.facter.report':

       … while evaluating the option `nodes.alice.hardware.facter.reportPath':

       … while evaluating definitions from `/nix/store/09vi3r2iqhksnqjiw1z9d9yv3v6adbzi-source/nixosModules/clanCore/nixos-facter.nix':

       (stack trace truncated; use '--show-trace' to show the full, detailed trace)

       error: opening a connection to remote store 'grpc://nix-store.geninf.io:50051' previously failed
failed eval checks.aarch64-linux.nixos-test-password-store-mounts —
error: … while evaluating the attribute 'drvPath' at «https://releases.nixos.org/nixpkgs/nixpkgs-26.11pre1080018.74435dcdae84/nixexprs.tar.xz?na …
error:
       … while evaluating the attribute 'drvPath'
         at «https://releases.nixos.org/nixpkgs/nixpkgs-26.11pre1080018.74435dcdae84/nixexprs.tar.xz?narHash=sha256-jeK2GCq4qI7IEHzPPjVKu/6A6A1KtrDCmRHubVOva3Y%3D»/lib/customisation.nix:416:11:
          415|         // {
          416|           drvPath =
             |           ^
          417|             assert condition;

       … while calling the 'derivationStrict' builtin
         at «nix-internal»/derivation-internal.nix:37:12:
           36|
           37|   strict = derivationStrict drvAttrs;
             |            ^
           38|

       … while evaluating the option `driverConfiguration.vlans':

       … while evaluating definitions from `/nix/store/l8kkq7bs1z6573zhjmvp3i95va6dckvv-source/nixos/lib/testing/driver-configuration.nix':

       … while evaluating the option `nodes.machine.networking.interfaces':

       … while evaluating definitions from `/nix/store/l8kkq7bs1z6573zhjmvp3i95va6dckvv-source/nixos/modules/hardware/facter/networking':

       … while evaluating the option `nodes.machine.hardware.facter.enable':

       … while evaluating the option `nodes.machine.hardware.facter.report':

       … while evaluating the option `nodes.machine.hardware.facter.reportPath':

       … while evaluating definitions from `/nix/store/09vi3r2iqhksnqjiw1z9d9yv3v6adbzi-source/nixosModules/clanCore/nixos-facter.nix':

       (stack trace truncated; use '--show-trace' to show the full, detailed trace)

       error: opening a connection to remote store 'grpc://nix-store.geninf.io:50051' previously failed
failed eval checks.aarch64-linux.p2p-ssh-iroh —
error: … while evaluating the attribute 'drvPath' at «https://releases.nixos.org/nixpkgs/nixpkgs-26.11pre1080018.74435dcdae84/nixexprs.tar.xz?na …
error:
       … while evaluating the attribute 'drvPath'
         at «https://releases.nixos.org/nixpkgs/nixpkgs-26.11pre1080018.74435dcdae84/nixexprs.tar.xz?narHash=sha256-jeK2GCq4qI7IEHzPPjVKu/6A6A1KtrDCmRHubVOva3Y%3D»/lib/customisation.nix:416:11:
          415|         // {
          416|           drvPath =
             |           ^
          417|             assert condition;

       … while calling the 'derivationStrict' builtin
         at «nix-internal»/derivation-internal.nix:37:12:
           36|
           37|   strict = derivationStrict drvAttrs;
             |            ^
           38|

       … while evaluating the option `driverConfiguration.vlans':

       … while evaluating definitions from `/nix/store/l8kkq7bs1z6573zhjmvp3i95va6dckvv-source/nixos/lib/testing/driver-configuration.nix':

       … while evaluating the option `containers.client.networking.interfaces':

       … while evaluating definitions from `/nix/store/l8kkq7bs1z6573zhjmvp3i95va6dckvv-source/nixos/modules/hardware/facter/networking':

       … while evaluating the option `containers.client.hardware.facter.enable':

       … while evaluating the option `containers.client.hardware.facter.report':

       … while evaluating the option `containers.client.hardware.facter.reportPath':

       … while evaluating definitions from `/nix/store/09vi3r2iqhksnqjiw1z9d9yv3v6adbzi-source/nixosModules/clanCore/nixos-facter.nix':

       (stack trace truncated; use '--show-trace' to show the full, detailed trace)

       error: opening a connection to remote store 'grpc://nix-store.geninf.io:50051' previously failed
failed eval checks.aarch64-linux.packages —
error: … while evaluating the attribute 'drvPath' at «https://releases.nixos.org/nixpkgs/nixpkgs-26.11pre1080018.74435dcdae84/nixexprs.tar.xz?na …
error:
       … while evaluating the attribute 'drvPath'
         at «https://releases.nixos.org/nixpkgs/nixpkgs-26.11pre1080018.74435dcdae84/nixexprs.tar.xz?narHash=sha256-jeK2GCq4qI7IEHzPPjVKu/6A6A1KtrDCmRHubVOva3Y%3D»/lib/customisation.nix:416:11:
          415|         // {
          416|           drvPath =
             |           ^
          417|             assert condition;

       … while calling the 'derivationStrict' builtin
         at «nix-internal»/derivation-internal.nix:37:12:
           36|
           37|   strict = derivationStrict drvAttrs;
             |            ^
           38|

       … while evaluating the option `driverConfiguration.vlans':

       … while evaluating definitions from `/nix/store/l8kkq7bs1z6573zhjmvp3i95va6dckvv-source/nixos/lib/testing/driver-configuration.nix':

       … while evaluating the option `containers.server.networking.interfaces':

       … while evaluating definitions from `/nix/store/l8kkq7bs1z6573zhjmvp3i95va6dckvv-source/nixos/modules/hardware/facter/networking':

       … while evaluating the option `containers.server.hardware.facter.enable':

       … while evaluating the option `containers.server.hardware.facter.report':

       … while evaluating the option `containers.server.hardware.facter.reportPath':

       … while evaluating definitions from `/nix/store/09vi3r2iqhksnqjiw1z9d9yv3v6adbzi-source/nixosModules/clanCore/nixos-facter.nix':

       (stack trace truncated; use '--show-trace' to show the full, detailed trace)

       error: cannot open connection to remote store 'grpc://nix-store.geninf.io:50051': error: Nix daemon disconnected unexpectedly (maybe it crashed?)
failed eval checks.aarch64-linux.pki —
error: … while evaluating the attribute 'drvPath' at «https://releases.nixos.org/nixpkgs/nixpkgs-26.11pre1080018.74435dcdae84/nixexprs.tar.xz?na …
error:
       … while evaluating the attribute 'drvPath'
         at «https://releases.nixos.org/nixpkgs/nixpkgs-26.11pre1080018.74435dcdae84/nixexprs.tar.xz?narHash=sha256-jeK2GCq4qI7IEHzPPjVKu/6A6A1KtrDCmRHubVOva3Y%3D»/lib/customisation.nix:416:11:
          415|         // {
          416|           drvPath =
             |           ^
          417|             assert condition;

       … while calling the 'derivationStrict' builtin
         at «nix-internal»/derivation-internal.nix:37:12:
           36|
           37|   strict = derivationStrict drvAttrs;
             |            ^
           38|

       … while evaluating the option `driverConfiguration.vlans':

       … while evaluating definitions from `/nix/store/l8kkq7bs1z6573zhjmvp3i95va6dckvv-source/nixos/lib/testing/driver-configuration.nix':

       … while evaluating the option `nodes.caddy.networking.interfaces':

       … while evaluating definitions from `/nix/store/l8kkq7bs1z6573zhjmvp3i95va6dckvv-source/nixos/modules/hardware/facter/networking':

       … while evaluating the option `nodes.caddy.hardware.facter.enable':

       … while evaluating the option `nodes.caddy.hardware.facter.report':

       … while evaluating the option `nodes.caddy.hardware.facter.reportPath':

       … while evaluating definitions from `/nix/store/09vi3r2iqhksnqjiw1z9d9yv3v6adbzi-source/nixosModules/clanCore/nixos-facter.nix':

       (stack trace truncated; use '--show-trace' to show the full, detailed trace)

       error: cannot open connection to remote store 'grpc://nix-store.geninf.io:50051': error: Nix daemon disconnected unexpectedly (maybe it crashed?)
failed eval checks.aarch64-linux.postgresql —
error: … while evaluating the attribute 'drvPath' at «https://releases.nixos.org/nixpkgs/nixpkgs-26.11pre1080018.74435dcdae84/nixexprs.tar.xz?na …
error:
       … while evaluating the attribute 'drvPath'
         at «https://releases.nixos.org/nixpkgs/nixpkgs-26.11pre1080018.74435dcdae84/nixexprs.tar.xz?narHash=sha256-jeK2GCq4qI7IEHzPPjVKu/6A6A1KtrDCmRHubVOva3Y%3D»/lib/customisation.nix:416:11:
          415|         // {
          416|           drvPath =
             |           ^
          417|             assert condition;

       … while calling the 'derivationStrict' builtin
         at «nix-internal»/derivation-internal.nix:37:12:
           36|
           37|   strict = derivationStrict drvAttrs;
             |            ^
           38|

       … while evaluating the option `driverConfiguration.vlans':

       … while evaluating definitions from `/nix/store/l8kkq7bs1z6573zhjmvp3i95va6dckvv-source/nixos/lib/testing/driver-configuration.nix':

       … while evaluating the option `containers.machine.networking.interfaces':

       … while evaluating definitions from `/nix/store/l8kkq7bs1z6573zhjmvp3i95va6dckvv-source/nixos/modules/hardware/facter/networking':

       … while evaluating the option `containers.machine.hardware.facter.enable':

       … while evaluating the option `containers.machine.hardware.facter.report':

       … while evaluating the option `containers.machine.hardware.facter.reportPath':

       … while evaluating definitions from `/nix/store/09vi3r2iqhksnqjiw1z9d9yv3v6adbzi-source/nixosModules/clanCore/nixos-facter.nix':

       (stack trace truncated; use '--show-trace' to show the full, detailed trace)

       error: opening a connection to remote store 'grpc://nix-store.geninf.io:50051' previously failed
failed eval checks.aarch64-linux.service-dummy-test —
error: … while evaluating the attribute 'drvPath' at «https://releases.nixos.org/nixpkgs/nixpkgs-26.11pre1080018.74435dcdae84/nixexprs.tar.xz?na …
error:
       … while evaluating the attribute 'drvPath'
         at «https://releases.nixos.org/nixpkgs/nixpkgs-26.11pre1080018.74435dcdae84/nixexprs.tar.xz?narHash=sha256-jeK2GCq4qI7IEHzPPjVKu/6A6A1KtrDCmRHubVOva3Y%3D»/lib/customisation.nix:416:11:
          415|         // {
          416|           drvPath =
             |           ^
          417|             assert condition;

       … while calling the 'derivationStrict' builtin
         at «nix-internal»/derivation-internal.nix:37:12:
           36|
           37|   strict = derivationStrict drvAttrs;
             |            ^
           38|

       … while evaluating the option `driverConfiguration.vlans':

       … while evaluating definitions from `/nix/store/l8kkq7bs1z6573zhjmvp3i95va6dckvv-source/nixos/lib/testing/driver-configuration.nix':

       … while evaluating the option `containers.admin1.networking.interfaces':

       … while evaluating definitions from `/nix/store/l8kkq7bs1z6573zhjmvp3i95va6dckvv-source/nixos/modules/hardware/facter/networking':

       … while evaluating the option `containers.admin1.hardware.facter.enable':

       … while evaluating the option `containers.admin1.hardware.facter.report':

       … while evaluating the option `containers.admin1.hardware.facter.reportPath':

       … while evaluating definitions from `/nix/store/09vi3r2iqhksnqjiw1z9d9yv3v6adbzi-source/nixosModules/clanCore/nixos-facter.nix':

       (stack trace truncated; use '--show-trace' to show the full, detailed trace)

       error: opening a connection to remote store 'grpc://nix-store.geninf.io:50051' previously failed
failed eval checks.aarch64-linux.service-dummy-test-from-flake —
error: … while evaluating the attribute 'drvPath' at «https://releases.nixos.org/nixpkgs/nixpkgs-26.11pre1080018.74435dcdae84/nixexprs.tar.xz?na …
error:
       … while evaluating the attribute 'drvPath'
         at «https://releases.nixos.org/nixpkgs/nixpkgs-26.11pre1080018.74435dcdae84/nixexprs.tar.xz?narHash=sha256-jeK2GCq4qI7IEHzPPjVKu/6A6A1KtrDCmRHubVOva3Y%3D»/lib/customisation.nix:416:11:
          415|         // {
          416|           drvPath =
             |           ^
          417|             assert condition;

       … while calling the 'derivationStrict' builtin
         at «nix-internal»/derivation-internal.nix:37:12:
           36|
           37|   strict = derivationStrict drvAttrs;
             |            ^
           38|

       … while evaluating the option `driverConfiguration.vlans':

       … while evaluating definitions from `/nix/store/l8kkq7bs1z6573zhjmvp3i95va6dckvv-source/nixos/lib/testing/driver-configuration.nix':

       … while evaluating the option `containers.admin1.networking.interfaces':

       … while evaluating definitions from `/nix/store/l8kkq7bs1z6573zhjmvp3i95va6dckvv-source/nixos/modules/hardware/facter/networking':

       … while evaluating the option `containers.admin1.hardware.facter.enable':

       … while evaluating the option `containers.admin1.hardware.facter.report':

       … while evaluating the option `containers.admin1.hardware.facter.reportPath':

       … while evaluating definitions from `/nix/store/09vi3r2iqhksnqjiw1z9d9yv3v6adbzi-source/nixosModules/clanCore/nixos-facter.nix':

       (stack trace truncated; use '--show-trace' to show the full, detailed trace)

       error: opening a connection to remote store 'grpc://nix-store.geninf.io:50051' previously failed
failed eval checks.aarch64-linux.sshd —
error: … while evaluating the attribute 'drvPath' at «https://releases.nixos.org/nixpkgs/nixpkgs-26.11pre1080018.74435dcdae84/nixexprs.tar.xz?na …
error:
       … while evaluating the attribute 'drvPath'
         at «https://releases.nixos.org/nixpkgs/nixpkgs-26.11pre1080018.74435dcdae84/nixexprs.tar.xz?narHash=sha256-jeK2GCq4qI7IEHzPPjVKu/6A6A1KtrDCmRHubVOva3Y%3D»/lib/customisation.nix:416:11:
          415|         // {
          416|           drvPath =
             |           ^
          417|             assert condition;

       … while calling the 'derivationStrict' builtin
         at «nix-internal»/derivation-internal.nix:37:12:
           36|
           37|   strict = derivationStrict drvAttrs;
             |            ^
           38|

       … while evaluating the option `driverConfiguration.vlans':

       … while evaluating definitions from `/nix/store/l8kkq7bs1z6573zhjmvp3i95va6dckvv-source/nixos/lib/testing/driver-configuration.nix':

       … while evaluating the option `containers.client.networking.interfaces':

       … while evaluating definitions from `/nix/store/l8kkq7bs1z6573zhjmvp3i95va6dckvv-source/nixos/modules/hardware/facter/networking':

       … while evaluating the option `containers.client.hardware.facter.enable':

       … while evaluating the option `containers.client.hardware.facter.report':

       … while evaluating the option `containers.client.hardware.facter.reportPath':

       … while evaluating definitions from `/nix/store/09vi3r2iqhksnqjiw1z9d9yv3v6adbzi-source/nixosModules/clanCore/nixos-facter.nix':

       (stack trace truncated; use '--show-trace' to show the full, detailed trace)

       error: opening a connection to remote store 'grpc://nix-store.geninf.io:50051' previously failed
failed eval checks.aarch64-linux.sshd-no-ca —
error: … while evaluating the attribute 'drvPath' at «https://releases.nixos.org/nixpkgs/nixpkgs-26.11pre1080018.74435dcdae84/nixexprs.tar.xz?na …
error:
       … while evaluating the attribute 'drvPath'
         at «https://releases.nixos.org/nixpkgs/nixpkgs-26.11pre1080018.74435dcdae84/nixexprs.tar.xz?narHash=sha256-jeK2GCq4qI7IEHzPPjVKu/6A6A1KtrDCmRHubVOva3Y%3D»/lib/customisation.nix:416:11:
          415|         // {
          416|           drvPath =
             |           ^
          417|             assert condition;

       … while calling the 'derivationStrict' builtin
         at «nix-internal»/derivation-internal.nix:37:12:
           36|
           37|   strict = derivationStrict drvAttrs;
             |            ^
           38|

       … while evaluating the option `driverConfiguration.vlans':

       … while evaluating definitions from `/nix/store/l8kkq7bs1z6573zhjmvp3i95va6dckvv-source/nixos/lib/testing/driver-configuration.nix':

       … while evaluating the option `containers.client.networking.interfaces':

       … while evaluating definitions from `/nix/store/l8kkq7bs1z6573zhjmvp3i95va6dckvv-source/nixos/modules/hardware/facter/networking':

       … while evaluating the option `containers.client.hardware.facter.enable':

       … while evaluating the option `containers.client.hardware.facter.report':

       … while evaluating the option `containers.client.hardware.facter.reportPath':

       … while evaluating definitions from `/nix/store/09vi3r2iqhksnqjiw1z9d9yv3v6adbzi-source/nixosModules/clanCore/nixos-facter.nix':

       (stack trace truncated; use '--show-trace' to show the full, detailed trace)

       error: cannot open connection to remote store 'grpc://nix-store.geninf.io:50051': error: Nix daemon disconnected unexpectedly (maybe it crashed?)
failed eval checks.aarch64-linux.state-version —
error: … while evaluating the attribute 'drvPath' at «https://releases.nixos.org/nixpkgs/nixpkgs-26.11pre1080018.74435dcdae84/nixexprs.tar.xz?na …
error:
       … while evaluating the attribute 'drvPath'
         at «https://releases.nixos.org/nixpkgs/nixpkgs-26.11pre1080018.74435dcdae84/nixexprs.tar.xz?narHash=sha256-jeK2GCq4qI7IEHzPPjVKu/6A6A1KtrDCmRHubVOva3Y%3D»/lib/customisation.nix:416:11:
          415|         // {
          416|           drvPath =
             |           ^
          417|             assert condition;

       … while calling the 'derivationStrict' builtin
         at «nix-internal»/derivation-internal.nix:37:12:
           36|
           37|   strict = derivationStrict drvAttrs;
             |            ^
           38|

       … while evaluating the option `driverConfiguration.vlans':

       … while evaluating definitions from `/nix/store/l8kkq7bs1z6573zhjmvp3i95va6dckvv-source/nixos/lib/testing/driver-configuration.nix':

       … while evaluating the option `containers.server.networking.interfaces':

       … while evaluating definitions from `/nix/store/l8kkq7bs1z6573zhjmvp3i95va6dckvv-source/nixos/modules/hardware/facter/networking':

       … while evaluating the option `containers.server.hardware.facter.enable':

       … while evaluating the option `containers.server.hardware.facter.report':

       … while evaluating the option `containers.server.hardware.facter.reportPath':

       … while evaluating definitions from `/nix/store/09vi3r2iqhksnqjiw1z9d9yv3v6adbzi-source/nixosModules/clanCore/nixos-facter.nix':

       (stack trace truncated; use '--show-trace' to show the full, detailed trace)

       error: opening a connection to remote store 'grpc://nix-store.geninf.io:50051' previously failed
failed eval checks.aarch64-linux.syncthing-service —
error: … while evaluating the attribute 'drvPath' at «https://releases.nixos.org/nixpkgs/nixpkgs-26.11pre1080018.74435dcdae84/nixexprs.tar.xz?na …
error:
       … while evaluating the attribute 'drvPath'
         at «https://releases.nixos.org/nixpkgs/nixpkgs-26.11pre1080018.74435dcdae84/nixexprs.tar.xz?narHash=sha256-jeK2GCq4qI7IEHzPPjVKu/6A6A1KtrDCmRHubVOva3Y%3D»/lib/customisation.nix:416:11:
          415|         // {
          416|           drvPath =
             |           ^
          417|             assert condition;

       … while calling the 'derivationStrict' builtin
         at «nix-internal»/derivation-internal.nix:37:12:
           36|
           37|   strict = derivationStrict drvAttrs;
             |            ^
           38|

       … while evaluating the option `driverConfiguration.vlans':

       … while evaluating definitions from `/nix/store/l8kkq7bs1z6573zhjmvp3i95va6dckvv-source/nixos/lib/testing/driver-configuration.nix':

       … while evaluating the option `containers.machine1.networking.interfaces':

       … while evaluating definitions from `/nix/store/l8kkq7bs1z6573zhjmvp3i95va6dckvv-source/nixos/modules/hardware/facter/networking':

       … while evaluating the option `containers.machine1.hardware.facter.enable':

       … while evaluating the option `containers.machine1.hardware.facter.report':

       … while evaluating the option `containers.machine1.hardware.facter.reportPath':

       … while evaluating definitions from `/nix/store/09vi3r2iqhksnqjiw1z9d9yv3v6adbzi-source/nixosModules/clanCore/nixos-facter.nix':

       (stack trace truncated; use '--show-trace' to show the full, detailed trace)

       error: opening a connection to remote store 'grpc://nix-store.geninf.io:50051' previously failed
failed eval checks.aarch64-linux.trusted-nix-caches —
error: … while evaluating the attribute 'drvPath' at «https://releases.nixos.org/nixpkgs/nixpkgs-26.11pre1080018.74435dcdae84/nixexprs.tar.xz?na …
error:
       … while evaluating the attribute 'drvPath'
         at «https://releases.nixos.org/nixpkgs/nixpkgs-26.11pre1080018.74435dcdae84/nixexprs.tar.xz?narHash=sha256-jeK2GCq4qI7IEHzPPjVKu/6A6A1KtrDCmRHubVOva3Y%3D»/lib/customisation.nix:416:11:
          415|         // {
          416|           drvPath =
             |           ^
          417|             assert condition;

       … while calling the 'derivationStrict' builtin
         at «nix-internal»/derivation-internal.nix:37:12:
           36|
           37|   strict = derivationStrict drvAttrs;
             |            ^
           38|

       … while evaluating the option `driverConfiguration.vlans':

       … while evaluating definitions from `/nix/store/l8kkq7bs1z6573zhjmvp3i95va6dckvv-source/nixos/lib/testing/driver-configuration.nix':

       … while evaluating the option `containers.server.networking.interfaces':

       … while evaluating definitions from `/nix/store/l8kkq7bs1z6573zhjmvp3i95va6dckvv-source/nixos/modules/hardware/facter/networking':

       … while evaluating the option `containers.server.hardware.facter.enable':

       … while evaluating the option `containers.server.hardware.facter.report':

       … while evaluating the option `containers.server.hardware.facter.reportPath':

       … while evaluating definitions from `/nix/store/09vi3r2iqhksnqjiw1z9d9yv3v6adbzi-source/nixosModules/clanCore/nixos-facter.nix':

       (stack trace truncated; use '--show-trace' to show the full, detailed trace)

       error: opening a connection to remote store 'grpc://nix-store.geninf.io:50051' previously failed
failed eval checks.aarch64-linux.users —
error: … while evaluating the attribute 'drvPath' at «https://releases.nixos.org/nixpkgs/nixpkgs-26.11pre1080018.74435dcdae84/nixexprs.tar.xz?na …
error:
       … while evaluating the attribute 'drvPath'
         at «https://releases.nixos.org/nixpkgs/nixpkgs-26.11pre1080018.74435dcdae84/nixexprs.tar.xz?narHash=sha256-jeK2GCq4qI7IEHzPPjVKu/6A6A1KtrDCmRHubVOva3Y%3D»/lib/customisation.nix:416:11:
          415|         // {
          416|           drvPath =
             |           ^
          417|             assert condition;

       … while calling the 'derivationStrict' builtin
         at «nix-internal»/derivation-internal.nix:37:12:
           36|
           37|   strict = derivationStrict drvAttrs;
             |            ^
           38|

       … while evaluating the option `driverConfiguration.vlans':

       … while evaluating definitions from `/nix/store/l8kkq7bs1z6573zhjmvp3i95va6dckvv-source/nixos/lib/testing/driver-configuration.nix':

       … while evaluating the option `containers.server.networking.interfaces':

       … while evaluating definitions from `/nix/store/l8kkq7bs1z6573zhjmvp3i95va6dckvv-source/nixos/modules/hardware/facter/networking':

       … while evaluating the option `containers.server.hardware.facter.enable':

       … while evaluating the option `containers.server.hardware.facter.report':

       … while evaluating the option `containers.server.hardware.facter.reportPath':

       … while evaluating definitions from `/nix/store/09vi3r2iqhksnqjiw1z9d9yv3v6adbzi-source/nixosModules/clanCore/nixos-facter.nix':

       (stack trace truncated; use '--show-trace' to show the full, detailed trace)

       error: opening a connection to remote store 'grpc://nix-store.geninf.io:50051' previously failed
failed eval checks.aarch64-linux.wifi —
error: … while evaluating the attribute 'drvPath' at «https://releases.nixos.org/nixpkgs/nixpkgs-26.11pre1080018.74435dcdae84/nixexprs.tar.xz?na …
error:
       … while evaluating the attribute 'drvPath'
         at «https://releases.nixos.org/nixpkgs/nixpkgs-26.11pre1080018.74435dcdae84/nixexprs.tar.xz?narHash=sha256-jeK2GCq4qI7IEHzPPjVKu/6A6A1KtrDCmRHubVOva3Y%3D»/lib/customisation.nix:416:11:
          415|         // {
          416|           drvPath =
             |           ^
          417|             assert condition;

       … while calling the 'derivationStrict' builtin
         at «nix-internal»/derivation-internal.nix:37:12:
           36|
           37|   strict = derivationStrict drvAttrs;
             |            ^
           38|

       … while evaluating the option `driverConfiguration.vlans':

       … while evaluating definitions from `/nix/store/l8kkq7bs1z6573zhjmvp3i95va6dckvv-source/nixos/lib/testing/driver-configuration.nix':

       … while evaluating the option `nodes.second.networking.interfaces':

       … while evaluating definitions from `/nix/store/l8kkq7bs1z6573zhjmvp3i95va6dckvv-source/nixos/modules/hardware/facter/networking':

       … while evaluating the option `nodes.second.hardware.facter.enable':

       … while evaluating the option `nodes.second.hardware.facter.report':

       … while evaluating the option `nodes.second.hardware.facter.reportPath':

       … while evaluating definitions from `/nix/store/09vi3r2iqhksnqjiw1z9d9yv3v6adbzi-source/nixosModules/clanCore/nixos-facter.nix':

       (stack trace truncated; use '--show-trace' to show the full, detailed trace)

       error: cannot open connection to remote store 'grpc://nix-store.geninf.io:50051': error: Nix daemon disconnected unexpectedly (maybe it crashed?)
failed eval checks.aarch64-linux.wireguard —
error: … while evaluating the attribute 'drvPath' at «https://releases.nixos.org/nixpkgs/nixpkgs-26.11pre1080018.74435dcdae84/nixexprs.tar.xz?na …
error:
       … while evaluating the attribute 'drvPath'
         at «https://releases.nixos.org/nixpkgs/nixpkgs-26.11pre1080018.74435dcdae84/nixexprs.tar.xz?narHash=sha256-jeK2GCq4qI7IEHzPPjVKu/6A6A1KtrDCmRHubVOva3Y%3D»/lib/customisation.nix:416:11:
          415|         // {
          416|           drvPath =
             |           ^
          417|             assert condition;

       … while calling the 'derivationStrict' builtin
         at «nix-internal»/derivation-internal.nix:37:12:
           36|
           37|   strict = derivationStrict drvAttrs;
             |            ^
           38|

       … while evaluating the option `driverConfiguration.vlans':

       … while evaluating definitions from `/nix/store/l8kkq7bs1z6573zhjmvp3i95va6dckvv-source/nixos/lib/testing/driver-configuration.nix':

       … while evaluating the option `containers.ctrl1.networking.interfaces':

       … while evaluating definitions from `/nix/store/l8kkq7bs1z6573zhjmvp3i95va6dckvv-source/nixos/modules/hardware/facter/networking':

       … while evaluating the option `containers.ctrl1.hardware.facter.enable':

       … while evaluating the option `containers.ctrl1.hardware.facter.report':

       … while evaluating the option `containers.ctrl1.hardware.facter.reportPath':

       … while evaluating definitions from `/nix/store/09vi3r2iqhksnqjiw1z9d9yv3v6adbzi-source/nixosModules/clanCore/nixos-facter.nix':

       (stack trace truncated; use '--show-trace' to show the full, detailed trace)

       error: opening a connection to remote store 'grpc://nix-store.geninf.io:50051' previously failed
failed eval checks.aarch64-linux.yggdrasil —
error: … while evaluating the attribute 'drvPath' at «https://releases.nixos.org/nixpkgs/nixpkgs-26.11pre1080018.74435dcdae84/nixexprs.tar.xz?na …
error:
       … while evaluating the attribute 'drvPath'
         at «https://releases.nixos.org/nixpkgs/nixpkgs-26.11pre1080018.74435dcdae84/nixexprs.tar.xz?narHash=sha256-jeK2GCq4qI7IEHzPPjVKu/6A6A1KtrDCmRHubVOva3Y%3D»/lib/customisation.nix:416:11:
          415|         // {
          416|           drvPath =
             |           ^
          417|             assert condition;

       … while calling the 'derivationStrict' builtin
         at «nix-internal»/derivation-internal.nix:37:12:
           36|
           37|   strict = derivationStrict drvAttrs;
             |            ^
           38|

       … while evaluating the option `driverConfiguration.vlans':

       … while evaluating definitions from `/nix/store/l8kkq7bs1z6573zhjmvp3i95va6dckvv-source/nixos/lib/testing/driver-configuration.nix':

       … while evaluating the option `nodes.outsider.networking.interfaces':

       … while evaluating definitions from `/nix/store/l8kkq7bs1z6573zhjmvp3i95va6dckvv-source/nixos/modules/hardware/facter/networking':

       … while evaluating the option `nodes.outsider.hardware.facter.enable':

       … while evaluating the option `nodes.outsider.hardware.facter.report':

       … while evaluating the option `nodes.outsider.hardware.facter.reportPath':

       … while evaluating definitions from `/nix/store/09vi3r2iqhksnqjiw1z9d9yv3v6adbzi-source/nixosModules/clanCore/nixos-facter.nix':

       (stack trace truncated; use '--show-trace' to show the full, detailed trace)

       error: opening a connection to remote store 'grpc://nix-store.geninf.io:50051' previously failed
failed eval checks.aarch64-linux.zerotier —
error: … while evaluating the attribute 'drvPath' at «https://releases.nixos.org/nixpkgs/nixpkgs-26.11pre1080018.74435dcdae84/nixexprs.tar.xz?na …
error:
       … while evaluating the attribute 'drvPath'
         at «https://releases.nixos.org/nixpkgs/nixpkgs-26.11pre1080018.74435dcdae84/nixexprs.tar.xz?narHash=sha256-jeK2GCq4qI7IEHzPPjVKu/6A6A1KtrDCmRHubVOva3Y%3D»/lib/customisation.nix:416:11:
          415|         // {
          416|           drvPath =
             |           ^
          417|             assert condition;

       … while calling the 'derivationStrict' builtin
         at «nix-internal»/derivation-internal.nix:37:12:
           36|
           37|   strict = derivationStrict drvAttrs;
             |            ^
           38|

       … while evaluating the option `driverConfiguration.vlans':

       … while evaluating definitions from `/nix/store/l8kkq7bs1z6573zhjmvp3i95va6dckvv-source/nixos/lib/testing/driver-configuration.nix':

       … while evaluating the option `nodes.controller.networking.interfaces':

       … while evaluating definitions from `/nix/store/l8kkq7bs1z6573zhjmvp3i95va6dckvv-source/nixos/modules/hardware/facter/networking':

       … while evaluating the option `nodes.controller.hardware.facter.enable':

       … while evaluating the option `nodes.controller.hardware.facter.report':

       … while evaluating the option `nodes.controller.hardware.facter.reportPath':

       … while evaluating definitions from `/nix/store/09vi3r2iqhksnqjiw1z9d9yv3v6adbzi-source/nixosModules/clanCore/nixos-facter.nix':

       (stack trace truncated; use '--show-trace' to show the full, detailed trace)

       error: opening a connection to remote store 'grpc://nix-store.geninf.io:50051' previously failed
failed eval checks.aarch64-linux.zerotier-multi-instance —
error: … while evaluating the attribute 'drvPath' at «https://releases.nixos.org/nixpkgs/nixpkgs-26.11pre1080018.74435dcdae84/nixexprs.tar.xz?na …
error:
       … while evaluating the attribute 'drvPath'
         at «https://releases.nixos.org/nixpkgs/nixpkgs-26.11pre1080018.74435dcdae84/nixexprs.tar.xz?narHash=sha256-jeK2GCq4qI7IEHzPPjVKu/6A6A1KtrDCmRHubVOva3Y%3D»/lib/customisation.nix:416:11:
          415|         // {
          416|           drvPath =
             |           ^
          417|             assert condition;

       … while calling the 'derivationStrict' builtin
         at «nix-internal»/derivation-internal.nix:37:12:
           36|
           37|   strict = derivationStrict drvAttrs;
             |            ^
           38|

       … while evaluating the option `driverConfiguration.vlans':

       … while evaluating definitions from `/nix/store/l8kkq7bs1z6573zhjmvp3i95va6dckvv-source/nixos/lib/testing/driver-configuration.nix':

       … while evaluating the option `nodes.alpha.networking.interfaces':

       … while evaluating definitions from `/nix/store/l8kkq7bs1z6573zhjmvp3i95va6dckvv-source/nixos/modules/hardware/facter/networking':

       … while evaluating the option `nodes.alpha.hardware.facter.enable':

       … while evaluating the option `nodes.alpha.hardware.facter.report':

       … while evaluating the option `nodes.alpha.hardware.facter.reportPath':

       … while evaluating definitions from `/nix/store/09vi3r2iqhksnqjiw1z9d9yv3v6adbzi-source/nixosModules/clanCore/nixos-facter.nix':

       (stack trace truncated; use '--show-trace' to show the full, detailed trace)

       error: opening a connection to remote store 'grpc://nix-store.geninf.io:50051' previously failed
failed eval checks.x86_64-linux.admin —
error: … while evaluating the attribute 'drvPath' at «https://releases.nixos.org/nixpkgs/nixpkgs-26.11pre1080018.74435dcdae84/nixexprs.tar.xz?na …
error:
       … while evaluating the attribute 'drvPath'
         at «https://releases.nixos.org/nixpkgs/nixpkgs-26.11pre1080018.74435dcdae84/nixexprs.tar.xz?narHash=sha256-jeK2GCq4qI7IEHzPPjVKu/6A6A1KtrDCmRHubVOva3Y%3D»/lib/customisation.nix:416:11:
          415|         // {
          416|           drvPath =
             |           ^
          417|             assert condition;

       … while calling the 'derivationStrict' builtin
         at «nix-internal»/derivation-internal.nix:37:12:
           36|
           37|   strict = derivationStrict drvAttrs;
             |            ^
           38|

       … while evaluating the option `driverConfiguration.vlans':

       … while evaluating definitions from `/nix/store/l8kkq7bs1z6573zhjmvp3i95va6dckvv-source/nixos/lib/testing/driver-configuration.nix':

       … while evaluating the option `containers.client.networking.interfaces':

       … while evaluating definitions from `/nix/store/l8kkq7bs1z6573zhjmvp3i95va6dckvv-source/nixos/modules/hardware/facter/networking':

       … while evaluating the option `containers.client.hardware.facter.enable':

       … while evaluating the option `containers.client.hardware.facter.report':

       … while evaluating the option `containers.client.hardware.facter.reportPath':

       … while evaluating definitions from `/nix/store/09vi3r2iqhksnqjiw1z9d9yv3v6adbzi-source/nixosModules/clanCore/nixos-facter.nix':

       (stack trace truncated; use '--show-trace' to show the full, detailed trace)

       error: opening a connection to remote store 'grpc://nix-store.geninf.io:50051' previously failed
failed eval checks.x86_64-linux.borgbackup —
error: … while evaluating the attribute 'drvPath' at «https://releases.nixos.org/nixpkgs/nixpkgs-26.11pre1080018.74435dcdae84/nixexprs.tar.xz?na …
error:
       … while evaluating the attribute 'drvPath'
         at «https://releases.nixos.org/nixpkgs/nixpkgs-26.11pre1080018.74435dcdae84/nixexprs.tar.xz?narHash=sha256-jeK2GCq4qI7IEHzPPjVKu/6A6A1KtrDCmRHubVOva3Y%3D»/lib/customisation.nix:416:11:
          415|         // {
          416|           drvPath =
             |           ^
          417|             assert condition;

       … while calling the 'derivationStrict' builtin
         at «nix-internal»/derivation-internal.nix:37:12:
           36|
           37|   strict = derivationStrict drvAttrs;
             |            ^
           38|

       … while evaluating the option `driverConfiguration.vlans':

       … while evaluating definitions from `/nix/store/l8kkq7bs1z6573zhjmvp3i95va6dckvv-source/nixos/lib/testing/driver-configuration.nix':

       … while evaluating the option `containers.clientone.networking.interfaces':

       … while evaluating definitions from `/nix/store/l8kkq7bs1z6573zhjmvp3i95va6dckvv-source/nixos/modules/hardware/facter/networking':

       … while evaluating the option `containers.clientone.hardware.facter.enable':

       … while evaluating the option `containers.clientone.hardware.facter.report':

       … while evaluating the option `containers.clientone.hardware.facter.reportPath':

       … while evaluating definitions from `/nix/store/09vi3r2iqhksnqjiw1z9d9yv3v6adbzi-source/nixosModules/clanCore/nixos-facter.nix':

       (stack trace truncated; use '--show-trace' to show the full, detailed trace)

       error: opening a connection to remote store 'grpc://nix-store.geninf.io:50051' previously failed
failed eval checks.x86_64-linux.certificates —
error: … while evaluating the attribute 'drvPath' at «https://releases.nixos.org/nixpkgs/nixpkgs-26.11pre1080018.74435dcdae84/nixexprs.tar.xz?na …
error:
       … while evaluating the attribute 'drvPath'
         at «https://releases.nixos.org/nixpkgs/nixpkgs-26.11pre1080018.74435dcdae84/nixexprs.tar.xz?narHash=sha256-jeK2GCq4qI7IEHzPPjVKu/6A6A1KtrDCmRHubVOva3Y%3D»/lib/customisation.nix:416:11:
          415|         // {
          416|           drvPath =
             |           ^
          417|             assert condition;

       … while calling the 'derivationStrict' builtin
         at «nix-internal»/derivation-internal.nix:37:12:
           36|
           37|   strict = derivationStrict drvAttrs;
             |            ^
           38|

       … while evaluating the option `driverConfiguration.vlans':

       … while evaluating definitions from `/nix/store/l8kkq7bs1z6573zhjmvp3i95va6dckvv-source/nixos/lib/testing/driver-configuration.nix':

       … while evaluating the option `containers.ca.networking.interfaces':

       … while evaluating definitions from `/nix/store/l8kkq7bs1z6573zhjmvp3i95va6dckvv-source/nixos/modules/hardware/facter/networking':

       … while evaluating the option `containers.ca.hardware.facter.enable':

       … while evaluating the option `containers.ca.hardware.facter.report':

       … while evaluating the option `containers.ca.hardware.facter.reportPath':

       … while evaluating definitions from `/nix/store/09vi3r2iqhksnqjiw1z9d9yv3v6adbzi-source/nixosModules/clanCore/nixos-facter.nix':

       (stack trace truncated; use '--show-trace' to show the full, detailed trace)

       error: opening a connection to remote store 'grpc://nix-store.geninf.io:50051' previously failed
failed eval checks.x86_64-linux.clan-test-update —
error: … while evaluating the attribute 'drvPath' at «https://releases.nixos.org/nixpkgs/nixpkgs-26.11pre1080018.74435dcdae84/nixexprs.tar.xz?na …
error:
       … while evaluating the attribute 'drvPath'
         at «https://releases.nixos.org/nixpkgs/nixpkgs-26.11pre1080018.74435dcdae84/nixexprs.tar.xz?narHash=sha256-jeK2GCq4qI7IEHzPPjVKu/6A6A1KtrDCmRHubVOva3Y%3D»/lib/customisation.nix:416:11:
          415|         // {
          416|           drvPath =
             |           ^
          417|             assert condition;

       … while calling the 'derivationStrict' builtin
         at «nix-internal»/derivation-internal.nix:37:12:
           36|
           37|   strict = derivationStrict drvAttrs;
             |            ^
           38|

       … while evaluating the option `driverConfiguration.vlans':

       … while evaluating definitions from `/nix/store/l8kkq7bs1z6573zhjmvp3i95va6dckvv-source/nixos/lib/testing/driver-configuration.nix':

       … while evaluating the option `nodes.machine.networking.interfaces':

       … while evaluating definitions from `/nix/store/l8kkq7bs1z6573zhjmvp3i95va6dckvv-source/nixos/modules/hardware/facter/networking':

       … while evaluating the option `nodes.machine.hardware.facter.enable':

       … while evaluating the option `nodes.machine.hardware.facter.report':

       … while evaluating the option `nodes.machine.hardware.facter.reportPath':

       … while evaluating definitions from `/nix/store/09vi3r2iqhksnqjiw1z9d9yv3v6adbzi-source/nixosModules/clanCore/nixos-facter.nix':

       (stack trace truncated; use '--show-trace' to show the full, detailed trace)

       error: opening a connection to remote store 'grpc://nix-store.geninf.io:50051' previously failed
failed checks.x86_64-linux.darwin-test-darwin-machine 3h 0m
setup: don't know how to build these paths: /nix/store/fn8mxjn6jf2d0kn8h4q1bbnj7wan2wmc-darwin-system-26.11.4cff07d.drv warning: ignoring the client-specified …
setup:
don't know how to build these paths:
  /nix/store/fn8mxjn6jf2d0kn8h4q1bbnj7wan2wmc-darwin-system-26.11.4cff07d.drv
warning: ignoring the client-specified setting 'store', because it is a restricted setting and you are not a trusted user
failed eval checks.x86_64-linux.data-mesher —
error: … while evaluating the attribute 'drvPath' at «https://releases.nixos.org/nixpkgs/nixpkgs-26.11pre1080018.74435dcdae84/nixexprs.tar.xz?na …
error:
       … while evaluating the attribute 'drvPath'
         at «https://releases.nixos.org/nixpkgs/nixpkgs-26.11pre1080018.74435dcdae84/nixexprs.tar.xz?narHash=sha256-jeK2GCq4qI7IEHzPPjVKu/6A6A1KtrDCmRHubVOva3Y%3D»/lib/customisation.nix:416:11:
          415|         // {
          416|           drvPath =
             |           ^
          417|             assert condition;

       … while calling the 'derivationStrict' builtin
         at «nix-internal»/derivation-internal.nix:37:12:
           36|
           37|   strict = derivationStrict drvAttrs;
             |            ^
           38|

       … while evaluating the option `driverConfiguration.vlans':

       … while evaluating definitions from `/nix/store/l8kkq7bs1z6573zhjmvp3i95va6dckvv-source/nixos/lib/testing/driver-configuration.nix':

       … while evaluating the option `containers.alpha.networking.interfaces':

       … while evaluating definitions from `/nix/store/l8kkq7bs1z6573zhjmvp3i95va6dckvv-source/nixos/modules/hardware/facter/networking':

       … while evaluating the option `containers.alpha.hardware.facter.enable':

       … while evaluating the option `containers.alpha.hardware.facter.report':

       … while evaluating the option `containers.alpha.hardware.facter.reportPath':

       … while evaluating definitions from `/nix/store/09vi3r2iqhksnqjiw1z9d9yv3v6adbzi-source/nixosModules/clanCore/nixos-facter.nix':

       (stack trace truncated; use '--show-trace' to show the full, detailed trace)

       error: opening a connection to remote store 'grpc://nix-store.geninf.io:50051' previously failed
failed eval checks.x86_64-linux.dm-dns —
error: … while evaluating the attribute 'drvPath' at «https://releases.nixos.org/nixpkgs/nixpkgs-26.11pre1080018.74435dcdae84/nixexprs.tar.xz?na …
error:
       … while evaluating the attribute 'drvPath'
         at «https://releases.nixos.org/nixpkgs/nixpkgs-26.11pre1080018.74435dcdae84/nixexprs.tar.xz?narHash=sha256-jeK2GCq4qI7IEHzPPjVKu/6A6A1KtrDCmRHubVOva3Y%3D»/lib/customisation.nix:416:11:
          415|         // {
          416|           drvPath =
             |           ^
          417|             assert condition;

       … while calling the 'derivationStrict' builtin
         at «nix-internal»/derivation-internal.nix:37:12:
           36|
           37|   strict = derivationStrict drvAttrs;
             |            ^
           38|

       … while evaluating the option `driverConfiguration.vlans':

       … while evaluating definitions from `/nix/store/l8kkq7bs1z6573zhjmvp3i95va6dckvv-source/nixos/lib/testing/driver-configuration.nix':

       … while evaluating the option `containers.client.networking.interfaces':

       … while evaluating definitions from `/nix/store/l8kkq7bs1z6573zhjmvp3i95va6dckvv-source/nixos/modules/hardware/facter/networking':

       … while evaluating the option `containers.client.hardware.facter.enable':

       … while evaluating the option `containers.client.hardware.facter.report':

       … while evaluating the option `containers.client.hardware.facter.reportPath':

       … while evaluating definitions from `/nix/store/09vi3r2iqhksnqjiw1z9d9yv3v6adbzi-source/nixosModules/clanCore/nixos-facter.nix':

       (stack trace truncated; use '--show-trace' to show the full, detailed trace)

       error: opening a connection to remote store 'grpc://nix-store.geninf.io:50051' previously failed
failed eval checks.x86_64-linux.dyndns —
error: … while evaluating the attribute 'drvPath' at «https://releases.nixos.org/nixpkgs/nixpkgs-26.11pre1080018.74435dcdae84/nixexprs.tar.xz?na …
error:
       … while evaluating the attribute 'drvPath'
         at «https://releases.nixos.org/nixpkgs/nixpkgs-26.11pre1080018.74435dcdae84/nixexprs.tar.xz?narHash=sha256-jeK2GCq4qI7IEHzPPjVKu/6A6A1KtrDCmRHubVOva3Y%3D»/lib/customisation.nix:416:11:
          415|         // {
          416|           drvPath =
             |           ^
          417|             assert condition;

       … while calling the 'derivationStrict' builtin
         at «nix-internal»/derivation-internal.nix:37:12:
           36|
           37|   strict = derivationStrict drvAttrs;
             |            ^
           38|

       … while evaluating the option `driverConfiguration.vlans':

       … while evaluating definitions from `/nix/store/l8kkq7bs1z6573zhjmvp3i95va6dckvv-source/nixos/lib/testing/driver-configuration.nix':

       … while evaluating the option `containers.server.networking.interfaces':

       … while evaluating definitions from `/nix/store/l8kkq7bs1z6573zhjmvp3i95va6dckvv-source/nixos/modules/hardware/facter/networking':

       … while evaluating the option `containers.server.hardware.facter.enable':

       … while evaluating the option `containers.server.hardware.facter.report':

       … while evaluating the option `containers.server.hardware.facter.reportPath':

       … while evaluating definitions from `/nix/store/09vi3r2iqhksnqjiw1z9d9yv3v6adbzi-source/nixosModules/clanCore/nixos-facter.nix':

       (stack trace truncated; use '--show-trace' to show the full, detailed trace)

       error: cannot open connection to remote store 'grpc://nix-store.geninf.io:50051': error: Nix daemon disconnected unexpectedly (maybe it crashed?)
failed eval checks.x86_64-linux.garage —
error: … while evaluating the attribute 'drvPath' at «https://releases.nixos.org/nixpkgs/nixpkgs-26.11pre1080018.74435dcdae84/nixexprs.tar.xz?na …
error:
       … while evaluating the attribute 'drvPath'
         at «https://releases.nixos.org/nixpkgs/nixpkgs-26.11pre1080018.74435dcdae84/nixexprs.tar.xz?narHash=sha256-jeK2GCq4qI7IEHzPPjVKu/6A6A1KtrDCmRHubVOva3Y%3D»/lib/customisation.nix:416:11:
          415|         // {
          416|           drvPath =
             |           ^
          417|             assert condition;

       … while calling the 'derivationStrict' builtin
         at «nix-internal»/derivation-internal.nix:37:12:
           36|
           37|   strict = derivationStrict drvAttrs;
             |            ^
           38|

       … while evaluating the option `driverConfiguration.vlans':

       … while evaluating definitions from `/nix/store/l8kkq7bs1z6573zhjmvp3i95va6dckvv-source/nixos/lib/testing/driver-configuration.nix':

       … while evaluating the option `containers.server.networking.interfaces':

       … while evaluating definitions from `/nix/store/l8kkq7bs1z6573zhjmvp3i95va6dckvv-source/nixos/modules/hardware/facter/networking':

       … while evaluating the option `containers.server.hardware.facter.enable':

       … while evaluating the option `containers.server.hardware.facter.report':

       … while evaluating the option `containers.server.hardware.facter.reportPath':

       … while evaluating definitions from `/nix/store/09vi3r2iqhksnqjiw1z9d9yv3v6adbzi-source/nixosModules/clanCore/nixos-facter.nix':

       (stack trace truncated; use '--show-trace' to show the full, detailed trace)

       error: cannot open connection to remote store 'grpc://nix-store.geninf.io:50051': error: Nix daemon disconnected unexpectedly (maybe it crashed?)
failed eval checks.x86_64-linux.hello-service —
error: … while evaluating the attribute 'drvPath' at «https://releases.nixos.org/nixpkgs/nixpkgs-26.11pre1080018.74435dcdae84/nixexprs.tar.xz?na …
error:
       … while evaluating the attribute 'drvPath'
         at «https://releases.nixos.org/nixpkgs/nixpkgs-26.11pre1080018.74435dcdae84/nixexprs.tar.xz?narHash=sha256-jeK2GCq4qI7IEHzPPjVKu/6A6A1KtrDCmRHubVOva3Y%3D»/lib/customisation.nix:416:11:
          415|         // {
          416|           drvPath =
             |           ^
          417|             assert condition;

       … while calling the 'derivationStrict' builtin
         at «nix-internal»/derivation-internal.nix:37:12:
           36|
           37|   strict = derivationStrict drvAttrs;
             |            ^
           38|

       … while evaluating the option `driverConfiguration.vlans':

       … while evaluating definitions from `/nix/store/l8kkq7bs1z6573zhjmvp3i95va6dckvv-source/nixos/lib/testing/driver-configuration.nix':

       … while evaluating the option `containers.peer1.networking.interfaces':

       … while evaluating definitions from `/nix/store/l8kkq7bs1z6573zhjmvp3i95va6dckvv-source/nixos/modules/hardware/facter/networking':

       … while evaluating the option `containers.peer1.hardware.facter.enable':

       … while evaluating the option `containers.peer1.hardware.facter.report':

       … while evaluating the option `containers.peer1.hardware.facter.reportPath':

       … while evaluating definitions from `/nix/store/09vi3r2iqhksnqjiw1z9d9yv3v6adbzi-source/nixosModules/clanCore/nixos-facter.nix':

       (stack trace truncated; use '--show-trace' to show the full, detailed trace)

       error: cannot open connection to remote store 'grpc://nix-store.geninf.io:50051': error: Nix daemon disconnected unexpectedly (maybe it crashed?)
failed eval checks.x86_64-linux.kde —
error: … while evaluating the attribute 'drvPath' at «https://releases.nixos.org/nixpkgs/nixpkgs-26.11pre1080018.74435dcdae84/nixexprs.tar.xz?na …
error:
       … while evaluating the attribute 'drvPath'
         at «https://releases.nixos.org/nixpkgs/nixpkgs-26.11pre1080018.74435dcdae84/nixexprs.tar.xz?narHash=sha256-jeK2GCq4qI7IEHzPPjVKu/6A6A1KtrDCmRHubVOva3Y%3D»/lib/customisation.nix:416:11:
          415|         // {
          416|           drvPath =
             |           ^
          417|             assert condition;

       … while calling the 'derivationStrict' builtin
         at «nix-internal»/derivation-internal.nix:37:12:
           36|
           37|   strict = derivationStrict drvAttrs;
             |            ^
           38|

       … while evaluating the option `driverConfiguration.vlans':

       … while evaluating definitions from `/nix/store/l8kkq7bs1z6573zhjmvp3i95va6dckvv-source/nixos/lib/testing/driver-configuration.nix':

       … while evaluating the option `containers.client.networking.interfaces':

       … while evaluating definitions from `/nix/store/l8kkq7bs1z6573zhjmvp3i95va6dckvv-source/nixos/modules/hardware/facter/networking':

       … while evaluating the option `containers.client.hardware.facter.enable':

       … while evaluating the option `containers.client.hardware.facter.report':

       … while evaluating the option `containers.client.hardware.facter.reportPath':

       … while evaluating definitions from `/nix/store/09vi3r2iqhksnqjiw1z9d9yv3v6adbzi-source/nixosModules/clanCore/nixos-facter.nix':

       (stack trace truncated; use '--show-trace' to show the full, detailed trace)

       error: opening a connection to remote store 'grpc://nix-store.geninf.io:50051' previously failed
failed eval checks.x86_64-linux.localbackup —
error: … while evaluating the attribute 'drvPath' at «https://releases.nixos.org/nixpkgs/nixpkgs-26.11pre1080018.74435dcdae84/nixexprs.tar.xz?na …
error:
       … while evaluating the attribute 'drvPath'
         at «https://releases.nixos.org/nixpkgs/nixpkgs-26.11pre1080018.74435dcdae84/nixexprs.tar.xz?narHash=sha256-jeK2GCq4qI7IEHzPPjVKu/6A6A1KtrDCmRHubVOva3Y%3D»/lib/customisation.nix:416:11:
          415|         // {
          416|           drvPath =
             |           ^
          417|             assert condition;

       … while calling the 'derivationStrict' builtin
         at «nix-internal»/derivation-internal.nix:37:12:
           36|
           37|   strict = derivationStrict drvAttrs;
             |            ^
           38|

       … while evaluating the option `driverConfiguration.vlans':

       … while evaluating definitions from `/nix/store/l8kkq7bs1z6573zhjmvp3i95va6dckvv-source/nixos/lib/testing/driver-configuration.nix':

       … while evaluating the option `containers.machine.networking.interfaces':

       … while evaluating definitions from `/nix/store/l8kkq7bs1z6573zhjmvp3i95va6dckvv-source/nixos/modules/hardware/facter/networking':

       … while evaluating the option `containers.machine.hardware.facter.enable':

       … while evaluating the option `containers.machine.hardware.facter.report':

       … while evaluating the option `containers.machine.hardware.facter.reportPath':

       … while evaluating definitions from `/nix/store/09vi3r2iqhksnqjiw1z9d9yv3v6adbzi-source/nixosModules/clanCore/nixos-facter.nix':

       (stack trace truncated; use '--show-trace' to show the full, detailed trace)

       error: opening a connection to remote store 'grpc://nix-store.geninf.io:50051' previously failed
failed eval checks.x86_64-linux.machine-id —
error: … while evaluating the attribute 'drvPath' at «https://releases.nixos.org/nixpkgs/nixpkgs-26.11pre1080018.74435dcdae84/nixexprs.tar.xz?na …
error:
       … while evaluating the attribute 'drvPath'
         at «https://releases.nixos.org/nixpkgs/nixpkgs-26.11pre1080018.74435dcdae84/nixexprs.tar.xz?narHash=sha256-jeK2GCq4qI7IEHzPPjVKu/6A6A1KtrDCmRHubVOva3Y%3D»/lib/customisation.nix:416:11:
          415|         // {
          416|           drvPath =
             |           ^
          417|             assert condition;

       … while calling the 'derivationStrict' builtin
         at «nix-internal»/derivation-internal.nix:37:12:
           36|
           37|   strict = derivationStrict drvAttrs;
             |            ^
           38|

       … while evaluating the option `driverConfiguration.vlans':

       … while evaluating definitions from `/nix/store/l8kkq7bs1z6573zhjmvp3i95va6dckvv-source/nixos/lib/testing/driver-configuration.nix':

       … while evaluating the option `containers.server.networking.interfaces':

       … while evaluating definitions from `/nix/store/l8kkq7bs1z6573zhjmvp3i95va6dckvv-source/nixos/modules/hardware/facter/networking':

       … while evaluating the option `containers.server.hardware.facter.enable':

       … while evaluating the option `containers.server.hardware.facter.report':

       … while evaluating the option `containers.server.hardware.facter.reportPath':

       … while evaluating definitions from `/nix/store/09vi3r2iqhksnqjiw1z9d9yv3v6adbzi-source/nixosModules/clanCore/nixos-facter.nix':

       (stack trace truncated; use '--show-trace' to show the full, detailed trace)

       error: opening a connection to remote store 'grpc://nix-store.geninf.io:50051' previously failed
failed eval checks.x86_64-linux.matrix-synapse —
error: … while evaluating the attribute 'drvPath' at «https://releases.nixos.org/nixpkgs/nixpkgs-26.11pre1080018.74435dcdae84/nixexprs.tar.xz?na …
error:
       … while evaluating the attribute 'drvPath'
         at «https://releases.nixos.org/nixpkgs/nixpkgs-26.11pre1080018.74435dcdae84/nixexprs.tar.xz?narHash=sha256-jeK2GCq4qI7IEHzPPjVKu/6A6A1KtrDCmRHubVOva3Y%3D»/lib/customisation.nix:416:11:
          415|         // {
          416|           drvPath =
             |           ^
          417|             assert condition;

       … while calling the 'derivationStrict' builtin
         at «nix-internal»/derivation-internal.nix:37:12:
           36|
           37|   strict = derivationStrict drvAttrs;
             |            ^
           38|

       … while evaluating the option `driverConfiguration.vlans':

       … while evaluating definitions from `/nix/store/l8kkq7bs1z6573zhjmvp3i95va6dckvv-source/nixos/lib/testing/driver-configuration.nix':

       … while evaluating the option `containers.machine.networking.interfaces':

       … while evaluating definitions from `/nix/store/l8kkq7bs1z6573zhjmvp3i95va6dckvv-source/nixos/modules/hardware/facter/networking':

       … while evaluating the option `containers.machine.hardware.facter.enable':

       … while evaluating the option `containers.machine.hardware.facter.report':

       … while evaluating the option `containers.machine.hardware.facter.reportPath':

       … while evaluating definitions from `/nix/store/09vi3r2iqhksnqjiw1z9d9yv3v6adbzi-source/nixosModules/clanCore/nixos-facter.nix':

       (stack trace truncated; use '--show-trace' to show the full, detailed trace)

       error: opening a connection to remote store 'grpc://nix-store.geninf.io:50051' previously failed
failed eval checks.x86_64-linux.monitoring —
error: … while evaluating the attribute 'drvPath' at «https://releases.nixos.org/nixpkgs/nixpkgs-26.11pre1080018.74435dcdae84/nixexprs.tar.xz?na …
error:
       … while evaluating the attribute 'drvPath'
         at «https://releases.nixos.org/nixpkgs/nixpkgs-26.11pre1080018.74435dcdae84/nixexprs.tar.xz?narHash=sha256-jeK2GCq4qI7IEHzPPjVKu/6A6A1KtrDCmRHubVOva3Y%3D»/lib/customisation.nix:416:11:
          415|         // {
          416|           drvPath =
             |           ^
          417|             assert condition;

       … while calling the 'derivationStrict' builtin
         at «nix-internal»/derivation-internal.nix:37:12:
           36|
           37|   strict = derivationStrict drvAttrs;
             |            ^
           38|

       … while evaluating the option `driverConfiguration.vlans':

       … while evaluating definitions from `/nix/store/l8kkq7bs1z6573zhjmvp3i95va6dckvv-source/nixos/lib/testing/driver-configuration.nix':

       … while evaluating the option `containers.machine1.networking.interfaces':

       … while evaluating definitions from `/nix/store/l8kkq7bs1z6573zhjmvp3i95va6dckvv-source/nixos/modules/hardware/facter/networking':

       … while evaluating the option `containers.machine1.hardware.facter.enable':

       … while evaluating the option `containers.machine1.hardware.facter.report':

       … while evaluating the option `containers.machine1.hardware.facter.reportPath':

       … while evaluating definitions from `/nix/store/09vi3r2iqhksnqjiw1z9d9yv3v6adbzi-source/nixosModules/clanCore/nixos-facter.nix':

       (stack trace truncated; use '--show-trace' to show the full, detailed trace)

       error: opening a connection to remote store 'grpc://nix-store.geninf.io:50051' previously failed
failed eval checks.x86_64-linux.mycelium —
error: … while evaluating the attribute 'drvPath' at «https://releases.nixos.org/nixpkgs/nixpkgs-26.11pre1080018.74435dcdae84/nixexprs.tar.xz?na …
error:
       … while evaluating the attribute 'drvPath'
         at «https://releases.nixos.org/nixpkgs/nixpkgs-26.11pre1080018.74435dcdae84/nixexprs.tar.xz?narHash=sha256-jeK2GCq4qI7IEHzPPjVKu/6A6A1KtrDCmRHubVOva3Y%3D»/lib/customisation.nix:416:11:
          415|         // {
          416|           drvPath =
             |           ^
          417|             assert condition;

       … while calling the 'derivationStrict' builtin
         at «nix-internal»/derivation-internal.nix:37:12:
           36|
           37|   strict = derivationStrict drvAttrs;
             |            ^
           38|

       … while evaluating the option `driverConfiguration.vlans':

       … while evaluating definitions from `/nix/store/l8kkq7bs1z6573zhjmvp3i95va6dckvv-source/nixos/lib/testing/driver-configuration.nix':

       … while evaluating the option `nodes.server.networking.interfaces':

       … while evaluating definitions from `/nix/store/l8kkq7bs1z6573zhjmvp3i95va6dckvv-source/nixos/modules/hardware/facter/networking':

       … while evaluating the option `nodes.server.hardware.facter.enable':

       … while evaluating the option `nodes.server.hardware.facter.report':

       … while evaluating the option `nodes.server.hardware.facter.reportPath':

       … while evaluating definitions from `/nix/store/09vi3r2iqhksnqjiw1z9d9yv3v6adbzi-source/nixosModules/clanCore/nixos-facter.nix':

       (stack trace truncated; use '--show-trace' to show the full, detailed trace)

       error: opening a connection to remote store 'grpc://nix-store.geninf.io:50051' previously failed
failed eval checks.x86_64-linux.ncps —
error: … while evaluating the attribute 'drvPath' at «https://releases.nixos.org/nixpkgs/nixpkgs-26.11pre1080018.74435dcdae84/nixexprs.tar.xz?na …
error:
       … while evaluating the attribute 'drvPath'
         at «https://releases.nixos.org/nixpkgs/nixpkgs-26.11pre1080018.74435dcdae84/nixexprs.tar.xz?narHash=sha256-jeK2GCq4qI7IEHzPPjVKu/6A6A1KtrDCmRHubVOva3Y%3D»/lib/customisation.nix:416:11:
          415|         // {
          416|           drvPath =
             |           ^
          417|             assert condition;

       … while calling the 'derivationStrict' builtin
         at «nix-internal»/derivation-internal.nix:37:12:
           36|
           37|   strict = derivationStrict drvAttrs;
             |            ^
           38|

       … while evaluating the option `driverConfiguration.vlans':

       … while evaluating definitions from `/nix/store/l8kkq7bs1z6573zhjmvp3i95va6dckvv-source/nixos/lib/testing/driver-configuration.nix':

       … while evaluating the option `nodes.alice.networking.interfaces':

       … while evaluating definitions from `/nix/store/l8kkq7bs1z6573zhjmvp3i95va6dckvv-source/nixos/modules/hardware/facter/networking':

       … while evaluating the option `nodes.alice.hardware.facter.enable':

       … while evaluating the option `nodes.alice.hardware.facter.report':

       … while evaluating the option `nodes.alice.hardware.facter.reportPath':

       … while evaluating definitions from `/nix/store/09vi3r2iqhksnqjiw1z9d9yv3v6adbzi-source/nixosModules/clanCore/nixos-facter.nix':

       (stack trace truncated; use '--show-trace' to show the full, detailed trace)

       error: opening a connection to remote store 'grpc://nix-store.geninf.io:50051' previously failed
failed eval checks.x86_64-linux.nixos-test-password-store-mounts —
error: … while evaluating the attribute 'drvPath' at «https://releases.nixos.org/nixpkgs/nixpkgs-26.11pre1080018.74435dcdae84/nixexprs.tar.xz?na …
error:
       … while evaluating the attribute 'drvPath'
         at «https://releases.nixos.org/nixpkgs/nixpkgs-26.11pre1080018.74435dcdae84/nixexprs.tar.xz?narHash=sha256-jeK2GCq4qI7IEHzPPjVKu/6A6A1KtrDCmRHubVOva3Y%3D»/lib/customisation.nix:416:11:
          415|         // {
          416|           drvPath =
             |           ^
          417|             assert condition;

       … while calling the 'derivationStrict' builtin
         at «nix-internal»/derivation-internal.nix:37:12:
           36|
           37|   strict = derivationStrict drvAttrs;
             |            ^
           38|

       … while evaluating the option `driverConfiguration.vlans':

       … while evaluating definitions from `/nix/store/l8kkq7bs1z6573zhjmvp3i95va6dckvv-source/nixos/lib/testing/driver-configuration.nix':

       … while evaluating the option `nodes.machine.networking.interfaces':

       … while evaluating definitions from `/nix/store/l8kkq7bs1z6573zhjmvp3i95va6dckvv-source/nixos/modules/hardware/facter/networking':

       … while evaluating the option `nodes.machine.hardware.facter.enable':

       … while evaluating the option `nodes.machine.hardware.facter.report':

       … while evaluating the option `nodes.machine.hardware.facter.reportPath':

       … while evaluating definitions from `/nix/store/09vi3r2iqhksnqjiw1z9d9yv3v6adbzi-source/nixosModules/clanCore/nixos-facter.nix':

       (stack trace truncated; use '--show-trace' to show the full, detailed trace)

       error: opening a connection to remote store 'grpc://nix-store.geninf.io:50051' previously failed
failed eval checks.x86_64-linux.p2p-ssh-iroh —
error: … while evaluating the attribute 'drvPath' at «https://releases.nixos.org/nixpkgs/nixpkgs-26.11pre1080018.74435dcdae84/nixexprs.tar.xz?na …
error:
       … while evaluating the attribute 'drvPath'
         at «https://releases.nixos.org/nixpkgs/nixpkgs-26.11pre1080018.74435dcdae84/nixexprs.tar.xz?narHash=sha256-jeK2GCq4qI7IEHzPPjVKu/6A6A1KtrDCmRHubVOva3Y%3D»/lib/customisation.nix:416:11:
          415|         // {
          416|           drvPath =
             |           ^
          417|             assert condition;

       … while calling the 'derivationStrict' builtin
         at «nix-internal»/derivation-internal.nix:37:12:
           36|
           37|   strict = derivationStrict drvAttrs;
             |            ^
           38|

       … while evaluating the option `driverConfiguration.vlans':

       … while evaluating definitions from `/nix/store/l8kkq7bs1z6573zhjmvp3i95va6dckvv-source/nixos/lib/testing/driver-configuration.nix':

       … while evaluating the option `containers.client.networking.interfaces':

       … while evaluating definitions from `/nix/store/l8kkq7bs1z6573zhjmvp3i95va6dckvv-source/nixos/modules/hardware/facter/networking':

       … while evaluating the option `containers.client.hardware.facter.enable':

       … while evaluating the option `containers.client.hardware.facter.report':

       … while evaluating the option `containers.client.hardware.facter.reportPath':

       … while evaluating definitions from `/nix/store/09vi3r2iqhksnqjiw1z9d9yv3v6adbzi-source/nixosModules/clanCore/nixos-facter.nix':

       (stack trace truncated; use '--show-trace' to show the full, detailed trace)

       error: cannot open connection to remote store 'grpc://nix-store.geninf.io:50051': error: Nix daemon disconnected unexpectedly (maybe it crashed?)
failed eval checks.x86_64-linux.packages —
error: … while evaluating the attribute 'drvPath' at «https://releases.nixos.org/nixpkgs/nixpkgs-26.11pre1080018.74435dcdae84/nixexprs.tar.xz?na …
error:
       … while evaluating the attribute 'drvPath'
         at «https://releases.nixos.org/nixpkgs/nixpkgs-26.11pre1080018.74435dcdae84/nixexprs.tar.xz?narHash=sha256-jeK2GCq4qI7IEHzPPjVKu/6A6A1KtrDCmRHubVOva3Y%3D»/lib/customisation.nix:416:11:
          415|         // {
          416|           drvPath =
             |           ^
          417|             assert condition;

       … while calling the 'derivationStrict' builtin
         at «nix-internal»/derivation-internal.nix:37:12:
           36|
           37|   strict = derivationStrict drvAttrs;
             |            ^
           38|

       … while evaluating the option `driverConfiguration.vlans':

       … while evaluating definitions from `/nix/store/l8kkq7bs1z6573zhjmvp3i95va6dckvv-source/nixos/lib/testing/driver-configuration.nix':

       … while evaluating the option `containers.server.networking.interfaces':

       … while evaluating definitions from `/nix/store/l8kkq7bs1z6573zhjmvp3i95va6dckvv-source/nixos/modules/hardware/facter/networking':

       … while evaluating the option `containers.server.hardware.facter.enable':

       … while evaluating the option `containers.server.hardware.facter.report':

       … while evaluating the option `containers.server.hardware.facter.reportPath':

       … while evaluating definitions from `/nix/store/09vi3r2iqhksnqjiw1z9d9yv3v6adbzi-source/nixosModules/clanCore/nixos-facter.nix':

       (stack trace truncated; use '--show-trace' to show the full, detailed trace)

       error: opening a connection to remote store 'grpc://nix-store.geninf.io:50051' previously failed
failed eval checks.x86_64-linux.pki —
error: … while evaluating the attribute 'drvPath' at «https://releases.nixos.org/nixpkgs/nixpkgs-26.11pre1080018.74435dcdae84/nixexprs.tar.xz?na …
error:
       … while evaluating the attribute 'drvPath'
         at «https://releases.nixos.org/nixpkgs/nixpkgs-26.11pre1080018.74435dcdae84/nixexprs.tar.xz?narHash=sha256-jeK2GCq4qI7IEHzPPjVKu/6A6A1KtrDCmRHubVOva3Y%3D»/lib/customisation.nix:416:11:
          415|         // {
          416|           drvPath =
             |           ^
          417|             assert condition;

       … while calling the 'derivationStrict' builtin
         at «nix-internal»/derivation-internal.nix:37:12:
           36|
           37|   strict = derivationStrict drvAttrs;
             |            ^
           38|

       … while evaluating the option `driverConfiguration.vlans':

       … while evaluating definitions from `/nix/store/l8kkq7bs1z6573zhjmvp3i95va6dckvv-source/nixos/lib/testing/driver-configuration.nix':

       … while evaluating the option `nodes.caddy.networking.interfaces':

       … while evaluating definitions from `/nix/store/l8kkq7bs1z6573zhjmvp3i95va6dckvv-source/nixos/modules/hardware/facter/networking':

       … while evaluating the option `nodes.caddy.hardware.facter.enable':

       … while evaluating the option `nodes.caddy.hardware.facter.report':

       … while evaluating the option `nodes.caddy.hardware.facter.reportPath':

       … while evaluating definitions from `/nix/store/09vi3r2iqhksnqjiw1z9d9yv3v6adbzi-source/nixosModules/clanCore/nixos-facter.nix':

       (stack trace truncated; use '--show-trace' to show the full, detailed trace)

       error: opening a connection to remote store 'grpc://nix-store.geninf.io:50051' previously failed
failed eval checks.x86_64-linux.postgresql —
error: … while evaluating the attribute 'drvPath' at «https://releases.nixos.org/nixpkgs/nixpkgs-26.11pre1080018.74435dcdae84/nixexprs.tar.xz?na …
error:
       … while evaluating the attribute 'drvPath'
         at «https://releases.nixos.org/nixpkgs/nixpkgs-26.11pre1080018.74435dcdae84/nixexprs.tar.xz?narHash=sha256-jeK2GCq4qI7IEHzPPjVKu/6A6A1KtrDCmRHubVOva3Y%3D»/lib/customisation.nix:416:11:
          415|         // {
          416|           drvPath =
             |           ^
          417|             assert condition;

       … while calling the 'derivationStrict' builtin
         at «nix-internal»/derivation-internal.nix:37:12:
           36|
           37|   strict = derivationStrict drvAttrs;
             |            ^
           38|

       … while evaluating the option `driverConfiguration.vlans':

       … while evaluating definitions from `/nix/store/l8kkq7bs1z6573zhjmvp3i95va6dckvv-source/nixos/lib/testing/driver-configuration.nix':

       … while evaluating the option `containers.machine.networking.interfaces':

       … while evaluating definitions from `/nix/store/l8kkq7bs1z6573zhjmvp3i95va6dckvv-source/nixos/modules/hardware/facter/networking':

       … while evaluating the option `containers.machine.hardware.facter.enable':

       … while evaluating the option `containers.machine.hardware.facter.report':

       … while evaluating the option `containers.machine.hardware.facter.reportPath':

       … while evaluating definitions from `/nix/store/09vi3r2iqhksnqjiw1z9d9yv3v6adbzi-source/nixosModules/clanCore/nixos-facter.nix':

       (stack trace truncated; use '--show-trace' to show the full, detailed trace)

       error: cannot open connection to remote store 'grpc://nix-store.geninf.io:50051': error: Nix daemon disconnected unexpectedly (maybe it crashed?)
failed eval checks.x86_64-linux.service-dummy-test —
error: … while evaluating the attribute 'drvPath' at «https://releases.nixos.org/nixpkgs/nixpkgs-26.11pre1080018.74435dcdae84/nixexprs.tar.xz?na …
error:
       … while evaluating the attribute 'drvPath'
         at «https://releases.nixos.org/nixpkgs/nixpkgs-26.11pre1080018.74435dcdae84/nixexprs.tar.xz?narHash=sha256-jeK2GCq4qI7IEHzPPjVKu/6A6A1KtrDCmRHubVOva3Y%3D»/lib/customisation.nix:416:11:
          415|         // {
          416|           drvPath =
             |           ^
          417|             assert condition;

       … while calling the 'derivationStrict' builtin
         at «nix-internal»/derivation-internal.nix:37:12:
           36|
           37|   strict = derivationStrict drvAttrs;
             |            ^
           38|

       … while evaluating the option `driverConfiguration.vlans':

       … while evaluating definitions from `/nix/store/l8kkq7bs1z6573zhjmvp3i95va6dckvv-source/nixos/lib/testing/driver-configuration.nix':

       … while evaluating the option `containers.admin1.networking.interfaces':

       … while evaluating definitions from `/nix/store/l8kkq7bs1z6573zhjmvp3i95va6dckvv-source/nixos/modules/hardware/facter/networking':

       … while evaluating the option `containers.admin1.hardware.facter.enable':

       … while evaluating the option `containers.admin1.hardware.facter.report':

       … while evaluating the option `containers.admin1.hardware.facter.reportPath':

       … while evaluating definitions from `/nix/store/09vi3r2iqhksnqjiw1z9d9yv3v6adbzi-source/nixosModules/clanCore/nixos-facter.nix':

       (stack trace truncated; use '--show-trace' to show the full, detailed trace)

       error: opening a connection to remote store 'grpc://nix-store.geninf.io:50051' previously failed
failed eval checks.x86_64-linux.service-dummy-test-from-flake —
error: … while evaluating the attribute 'drvPath' at «https://releases.nixos.org/nixpkgs/nixpkgs-26.11pre1080018.74435dcdae84/nixexprs.tar.xz?na …
error:
       … while evaluating the attribute 'drvPath'
         at «https://releases.nixos.org/nixpkgs/nixpkgs-26.11pre1080018.74435dcdae84/nixexprs.tar.xz?narHash=sha256-jeK2GCq4qI7IEHzPPjVKu/6A6A1KtrDCmRHubVOva3Y%3D»/lib/customisation.nix:416:11:
          415|         // {
          416|           drvPath =
             |           ^
          417|             assert condition;

       … while calling the 'derivationStrict' builtin
         at «nix-internal»/derivation-internal.nix:37:12:
           36|
           37|   strict = derivationStrict drvAttrs;
             |            ^
           38|

       … while evaluating the option `driverConfiguration.vlans':

       … while evaluating definitions from `/nix/store/l8kkq7bs1z6573zhjmvp3i95va6dckvv-source/nixos/lib/testing/driver-configuration.nix':

       … while evaluating the option `containers.admin1.networking.interfaces':

       … while evaluating definitions from `/nix/store/l8kkq7bs1z6573zhjmvp3i95va6dckvv-source/nixos/modules/hardware/facter/networking':

       … while evaluating the option `containers.admin1.hardware.facter.enable':

       … while evaluating the option `containers.admin1.hardware.facter.report':

       … while evaluating the option `containers.admin1.hardware.facter.reportPath':

       … while evaluating definitions from `/nix/store/09vi3r2iqhksnqjiw1z9d9yv3v6adbzi-source/nixosModules/clanCore/nixos-facter.nix':

       (stack trace truncated; use '--show-trace' to show the full, detailed trace)

       error: cannot open connection to remote store 'grpc://nix-store.geninf.io:50051': error: Nix daemon disconnected unexpectedly (maybe it crashed?)
failed eval checks.x86_64-linux.sshd —
error: … while evaluating the attribute 'drvPath' at «https://releases.nixos.org/nixpkgs/nixpkgs-26.11pre1080018.74435dcdae84/nixexprs.tar.xz?na …
error:
       … while evaluating the attribute 'drvPath'
         at «https://releases.nixos.org/nixpkgs/nixpkgs-26.11pre1080018.74435dcdae84/nixexprs.tar.xz?narHash=sha256-jeK2GCq4qI7IEHzPPjVKu/6A6A1KtrDCmRHubVOva3Y%3D»/lib/customisation.nix:416:11:
          415|         // {
          416|           drvPath =
             |           ^
          417|             assert condition;

       … while calling the 'derivationStrict' builtin
         at «nix-internal»/derivation-internal.nix:37:12:
           36|
           37|   strict = derivationStrict drvAttrs;
             |            ^
           38|

       … while evaluating the option `driverConfiguration.vlans':

       … while evaluating definitions from `/nix/store/l8kkq7bs1z6573zhjmvp3i95va6dckvv-source/nixos/lib/testing/driver-configuration.nix':

       … while evaluating the option `containers.client.networking.interfaces':

       … while evaluating definitions from `/nix/store/l8kkq7bs1z6573zhjmvp3i95va6dckvv-source/nixos/modules/hardware/facter/networking':

       … while evaluating the option `containers.client.hardware.facter.enable':

       … while evaluating the option `containers.client.hardware.facter.report':

       … while evaluating the option `containers.client.hardware.facter.reportPath':

       … while evaluating definitions from `/nix/store/09vi3r2iqhksnqjiw1z9d9yv3v6adbzi-source/nixosModules/clanCore/nixos-facter.nix':

       (stack trace truncated; use '--show-trace' to show the full, detailed trace)

       error: cannot open connection to remote store 'grpc://nix-store.geninf.io:50051': error: Nix daemon disconnected unexpectedly (maybe it crashed?)
failed eval checks.x86_64-linux.sshd-no-ca —
error: … while evaluating the attribute 'drvPath' at «https://releases.nixos.org/nixpkgs/nixpkgs-26.11pre1080018.74435dcdae84/nixexprs.tar.xz?na …
error:
       … while evaluating the attribute 'drvPath'
         at «https://releases.nixos.org/nixpkgs/nixpkgs-26.11pre1080018.74435dcdae84/nixexprs.tar.xz?narHash=sha256-jeK2GCq4qI7IEHzPPjVKu/6A6A1KtrDCmRHubVOva3Y%3D»/lib/customisation.nix:416:11:
          415|         // {
          416|           drvPath =
             |           ^
          417|             assert condition;

       … while calling the 'derivationStrict' builtin
         at «nix-internal»/derivation-internal.nix:37:12:
           36|
           37|   strict = derivationStrict drvAttrs;
             |            ^
           38|

       … while evaluating the option `driverConfiguration.vlans':

       … while evaluating definitions from `/nix/store/l8kkq7bs1z6573zhjmvp3i95va6dckvv-source/nixos/lib/testing/driver-configuration.nix':

       … while evaluating the option `containers.client.networking.interfaces':

       … while evaluating definitions from `/nix/store/l8kkq7bs1z6573zhjmvp3i95va6dckvv-source/nixos/modules/hardware/facter/networking':

       … while evaluating the option `containers.client.hardware.facter.enable':

       … while evaluating the option `containers.client.hardware.facter.report':

       … while evaluating the option `containers.client.hardware.facter.reportPath':

       … while evaluating definitions from `/nix/store/09vi3r2iqhksnqjiw1z9d9yv3v6adbzi-source/nixosModules/clanCore/nixos-facter.nix':

       (stack trace truncated; use '--show-trace' to show the full, detailed trace)

       error: opening a connection to remote store 'grpc://nix-store.geninf.io:50051' previously failed
failed eval checks.x86_64-linux.state-version —
error: … while evaluating the attribute 'drvPath' at «https://releases.nixos.org/nixpkgs/nixpkgs-26.11pre1080018.74435dcdae84/nixexprs.tar.xz?na …
error:
       … while evaluating the attribute 'drvPath'
         at «https://releases.nixos.org/nixpkgs/nixpkgs-26.11pre1080018.74435dcdae84/nixexprs.tar.xz?narHash=sha256-jeK2GCq4qI7IEHzPPjVKu/6A6A1KtrDCmRHubVOva3Y%3D»/lib/customisation.nix:416:11:
          415|         // {
          416|           drvPath =
             |           ^
          417|             assert condition;

       … while calling the 'derivationStrict' builtin
         at «nix-internal»/derivation-internal.nix:37:12:
           36|
           37|   strict = derivationStrict drvAttrs;
             |            ^
           38|

       … while evaluating the option `driverConfiguration.vlans':

       … while evaluating definitions from `/nix/store/l8kkq7bs1z6573zhjmvp3i95va6dckvv-source/nixos/lib/testing/driver-configuration.nix':

       … while evaluating the option `containers.server.networking.interfaces':

       … while evaluating definitions from `/nix/store/l8kkq7bs1z6573zhjmvp3i95va6dckvv-source/nixos/modules/hardware/facter/networking':

       … while evaluating the option `containers.server.hardware.facter.enable':

       … while evaluating the option `containers.server.hardware.facter.report':

       … while evaluating the option `containers.server.hardware.facter.reportPath':

       … while evaluating definitions from `/nix/store/09vi3r2iqhksnqjiw1z9d9yv3v6adbzi-source/nixosModules/clanCore/nixos-facter.nix':

       (stack trace truncated; use '--show-trace' to show the full, detailed trace)

       error: cannot open connection to remote store 'grpc://nix-store.geninf.io:50051': error: Nix daemon disconnected unexpectedly (maybe it crashed?)
failed eval checks.x86_64-linux.syncthing-service —
error: … while evaluating the attribute 'drvPath' at «https://releases.nixos.org/nixpkgs/nixpkgs-26.11pre1080018.74435dcdae84/nixexprs.tar.xz?na …
error:
       … while evaluating the attribute 'drvPath'
         at «https://releases.nixos.org/nixpkgs/nixpkgs-26.11pre1080018.74435dcdae84/nixexprs.tar.xz?narHash=sha256-jeK2GCq4qI7IEHzPPjVKu/6A6A1KtrDCmRHubVOva3Y%3D»/lib/customisation.nix:416:11:
          415|         // {
          416|           drvPath =
             |           ^
          417|             assert condition;

       … while calling the 'derivationStrict' builtin
         at «nix-internal»/derivation-internal.nix:37:12:
           36|
           37|   strict = derivationStrict drvAttrs;
             |            ^
           38|

       … while evaluating the option `driverConfiguration.vlans':

       … while evaluating definitions from `/nix/store/l8kkq7bs1z6573zhjmvp3i95va6dckvv-source/nixos/lib/testing/driver-configuration.nix':

       … while evaluating the option `containers.machine1.networking.interfaces':

       … while evaluating definitions from `/nix/store/l8kkq7bs1z6573zhjmvp3i95va6dckvv-source/nixos/modules/hardware/facter/networking':

       … while evaluating the option `containers.machine1.hardware.facter.enable':

       … while evaluating the option `containers.machine1.hardware.facter.report':

       … while evaluating the option `containers.machine1.hardware.facter.reportPath':

       … while evaluating definitions from `/nix/store/09vi3r2iqhksnqjiw1z9d9yv3v6adbzi-source/nixosModules/clanCore/nixos-facter.nix':

       (stack trace truncated; use '--show-trace' to show the full, detailed trace)

       error: cannot open connection to remote store 'grpc://nix-store.geninf.io:50051': error: Nix daemon disconnected unexpectedly (maybe it crashed?)
failed eval checks.x86_64-linux.template-minimal —
error: … while calling the 'import' builtin at «git+file:///var/lib/nixbot/worktrees/5-14fef36177b5-32?ref=HEAD&rev=998d2445709506b2f41de616fdc1 …
error:
       … while calling the 'import' builtin
         at «git+file:///var/lib/nixbot/worktrees/5-14fef36177b5-32?ref=HEAD&rev=998d2445709506b2f41de616fdc1c268148b6758»/templates/flake-module.nix:50:19:
           49|         '';
           50|         evaled = (import "${initialized}/flake.nix").outputs {
             |                   ^
           51|           self = evaled // {

       … while realising the context of path '/nix/store/ix4rhpnw2f728ndbpsbchli8syap3smf-minimal-clan-flake/flake.nix'

       error: cannot open connection to remote store 'grpc://nix-store.geninf.io:50051': error: Nix daemon disconnected unexpectedly (maybe it crashed?)
failed eval checks.x86_64-linux.trusted-nix-caches —
error: … while evaluating the attribute 'drvPath' at «https://releases.nixos.org/nixpkgs/nixpkgs-26.11pre1080018.74435dcdae84/nixexprs.tar.xz?na …
error:
       … while evaluating the attribute 'drvPath'
         at «https://releases.nixos.org/nixpkgs/nixpkgs-26.11pre1080018.74435dcdae84/nixexprs.tar.xz?narHash=sha256-jeK2GCq4qI7IEHzPPjVKu/6A6A1KtrDCmRHubVOva3Y%3D»/lib/customisation.nix:416:11:
          415|         // {
          416|           drvPath =
             |           ^
          417|             assert condition;

       … while calling the 'derivationStrict' builtin
         at «nix-internal»/derivation-internal.nix:37:12:
           36|
           37|   strict = derivationStrict drvAttrs;
             |            ^
           38|

       … while evaluating the option `driverConfiguration.vlans':

       … while evaluating definitions from `/nix/store/l8kkq7bs1z6573zhjmvp3i95va6dckvv-source/nixos/lib/testing/driver-configuration.nix':

       … while evaluating the option `containers.server.networking.interfaces':

       … while evaluating definitions from `/nix/store/l8kkq7bs1z6573zhjmvp3i95va6dckvv-source/nixos/modules/hardware/facter/networking':

       … while evaluating the option `containers.server.hardware.facter.enable':

       … while evaluating the option `containers.server.hardware.facter.report':

       … while evaluating the option `containers.server.hardware.facter.reportPath':

       … while evaluating definitions from `/nix/store/09vi3r2iqhksnqjiw1z9d9yv3v6adbzi-source/nixosModules/clanCore/nixos-facter.nix':

       (stack trace truncated; use '--show-trace' to show the full, detailed trace)

       error: cannot open connection to remote store 'grpc://nix-store.geninf.io:50051': error: Nix daemon disconnected unexpectedly (maybe it crashed?)
failed eval checks.x86_64-linux.users —
error: … while evaluating the attribute 'drvPath' at «https://releases.nixos.org/nixpkgs/nixpkgs-26.11pre1080018.74435dcdae84/nixexprs.tar.xz?na …
error:
       … while evaluating the attribute 'drvPath'
         at «https://releases.nixos.org/nixpkgs/nixpkgs-26.11pre1080018.74435dcdae84/nixexprs.tar.xz?narHash=sha256-jeK2GCq4qI7IEHzPPjVKu/6A6A1KtrDCmRHubVOva3Y%3D»/lib/customisation.nix:416:11:
          415|         // {
          416|           drvPath =
             |           ^
          417|             assert condition;

       … while calling the 'derivationStrict' builtin
         at «nix-internal»/derivation-internal.nix:37:12:
           36|
           37|   strict = derivationStrict drvAttrs;
             |            ^
           38|

       … while evaluating the option `driverConfiguration.vlans':

       … while evaluating definitions from `/nix/store/l8kkq7bs1z6573zhjmvp3i95va6dckvv-source/nixos/lib/testing/driver-configuration.nix':

       … while evaluating the option `containers.server.networking.interfaces':

       … while evaluating definitions from `/nix/store/l8kkq7bs1z6573zhjmvp3i95va6dckvv-source/nixos/modules/hardware/facter/networking':

       … while evaluating the option `containers.server.hardware.facter.enable':

       … while evaluating the option `containers.server.hardware.facter.report':

       … while evaluating the option `containers.server.hardware.facter.reportPath':

       … while evaluating definitions from `/nix/store/09vi3r2iqhksnqjiw1z9d9yv3v6adbzi-source/nixosModules/clanCore/nixos-facter.nix':

       (stack trace truncated; use '--show-trace' to show the full, detailed trace)

       error: opening a connection to remote store 'grpc://nix-store.geninf.io:50051' previously failed
failed eval checks.x86_64-linux.wifi —
error: … while evaluating the attribute 'drvPath' at «https://releases.nixos.org/nixpkgs/nixpkgs-26.11pre1080018.74435dcdae84/nixexprs.tar.xz?na …
error:
       … while evaluating the attribute 'drvPath'
         at «https://releases.nixos.org/nixpkgs/nixpkgs-26.11pre1080018.74435dcdae84/nixexprs.tar.xz?narHash=sha256-jeK2GCq4qI7IEHzPPjVKu/6A6A1KtrDCmRHubVOva3Y%3D»/lib/customisation.nix:416:11:
          415|         // {
          416|           drvPath =
             |           ^
          417|             assert condition;

       … while calling the 'derivationStrict' builtin
         at «nix-internal»/derivation-internal.nix:37:12:
           36|
           37|   strict = derivationStrict drvAttrs;
             |            ^
           38|

       … while evaluating the option `driverConfiguration.vlans':

       … while evaluating definitions from `/nix/store/l8kkq7bs1z6573zhjmvp3i95va6dckvv-source/nixos/lib/testing/driver-configuration.nix':

       … while evaluating the option `nodes.second.networking.interfaces':

       … while evaluating definitions from `/nix/store/l8kkq7bs1z6573zhjmvp3i95va6dckvv-source/nixos/modules/hardware/facter/networking':

       … while evaluating the option `nodes.second.hardware.facter.enable':

       … while evaluating the option `nodes.second.hardware.facter.report':

       … while evaluating the option `nodes.second.hardware.facter.reportPath':

       … while evaluating definitions from `/nix/store/09vi3r2iqhksnqjiw1z9d9yv3v6adbzi-source/nixosModules/clanCore/nixos-facter.nix':

       (stack trace truncated; use '--show-trace' to show the full, detailed trace)

       error: opening a connection to remote store 'grpc://nix-store.geninf.io:50051' previously failed
failed eval checks.x86_64-linux.wireguard —
error: … while evaluating the attribute 'drvPath' at «https://releases.nixos.org/nixpkgs/nixpkgs-26.11pre1080018.74435dcdae84/nixexprs.tar.xz?na …
error:
       … while evaluating the attribute 'drvPath'
         at «https://releases.nixos.org/nixpkgs/nixpkgs-26.11pre1080018.74435dcdae84/nixexprs.tar.xz?narHash=sha256-jeK2GCq4qI7IEHzPPjVKu/6A6A1KtrDCmRHubVOva3Y%3D»/lib/customisation.nix:416:11:
          415|         // {
          416|           drvPath =
             |           ^
          417|             assert condition;

       … while calling the 'derivationStrict' builtin
         at «nix-internal»/derivation-internal.nix:37:12:
           36|
           37|   strict = derivationStrict drvAttrs;
             |            ^
           38|

       … while evaluating the option `driverConfiguration.vlans':

       … while evaluating definitions from `/nix/store/l8kkq7bs1z6573zhjmvp3i95va6dckvv-source/nixos/lib/testing/driver-configuration.nix':

       … while evaluating the option `containers.ctrl1.networking.interfaces':

       … while evaluating definitions from `/nix/store/l8kkq7bs1z6573zhjmvp3i95va6dckvv-source/nixos/modules/hardware/facter/networking':

       … while evaluating the option `containers.ctrl1.hardware.facter.enable':

       … while evaluating the option `containers.ctrl1.hardware.facter.report':

       … while evaluating the option `containers.ctrl1.hardware.facter.reportPath':

       … while evaluating definitions from `/nix/store/09vi3r2iqhksnqjiw1z9d9yv3v6adbzi-source/nixosModules/clanCore/nixos-facter.nix':

       (stack trace truncated; use '--show-trace' to show the full, detailed trace)

       error: opening a connection to remote store 'grpc://nix-store.geninf.io:50051' previously failed
failed eval checks.x86_64-linux.yggdrasil —
error: … while evaluating the attribute 'drvPath' at «https://releases.nixos.org/nixpkgs/nixpkgs-26.11pre1080018.74435dcdae84/nixexprs.tar.xz?na …
error:
       … while evaluating the attribute 'drvPath'
         at «https://releases.nixos.org/nixpkgs/nixpkgs-26.11pre1080018.74435dcdae84/nixexprs.tar.xz?narHash=sha256-jeK2GCq4qI7IEHzPPjVKu/6A6A1KtrDCmRHubVOva3Y%3D»/lib/customisation.nix:416:11:
          415|         // {
          416|           drvPath =
             |           ^
          417|             assert condition;

       … while calling the 'derivationStrict' builtin
         at «nix-internal»/derivation-internal.nix:37:12:
           36|
           37|   strict = derivationStrict drvAttrs;
             |            ^
           38|

       … while evaluating the option `driverConfiguration.vlans':

       … while evaluating definitions from `/nix/store/l8kkq7bs1z6573zhjmvp3i95va6dckvv-source/nixos/lib/testing/driver-configuration.nix':

       … while evaluating the option `nodes.outsider.networking.interfaces':

       … while evaluating definitions from `/nix/store/l8kkq7bs1z6573zhjmvp3i95va6dckvv-source/nixos/modules/hardware/facter/networking':

       … while evaluating the option `nodes.outsider.hardware.facter.enable':

       … while evaluating the option `nodes.outsider.hardware.facter.report':

       … while evaluating the option `nodes.outsider.hardware.facter.reportPath':

       … while evaluating definitions from `/nix/store/09vi3r2iqhksnqjiw1z9d9yv3v6adbzi-source/nixosModules/clanCore/nixos-facter.nix':

       (stack trace truncated; use '--show-trace' to show the full, detailed trace)

       error: opening a connection to remote store 'grpc://nix-store.geninf.io:50051' previously failed
failed eval checks.x86_64-linux.zerotier —
error: … while evaluating the attribute 'drvPath' at «https://releases.nixos.org/nixpkgs/nixpkgs-26.11pre1080018.74435dcdae84/nixexprs.tar.xz?na …
error:
       … while evaluating the attribute 'drvPath'
         at «https://releases.nixos.org/nixpkgs/nixpkgs-26.11pre1080018.74435dcdae84/nixexprs.tar.xz?narHash=sha256-jeK2GCq4qI7IEHzPPjVKu/6A6A1KtrDCmRHubVOva3Y%3D»/lib/customisation.nix:416:11:
          415|         // {
          416|           drvPath =
             |           ^
          417|             assert condition;

       … while calling the 'derivationStrict' builtin
         at «nix-internal»/derivation-internal.nix:37:12:
           36|
           37|   strict = derivationStrict drvAttrs;
             |            ^
           38|

       … while evaluating the option `driverConfiguration.vlans':

       … while evaluating definitions from `/nix/store/l8kkq7bs1z6573zhjmvp3i95va6dckvv-source/nixos/lib/testing/driver-configuration.nix':

       … while evaluating the option `nodes.controller.networking.interfaces':

       … while evaluating definitions from `/nix/store/l8kkq7bs1z6573zhjmvp3i95va6dckvv-source/nixos/modules/hardware/facter/networking':

       … while evaluating the option `nodes.controller.hardware.facter.enable':

       … while evaluating the option `nodes.controller.hardware.facter.report':

       … while evaluating the option `nodes.controller.hardware.facter.reportPath':

       … while evaluating definitions from `/nix/store/09vi3r2iqhksnqjiw1z9d9yv3v6adbzi-source/nixosModules/clanCore/nixos-facter.nix':

       (stack trace truncated; use '--show-trace' to show the full, detailed trace)

       error: opening a connection to remote store 'grpc://nix-store.geninf.io:50051' previously failed
failed eval checks.x86_64-linux.zerotier-multi-instance —
error: … while evaluating the attribute 'drvPath' at «https://releases.nixos.org/nixpkgs/nixpkgs-26.11pre1080018.74435dcdae84/nixexprs.tar.xz?na …
error:
       … while evaluating the attribute 'drvPath'
         at «https://releases.nixos.org/nixpkgs/nixpkgs-26.11pre1080018.74435dcdae84/nixexprs.tar.xz?narHash=sha256-jeK2GCq4qI7IEHzPPjVKu/6A6A1KtrDCmRHubVOva3Y%3D»/lib/customisation.nix:416:11:
          415|         // {
          416|           drvPath =
             |           ^
          417|             assert condition;

       … while calling the 'derivationStrict' builtin
         at «nix-internal»/derivation-internal.nix:37:12:
           36|
           37|   strict = derivationStrict drvAttrs;
             |            ^
           38|

       … while evaluating the option `driverConfiguration.vlans':

       … while evaluating definitions from `/nix/store/l8kkq7bs1z6573zhjmvp3i95va6dckvv-source/nixos/lib/testing/driver-configuration.nix':

       … while evaluating the option `nodes.alpha.networking.interfaces':

       … while evaluating definitions from `/nix/store/l8kkq7bs1z6573zhjmvp3i95va6dckvv-source/nixos/modules/hardware/facter/networking':

       … while evaluating the option `nodes.alpha.hardware.facter.enable':

       … while evaluating the option `nodes.alpha.hardware.facter.report':

       … while evaluating the option `nodes.alpha.hardware.facter.reportPath':

       … while evaluating definitions from `/nix/store/09vi3r2iqhksnqjiw1z9d9yv3v6adbzi-source/nixosModules/clanCore/nixos-facter.nix':

       (stack trace truncated; use '--show-trace' to show the full, detailed trace)

       error: opening a connection to remote store 'grpc://nix-store.geninf.io:50051' previously failed
38 succeeded ⚠ 2
succeeded attributes
status attribute duration
succeeded checks.aarch64-linux.all-packages
  • stdenv.isDarwin is deprecated, use stdenv.hostPlatform.isDarwin instead
13m 37s
succeeded checks.x86_64-linux.all-packages
  • stdenv.isDarwin is deprecated, use stdenv.hostPlatform.isDarwin instead
12m 50s
succeeded checks.aarch64-darwin.nixos-flash-installer 9m 13s
succeeded checks.aarch64-darwin.treefmt 1m 20s
succeeded checks.aarch64-linux.clan-pytest-with-core 11m 31s
succeeded checks.aarch64-linux.clan-pytest-without-core 8m 22s
succeeded checks.aarch64-linux.clan-site-lint 9m 31s
succeeded checks.aarch64-linux.clan-test-iso 17m 43s
succeeded checks.aarch64-linux.devshell 5s
succeeded checks.aarch64-linux.devShell-clan-cli 8m 13s
succeeded checks.aarch64-linux.devShell-clan-site 8m 8s
succeeded checks.aarch64-linux.devShell-default 8m 11s
succeeded checks.aarch64-linux.devShell-docs 6m 27s
succeeded checks.aarch64-linux.devShell-inventory-schema 8m 14s
succeeded checks.aarch64-linux.eval-tests 18m 4s
succeeded checks.aarch64-linux.nixos-documentation 8m 49s
succeeded checks.aarch64-linux.nixos-flash-installer 9m 13s
succeeded checks.aarch64-linux.treefmt 27s
succeeded checks.x86_64-linux.clan-pytest-with-core 11m 23s
succeeded checks.x86_64-linux.clan-pytest-without-core 8m 46s
succeeded checks.x86_64-linux.clan-site-lint 9m 17s
succeeded checks.x86_64-linux.clan-test-iso 16m 5s
succeeded checks.x86_64-linux.devshell 5s
succeeded checks.x86_64-linux.devShell-clan-cli 8m 42s
succeeded checks.x86_64-linux.devShell-clan-site 6m 43s
succeeded checks.x86_64-linux.devShell-default 8m 40s
succeeded checks.x86_64-linux.devShell-docs 8m 45s
succeeded checks.x86_64-linux.devShell-inventory-schema 8m 41s
succeeded checks.x86_64-linux.eval-tests 17m 42s
succeeded checks.x86_64-linux.nixos-documentation 6m 46s
succeeded checks.x86_64-linux.nixos-flash-installer 8m 48s
succeeded checks.x86_64-linux.nixos-test-flash 12m 6s
succeeded checks.x86_64-linux.nixos-test-flash-installer-boot 9m 22s
succeeded checks.x86_64-linux.nixos-test-installation 14m 22s
succeeded checks.x86_64-linux.nixos-test-installation-age 13m 11s
succeeded checks.x86_64-linux.nixos-test-installation-password-store 14m 19s
succeeded checks.x86_64-linux.nixos-test-update-hardware-configuration 10m 55s
succeeded checks.x86_64-linux.treefmt 14s
32 already built
skipped attributes
status attribute duration
loading…