clan/clan-core build #921 failed ← #920 #922 →
eval warnings
50 kinds
· 268 occurrences
- error …-merged-test-dir-borgbackup.drv: build01: build01: input not substitutable: error: path '/nix/store/…-test-vars-generated' is required, but there is no substituter that can build it, asking the scheduler again ×9
- error ×46
- error build of '/nix/store/…-merged-test-dir-borgbackup.drv^out' failed: error: gave up after 9 reschedules ×2
- error …-merged-test-dir-data-mesher.drv: build01: build01: input not substitutable: error: path '/nix/store/…-test-vars-generated' is required, but there is no substituter that can build it, asking the scheduler again ×9
- error …-merged-test-dir-admin.drv: error: gRPC AddMultipleToStore on 'nix-store.geninf.io:50051' failed: error: path '/nix/store/…-vm' is required, but there is no substituter that can build it ×1
- error build of '/nix/store/…-merged-test-dir-admin.drv^out' failed: error: error: gRPC AddMultipleToStore on 'nix-store.geninf.io:50051' failed: error: path '/nix/store/…-vm' is required, but there is no substituter that can build it ×1
- error …-merged-test-dir-certificates.drv: error: gRPC AddMultipleToStore on 'nix-store.geninf.io:50051' failed: error: path '/nix/store/…-vm' is required, but there is no substituter that can build it ×1
- error build of '/nix/store/…-merged-test-dir-certificates.drv^out' failed: error: error: gRPC AddMultipleToStore on 'nix-store.geninf.io:50051' failed: error: path '/nix/store/…-vm' is required, but there is no substituter that can build it ×1
- error …-merged-test-dir-garage.drv: build01: build01: input not substitutable: error: path '/nix/store/…-test-vars-generated' is required, but there is no substituter that can build it, asking the scheduler again ×9
- error …-merged-test-dir-service-machine-id.drv: build01: build01: input not substitutable: error: path '/nix/store/…-test-vars-generated' is required, but there is no substituter that can build it, asking the scheduler again ×9
- error …-merged-test-dir-dm-dns.drv: build01: build01: input not substitutable: error: path '/nix/store/…-test-vars-generated' is required, but there is no substituter that can build it, asking the scheduler again ×9
- error …-merged-test-dir-mycelium.drv: build01: build01: input not substitutable: error: path '/nix/store/…-test-vars-generated' is required, but there is no substituter that can build it, asking the scheduler again ×9
- error …-merged-test-dir-kde.drv: build01: build01: input not substitutable: error: path '/nix/store/…-test-vars-generated' is required, but there is no substituter that can build it, asking the scheduler again ×9
- error …-merged-test-dir-localbackup.drv: build01: build01: input not substitutable: error: path '/nix/store/…-test-vars-generated' is required, but there is no substituter that can build it, asking the scheduler again ×9
- error …-merged-test-dir-monitoring.drv: build01: build01: input not substitutable: error: path '/nix/store/…-test-vars-generated' is required, but there is no substituter that can build it, asking the scheduler again ×9
- error …-merged-test-dir-hello-service.drv: build01: build01: input not substitutable: error: path '/nix/store/…-test-vars-generated' is required, but there is no substituter that can build it, asking the scheduler again ×9
- error build of '/nix/store/…-merged-test-dir-data-mesher.drv^out' failed: error: gave up after 9 reschedules ×1
- error …-merged-test-dir-pki.drv: build01: build01: input not substitutable: error: path '/nix/store/…-test-vars-generated' is required, but there is no substituter that can build it, asking the scheduler again ×9
- error …-merged-test-dir-service-postgresql.drv: build01: build01: input not substitutable: error: path '/nix/store/…-test-vars-generated' is required, but there is no substituter that can build it, asking the scheduler again ×9
- error build of '/nix/store/…-merged-test-dir-garage.drv^out' failed: error: gave up after 9 reschedules ×2
- error …-merged-test-dir-service-dummy-test-from-flake.drv: build01: build01: input not substitutable: error: path '/nix/store/…-test-vars-generated' is required, but there is no substituter that can build it, asking the scheduler again ×9
- error build of '/nix/store/…-merged-test-dir-localbackup.drv^out' failed: error: gave up after 9 reschedules ×1
- error build of '/nix/store/…-merged-test-dir-service-machine-id.drv^out' failed: error: gave up after 9 reschedules ×1
- error build of '/nix/store/…-merged-test-dir-dm-dns.drv^out' failed: error: gave up after 9 reschedules ×1
- error build of '/nix/store/…-merged-test-dir-hello-service.drv^out' failed: error: gave up after 9 reschedules ×1
- error …-merged-test-dir-service-dummy-test.drv: build01: build01: input not substitutable: error: path '/nix/store/…-test-vars-generated' is required, but there is no substituter that can build it, asking the scheduler again ×9
- error …-merged-test-dir-service-state-version.drv: build01: build01: input not substitutable: error: path '/nix/store/…-test-vars-generated' is required, but there is no substituter that can build it, asking the scheduler again ×9
- error build of '/nix/store/…-merged-test-dir-mycelium.drv^out' failed: error: gave up after 9 reschedules ×1
- error build of '/nix/store/…-merged-test-dir-kde.drv^out' failed: error: gave up after 9 reschedules ×1
- error …-merged-test-dir-syncthing-service.drv: build01: build01: input not substitutable: error: path '/nix/store/…-test-vars-generated' is required, but there is no substituter that can build it, asking the scheduler again ×9
- error build of '/nix/store/…-merged-test-dir-monitoring.drv^out' failed: error: gave up after 9 reschedules ×2
- error …-merged-test-dir-users.drv: build01: build01: input not substitutable: error: path '/nix/store/…-test-vars-generated' is required, but there is no substituter that can build it, asking the scheduler again ×9
- error …-merged-test-dir-wifi.drv: build01: build01: input not substitutable: error: path '/nix/store/…-test-vars-generated' is required, but there is no substituter that can build it, asking the scheduler again ×9
- error …-merged-test-dir-matrix-synapse.drv: error: gRPC AddMultipleToStore on 'nix-store.geninf.io:50051' failed: error: path '/nix/store/…-vm' is required, but there is no substituter that can build it ×1
- error build of '/nix/store/…-merged-test-dir-matrix-synapse.drv^out' failed: error: error: gRPC AddMultipleToStore on 'nix-store.geninf.io:50051' failed: error: path '/nix/store/…-vm' is required, but there is no substituter that can build it ×1
- error build of '/nix/store/…-merged-test-dir-pki.drv^out' failed: error: gave up after 9 reschedules ×1
- error …-merged-test-dir-zerotier-multi-instance.drv: build01: build01: input not substitutable: error: path '/nix/store/…-test-vars-generated' is required, but there is no substituter that can build it, asking the scheduler again ×9
- error build of '/nix/store/…-merged-test-dir-service-postgresql.drv^out' failed: error: gave up after 9 reschedules ×1
- error build of '/nix/store/…-merged-test-dir-service-state-version.drv^out' failed: error: gave up after 9 reschedules ×1
- error …-merged-test-dir-admin.drv: build-x86-01: build-x86-01: input not substitutable: error: path '/nix/store/…-test-vars-generated' is required, but there is no substituter that can build it, asking the scheduler again ×7
- error …-merged-test-dir-borgbackup.drv: gi-build-x86-02: gi-build-x86-02: input not substitutable: error: path '/nix/store/…-test-vars-generated' is required, but there is no substituter that can build it, asking the scheduler again ×2
- error …-merged-test-dir-admin.drv: gi-build-x86-02: gi-build-x86-02: input not substitutable: error: path '/nix/store/…-test-vars-generated' is required, but there is no substituter that can build it, asking the scheduler again ×2
- error …-merged-test-dir-borgbackup.drv: build-x86-01: build-x86-01: input not substitutable: error: path '/nix/store/…-test-vars-generated' is required, but there is no substituter that can build it, asking the scheduler again ×7
- error build of '/nix/store/…-merged-test-dir-service-dummy-test.drv^out' failed: error: gave up after 9 reschedules ×2
- error build of '/nix/store/…-merged-test-dir-users.drv^out' failed: error: gave up after 9 reschedules ×2
- error build of '/nix/store/…-merged-test-dir-admin.drv^out' failed: error: gave up after 9 reschedules ×1
- error build of '/nix/store/…-merged-test-dir-wifi.drv^out' failed: error: gave up after 9 reschedules ×1
- error build of '/nix/store/…-merged-test-dir-syncthing-service.drv^out' failed: error: gave up after 9 reschedules ×1
- error build of '/nix/store/…-merged-test-dir-service-dummy-test-from-flake.drv^out' failed: error: gave up after 9 reschedules ×2
- warn stdenv.isDarwin is deprecated, use stdenv.hostPlatform.isDarwin instead ×2
56 failed ⚠ 1
| status | attribute | duration |
|---|---|---|
checks.aarch64-linux.all-packages
|
1m 59s | |
setup: h13v44v20b7g8gpa82lq3zvy19bw693m-all-packages.drv: build01: build01: input not substitutable: error: some references of path '/nix/store/0dbq2rfxzd8mcvi8 …setup: h13v44v20b7g8gpa82lq3zvy19bw693m-all-packages.drv: build01: build01: input not substitutable: error: some references of path '/nix/store/0dbq2rfxzd8mcvi8cmza9hwm19256szv-clan-edit-codium' could not be realised, asking the scheduler again h13v44v20b7g8gpa82lq3zvy19bw693m-all-packages.drv: build01: build01: input not substitutable: error: some references of path '/nix/store/0dbq2rfxzd8mcvi8cmza9hwm19256szv-clan-edit-codium' could not be realised, asking the scheduler again h13v44v20b7g8gpa82lq3zvy19bw693m-all-packages.drv: build01: build01: input not substitutable: error: some references of path '/nix/store/0dbq2rfxzd8mcvi8cmza9hwm19256szv-clan-edit-codium' could not be realised, asking the scheduler again h13v44v20b7g8gpa82lq3zvy19bw693m-all-packages.drv: build01: build01: input not substitutable: error: some references of path '/nix/store/0dbq2rfxzd8mcvi8cmza9hwm19256szv-clan-edit-codium' could not be realised, asking the scheduler again h13v44v20b7g8gpa82lq3zvy19bw693m-all-packages.drv: build01: build01: input not substitutable: error: some references of path '/nix/store/0dbq2rfxzd8mcvi8cmza9hwm19256szv-clan-edit-codium' could not be realised, asking the scheduler again h13v44v20b7g8gpa82lq3zvy19bw693m-all-packages.drv: build01: build01: input not substitutable: error: some references of path '/nix/store/0dbq2rfxzd8mcvi8cmza9hwm19256szv-clan-edit-codium' could not be realised, asking the scheduler again h13v44v20b7g8gpa82lq3zvy19bw693m-all-packages.drv: build01: build01: input not substitutable: error: some references of path '/nix/store/0dbq2rfxzd8mcvi8cmza9hwm19256szv-clan-edit-codium' could not be realised, asking the scheduler again error: gave up after 9 reschedules |
||
checks.aarch64-darwin.all-packages
|
2m 4s | |
setup: warning: cvqhr7vslf0ah6174z5xjqv1fmdi00gj-clan-cli-docs.drv: no connected, non-draining worker for system 'aarch64-darwin' offers features {}, the worker …setup: warning: cvqhr7vslf0ah6174z5xjqv1fmdi00gj-clan-cli-docs.drv: no connected, non-draining worker for system 'aarch64-darwin' offers features {}, the workers offer {}, waiting up to 120s for a worker warning: y5xk7jxryws908ybsh3mpw7dx3xzh77r-clan-core-flake.drv: no connected, non-draining worker for system 'aarch64-darwin' offers features {}, the workers offer {}, waiting up to 120s for a worker 29hrqljpxybxmyd8nq6mp5dbmnq9ahqw-clan-cli-source.drv: no connected, non-draining worker for system 'aarch64-darwin' offers features {}, the workers offer {} 4g7q8d9xl7ks045bfrlnnljk1am6scky-clan-ts-api.drv: no connected, non-draining worker for system 'aarch64-darwin' offers features {}, the workers offer {} 4psgxad4qqjdyzsi9kkp8pbbkdpbfh4a-clan-cli-source.drv: no connected, non-draining worker for system 'aarch64-darwin' offers features {}, the workers offer {} cvqhr7vslf0ah6174z5xjqv1fmdi00gj-clan-cli-docs.drv: no connected, non-draining worker for system 'aarch64-darwin' offers features {}, the workers offer {} y5xk7jxryws908ybsh3mpw7dx3xzh77r-clan-core-flake.drv: no connected, non-draining worker for system 'aarch64-darwin' offers features {}, the workers offer {} error: dependency 'cvqhr7vslf0ah6174z5xjqv1fmdi00gj-clan-cli-docs.drv' failed |
||
checks.aarch64-darwin.clan-pytest-with-core
|
2m 2s | |
setup: don't know how to build these paths: /nix/store/vnx78zba1dxc4r50sa9qy6hwkqfizcnd-clan-pytest-with-core.drv warning: ignoring the client-specified setti …setup: don't know how to build these paths: /nix/store/vnx78zba1dxc4r50sa9qy6hwkqfizcnd-clan-pytest-with-core.drv warning: ignoring the client-specified setting 'store', because it is a restricted setting and you are not a trusted user warning: 2jmhfhg682zxbm262kip6jnip7f7hbf1-clan-core-flake.drv: no connected, non-draining worker for system 'aarch64-darwin' offers features {}, the workers offer {}, waiting up to 120s for a worker warning: 75ky67dh2k2zy3p5z6lgh95vv7jp0jsg-clan-cli-source.drv: no connected, non-draining worker for system 'aarch64-darwin' offers features {}, the workers offer {}, waiting up to 120s for a worker 2jmhfhg682zxbm262kip6jnip7f7hbf1-clan-core-flake.drv: no connected, non-draining worker for system 'aarch64-darwin' offers features {}, the workers offer {} 75ky67dh2k2zy3p5z6lgh95vv7jp0jsg-clan-cli-source.drv: no connected, non-draining worker for system 'aarch64-darwin' offers features {}, the workers offer {} error: dependency '2jmhfhg682zxbm262kip6jnip7f7hbf1-clan-core-flake.drv' failed |
||
checks.aarch64-darwin.clan-pytest-without-core
|
2m 1s | |
setup: don't know how to build these paths: /nix/store/8ac2vs5wfqh5kb9fi4wchljqia4s9ryr-clan-pytest-without-core.drv warning: ignoring the client-specified se …setup: don't know how to build these paths: /nix/store/8ac2vs5wfqh5kb9fi4wchljqia4s9ryr-clan-pytest-without-core.drv warning: ignoring the client-specified setting 'store', because it is a restricted setting and you are not a trusted user warning: 75ky67dh2k2zy3p5z6lgh95vv7jp0jsg-clan-cli-source.drv: no connected, non-draining worker for system 'aarch64-darwin' offers features {}, the workers offer {}, waiting up to 120s for a worker 75ky67dh2k2zy3p5z6lgh95vv7jp0jsg-clan-cli-source.drv: no connected, non-draining worker for system 'aarch64-darwin' offers features {}, the workers offer {} error: dependency '75ky67dh2k2zy3p5z6lgh95vv7jp0jsg-clan-cli-source.drv' failed |
||
checks.aarch64-darwin.devshell
|
2m 3s | |
setup: don't know how to build these paths: /nix/store/4r5hv59rx1kf5z49p91s83p5w5z3yhh3-check-devshell-not-depends-on-clan-cli.drv warning: ignoring the clien …setup: don't know how to build these paths: /nix/store/4r5hv59rx1kf5z49p91s83p5w5z3yhh3-check-devshell-not-depends-on-clan-cli.drv warning: ignoring the client-specified setting 'store', because it is a restricted setting and you are not a trusted user warning: 4psgxad4qqjdyzsi9kkp8pbbkdpbfh4a-clan-cli-source.drv: no connected, non-draining worker for system 'aarch64-darwin' offers features {}, the workers offer {}, waiting up to 120s for a worker 4psgxad4qqjdyzsi9kkp8pbbkdpbfh4a-clan-cli-source.drv: no connected, non-draining worker for system 'aarch64-darwin' offers features {}, the workers offer {} error: dependency 'zvr8zy07wbbaf5gis1iimjmm8n7b1spd-clan-cli.drv' failed |
||
checks.aarch64-darwin.devShell-clan-site
|
2m 1s | |
setup: don't know how to build these paths: /nix/store/q32ydlc2xsj9w2l3lv0dp0ddn3fk11ka-nix-shell.drv warning: ignoring the client-specified setting 'store', …setup: don't know how to build these paths: /nix/store/q32ydlc2xsj9w2l3lv0dp0ddn3fk11ka-nix-shell.drv warning: ignoring the client-specified setting 'store', because it is a restricted setting and you are not a trusted user warning: 4psgxad4qqjdyzsi9kkp8pbbkdpbfh4a-clan-cli-source.drv: no connected, non-draining worker for system 'aarch64-darwin' offers features {}, the workers offer {}, waiting up to 120s for a worker warning: cvqhr7vslf0ah6174z5xjqv1fmdi00gj-clan-cli-docs.drv: no connected, non-draining worker for system 'aarch64-darwin' offers features {}, the workers offer {}, waiting up to 120s for a worker 4psgxad4qqjdyzsi9kkp8pbbkdpbfh4a-clan-cli-source.drv: no connected, non-draining worker for system 'aarch64-darwin' offers features {}, the workers offer {} cvqhr7vslf0ah6174z5xjqv1fmdi00gj-clan-cli-docs.drv: no connected, non-draining worker for system 'aarch64-darwin' offers features {}, the workers offer {} error: dependency 'vj0zbrbag9yic6wwbfn9nq0vsj9dx15y-generated-docs.drv' failed |
||
checks.aarch64-darwin.eval-tests
|
2m 1s | |
setup: don't know how to build these paths: /nix/store/qmfkwalsm8w98bvkn6kpash1mklbc3p3-eval-tests-aarch64-darwin.drv warning: ignoring the client-specified s …setup: don't know how to build these paths: /nix/store/qmfkwalsm8w98bvkn6kpash1mklbc3p3-eval-tests-aarch64-darwin.drv warning: ignoring the client-specified setting 'store', because it is a restricted setting and you are not a trusted user warning: grbvy5gc7ry43pf9v9s5fll64wk9z5k0-evalCheck-eval-lib-build-clan.drv: no connected, non-draining worker for system 'aarch64-darwin' offers features {}, the workers offer {}, waiting up to 120s for a worker warning: lg07qrny566x6xdgmgzgz32b6dm5h3z8-evalCheck-eval-tests-syncthing.drv: no connected, non-draining worker for system 'aarch64-darwin' offers features {}, the workers offer {}, waiting up to 120s for a worker grbvy5gc7ry43pf9v9s5fll64wk9z5k0-evalCheck-eval-lib-build-clan.drv: no connected, non-draining worker for system 'aarch64-darwin' offers features {}, the workers offer {} lg07qrny566x6xdgmgzgz32b6dm5h3z8-evalCheck-eval-tests-syncthing.drv: no connected, non-draining worker for system 'aarch64-darwin' offers features {}, the workers offer {} error: dependency 'grbvy5gc7ry43pf9v9s5fll64wk9z5k0-evalCheck-eval-lib-build-clan.drv' failed |
||
checks.aarch64-darwin.treefmt
|
2m 1s | |
setup: don't know how to build these paths: /nix/store/zcjkmq8xl9s57clndwhr5fpy3b6kwbhd-treefmt-check.drv warning: ignoring the client-specified setting 'stor …setup: don't know how to build these paths: /nix/store/zcjkmq8xl9s57clndwhr5fpy3b6kwbhd-treefmt-check.drv warning: ignoring the client-specified setting 'store', because it is a restricted setting and you are not a trusted user warning: zcjkmq8xl9s57clndwhr5fpy3b6kwbhd-treefmt-check.drv: no connected, non-draining worker for system 'aarch64-darwin' offers features {}, the workers offer {}, waiting up to 120s for a worker zcjkmq8xl9s57clndwhr5fpy3b6kwbhd-treefmt-check.drv: no connected, non-draining worker for system 'aarch64-darwin' offers features {}, the workers offer {} error: no connected, non-draining worker for system 'aarch64-darwin' offers features {}, the workers offer {} |
||
checks.aarch64-linux.admin
|
— | |
error: … while evaluating the attribute 'drvPath' at «https://releases.nixos.org/nixpkgs/nixpkgs-26.11pre1085827.aa48d3470809/nixexprs.tar.xz?na …error:
… while evaluating the attribute 'drvPath'
at «https://releases.nixos.org/nixpkgs/nixpkgs-26.11pre1085827.aa48d3470809/nixexprs.tar.xz?narHash=sha256-R4B%2BRRYmze9htmPZ8xeF19mchTSH99GdaqanKCW8CF8%3D»/lib/customisation.nix:416:11:
415| // {
416| drvPath =
| ^
417| assert condition;
… while calling the 'derivationStrict' builtin
at «nix-internal»/derivation-internal.nix:37:12:
36|
37| strict = derivationStrict drvAttrs;
| ^
38|
… while evaluating the option `driverConfiguration.vlans':
… while evaluating definitions from `/nix/store/vlhb7haagkjabf20g1vg9kxi53fcpi17-source/nixos/lib/testing/driver-configuration.nix':
… while evaluating the option `containers.client.networking.interfaces':
… while evaluating definitions from `/nix/store/vlhb7haagkjabf20g1vg9kxi53fcpi17-source/nixos/modules/hardware/facter/networking':
… while evaluating the option `containers.client.hardware.facter.enable':
… while evaluating the option `containers.client.hardware.facter.report':
… while evaluating the option `containers.client.hardware.facter.reportPath':
… while evaluating definitions from `/nix/store/rdgc1j2f1j05idz4l97fp775910gcjxd-source/nixosModules/clanCore/nixos-facter.nix':
(stack trace truncated; use '--show-trace' to show the full, detailed trace)
error: build of '/nix/store/nzljmbmyjqam1ricrqlv38l0a7w6vr4z-merged-test-dir-admin.drv^out' failed: error: error: gRPC AddMultipleToStore on 'nix-store.geninf.io:50051' failed: error: path '/nix/store/s9qqxx58i9jh6ra183v64sw77p38mxi2-vm' is required, but there is no substituter that can build it
|
||
checks.aarch64-linux.borgbackup
|
— | |
error: … while evaluating the attribute 'drvPath' at «https://releases.nixos.org/nixpkgs/nixpkgs-26.11pre1085827.aa48d3470809/nixexprs.tar.xz?na …error:
… while evaluating the attribute 'drvPath'
at «https://releases.nixos.org/nixpkgs/nixpkgs-26.11pre1085827.aa48d3470809/nixexprs.tar.xz?narHash=sha256-R4B%2BRRYmze9htmPZ8xeF19mchTSH99GdaqanKCW8CF8%3D»/lib/customisation.nix:416:11:
415| // {
416| drvPath =
| ^
417| assert condition;
… while calling the 'derivationStrict' builtin
at «nix-internal»/derivation-internal.nix:37:12:
36|
37| strict = derivationStrict drvAttrs;
| ^
38|
… while evaluating the option `driverConfiguration.vlans':
… while evaluating definitions from `/nix/store/vlhb7haagkjabf20g1vg9kxi53fcpi17-source/nixos/lib/testing/driver-configuration.nix':
… while evaluating the option `containers.clientone.networking.interfaces':
… while evaluating definitions from `/nix/store/vlhb7haagkjabf20g1vg9kxi53fcpi17-source/nixos/modules/hardware/facter/networking':
… while evaluating the option `containers.clientone.hardware.facter.enable':
… while evaluating the option `containers.clientone.hardware.facter.report':
… while evaluating the option `containers.clientone.hardware.facter.reportPath':
… while evaluating definitions from `/nix/store/rdgc1j2f1j05idz4l97fp775910gcjxd-source/nixosModules/clanCore/nixos-facter.nix':
(stack trace truncated; use '--show-trace' to show the full, detailed trace)
error: build of '/nix/store/yzllyxpx7yx5charhhknhx1h80dgzrks-merged-test-dir-borgbackup.drv^out' failed: error: gave up after 9 reschedules
|
||
checks.aarch64-linux.certificates
|
— | |
error: … while evaluating the attribute 'drvPath' at «https://releases.nixos.org/nixpkgs/nixpkgs-26.11pre1085827.aa48d3470809/nixexprs.tar.xz?na …error:
… while evaluating the attribute 'drvPath'
at «https://releases.nixos.org/nixpkgs/nixpkgs-26.11pre1085827.aa48d3470809/nixexprs.tar.xz?narHash=sha256-R4B%2BRRYmze9htmPZ8xeF19mchTSH99GdaqanKCW8CF8%3D»/lib/customisation.nix:416:11:
415| // {
416| drvPath =
| ^
417| assert condition;
… while calling the 'derivationStrict' builtin
at «nix-internal»/derivation-internal.nix:37:12:
36|
37| strict = derivationStrict drvAttrs;
| ^
38|
… while evaluating the option `driverConfiguration.vlans':
… while evaluating definitions from `/nix/store/vlhb7haagkjabf20g1vg9kxi53fcpi17-source/nixos/lib/testing/driver-configuration.nix':
… while evaluating the option `containers.ca.networking.interfaces':
… while evaluating definitions from `/nix/store/vlhb7haagkjabf20g1vg9kxi53fcpi17-source/nixos/modules/hardware/facter/networking':
… while evaluating the option `containers.ca.hardware.facter.enable':
… while evaluating the option `containers.ca.hardware.facter.report':
… while evaluating the option `containers.ca.hardware.facter.reportPath':
… while evaluating definitions from `/nix/store/rdgc1j2f1j05idz4l97fp775910gcjxd-source/nixosModules/clanCore/nixos-facter.nix':
(stack trace truncated; use '--show-trace' to show the full, detailed trace)
error: build of '/nix/store/4cjqx89wv5gl1n537rqbfylvxh7brw05-merged-test-dir-certificates.drv^out' failed: error: error: gRPC AddMultipleToStore on 'nix-store.geninf.io:50051' failed: error: path '/nix/store/q16hqpqkcvd6dc41pysvnaawxnabwr62-vm' is required, but there is no substituter that can build it
|
||
checks.aarch64-linux.clan-pytest-with-core
|
42s | |
setup: 1c520zv0qma06ws5pb6zxg1vgva4a44f-clan-pytest-with-core.drv: build01: build01: input not substitutable: error: path '/nix/store/n454j5iffrixcgwk5fq5rgg31k …setup: 1c520zv0qma06ws5pb6zxg1vgva4a44f-clan-pytest-with-core.drv: build01: build01: input not substitutable: error: path '/nix/store/n454j5iffrixcgwk5fq5rgg31k57qd1y-closure-info' is required, but there is no substituter that can build it, asking the scheduler again 1c520zv0qma06ws5pb6zxg1vgva4a44f-clan-pytest-with-core.drv: build01: build01: input not substitutable: error: path '/nix/store/n454j5iffrixcgwk5fq5rgg31k57qd1y-closure-info' is required, but there is no substituter that can build it, asking the scheduler again 1c520zv0qma06ws5pb6zxg1vgva4a44f-clan-pytest-with-core.drv: build01: build01: input not substitutable: error: path '/nix/store/n454j5iffrixcgwk5fq5rgg31k57qd1y-closure-info' is required, but there is no substituter that can build it, asking the scheduler again 1c520zv0qma06ws5pb6zxg1vgva4a44f-clan-pytest-with-core.drv: build01: build01: input not substitutable: error: path '/nix/store/n454j5iffrixcgwk5fq5rgg31k57qd1y-closure-info' is required, but there is no substituter that can build it, asking the scheduler again 1c520zv0qma06ws5pb6zxg1vgva4a44f-clan-pytest-with-core.drv: build01: build01: input not substitutable: error: path '/nix/store/n454j5iffrixcgwk5fq5rgg31k57qd1y-closure-info' is required, but there is no substituter that can build it, asking the scheduler again 1c520zv0qma06ws5pb6zxg1vgva4a44f-clan-pytest-with-core.drv: build01: build01: input not substitutable: error: path '/nix/store/n454j5iffrixcgwk5fq5rgg31k57qd1y-closure-info' is required, but there is no substituter that can build it, asking the scheduler again 1c520zv0qma06ws5pb6zxg1vgva4a44f-clan-pytest-with-core.drv: build01: build01: input not substitutable: error: path '/nix/store/n454j5iffrixcgwk5fq5rgg31k57qd1y-closure-info' is required, but there is no substituter that can build it, asking the scheduler again error: gave up after 9 reschedules |
||
checks.aarch64-linux.clan-test-iso
|
43s | |
setup: 4hlpsb8l21c8ab404g41bh6ncdbfa5nl-closure-info.drv: build01: build01: input not substitutable: error: path '/nix/store/0gg721x93sid7nlrgkp2ji8z5hvzxljs-un …setup: 4hlpsb8l21c8ab404g41bh6ncdbfa5nl-closure-info.drv: build01: build01: input not substitutable: error: path '/nix/store/0gg721x93sid7nlrgkp2ji8z5hvzxljs-unit-generate-shutdown-ramfs.service' is required, but there is no substituter that can build it, asking the scheduler again 4hlpsb8l21c8ab404g41bh6ncdbfa5nl-closure-info.drv: build01: build01: input not substitutable: error: path '/nix/store/0gg721x93sid7nlrgkp2ji8z5hvzxljs-unit-generate-shutdown-ramfs.service' is required, but there is no substituter that can build it, asking the scheduler again 4hlpsb8l21c8ab404g41bh6ncdbfa5nl-closure-info.drv: build01: build01: input not substitutable: error: path '/nix/store/0gg721x93sid7nlrgkp2ji8z5hvzxljs-unit-generate-shutdown-ramfs.service' is required, but there is no substituter that can build it, asking the scheduler again 4hlpsb8l21c8ab404g41bh6ncdbfa5nl-closure-info.drv: build01: build01: input not substitutable: error: path '/nix/store/0gg721x93sid7nlrgkp2ji8z5hvzxljs-unit-generate-shutdown-ramfs.service' is required, but there is no substituter that can build it, asking the scheduler again 4hlpsb8l21c8ab404g41bh6ncdbfa5nl-closure-info.drv: build01: build01: input not substitutable: error: path '/nix/store/0gg721x93sid7nlrgkp2ji8z5hvzxljs-unit-generate-shutdown-ramfs.service' is required, but there is no substituter that can build it, asking the scheduler again 4hlpsb8l21c8ab404g41bh6ncdbfa5nl-closure-info.drv: build01: build01: input not substitutable: error: path '/nix/store/0gg721x93sid7nlrgkp2ji8z5hvzxljs-unit-generate-shutdown-ramfs.service' is required, but there is no substituter that can build it, asking the scheduler again ikrq38zcawam49h7sa3pw7jb5yfbasrn-clan-cli-source.drv: build01: not scheduled here: ikrq38zcawam49h7sa3pw7jb5yfbasrn-clan-cli-source.drv, asking the scheduler again error: dependency 'kd77jfzb855j82mvybhhvgr9dzsjnf2f-nixos-test-driver-clan-test-iso.drv' failed |
||
checks.aarch64-linux.data-mesher
|
— | |
error: … while evaluating the attribute 'drvPath' at «https://releases.nixos.org/nixpkgs/nixpkgs-26.11pre1085827.aa48d3470809/nixexprs.tar.xz?na …error:
… while evaluating the attribute 'drvPath'
at «https://releases.nixos.org/nixpkgs/nixpkgs-26.11pre1085827.aa48d3470809/nixexprs.tar.xz?narHash=sha256-R4B%2BRRYmze9htmPZ8xeF19mchTSH99GdaqanKCW8CF8%3D»/lib/customisation.nix:416:11:
415| // {
416| drvPath =
| ^
417| assert condition;
… while calling the 'derivationStrict' builtin
at «nix-internal»/derivation-internal.nix:37:12:
36|
37| strict = derivationStrict drvAttrs;
| ^
38|
… while evaluating the option `driverConfiguration.vlans':
… while evaluating definitions from `/nix/store/vlhb7haagkjabf20g1vg9kxi53fcpi17-source/nixos/lib/testing/driver-configuration.nix':
… while evaluating the option `containers.alpha.networking.interfaces':
… while evaluating definitions from `/nix/store/vlhb7haagkjabf20g1vg9kxi53fcpi17-source/nixos/modules/hardware/facter/networking':
… while evaluating the option `containers.alpha.hardware.facter.enable':
… while evaluating the option `containers.alpha.hardware.facter.report':
… while evaluating the option `containers.alpha.hardware.facter.reportPath':
… while evaluating definitions from `/nix/store/rdgc1j2f1j05idz4l97fp775910gcjxd-source/nixosModules/clanCore/nixos-facter.nix':
(stack trace truncated; use '--show-trace' to show the full, detailed trace)
error: build of '/nix/store/vix2rxv6qbhxbzhdcraiaik9j9fk50bj-merged-test-dir-data-mesher.drv^out' failed: error: gave up after 9 reschedules
|
||
checks.aarch64-linux.dm-dns
|
— | |
error: … while evaluating the attribute 'drvPath' at «https://releases.nixos.org/nixpkgs/nixpkgs-26.11pre1085827.aa48d3470809/nixexprs.tar.xz?na …error:
… while evaluating the attribute 'drvPath'
at «https://releases.nixos.org/nixpkgs/nixpkgs-26.11pre1085827.aa48d3470809/nixexprs.tar.xz?narHash=sha256-R4B%2BRRYmze9htmPZ8xeF19mchTSH99GdaqanKCW8CF8%3D»/lib/customisation.nix:416:11:
415| // {
416| drvPath =
| ^
417| assert condition;
… while calling the 'derivationStrict' builtin
at «nix-internal»/derivation-internal.nix:37:12:
36|
37| strict = derivationStrict drvAttrs;
| ^
38|
… while evaluating the option `driverConfiguration.vlans':
… while evaluating definitions from `/nix/store/vlhb7haagkjabf20g1vg9kxi53fcpi17-source/nixos/lib/testing/driver-configuration.nix':
… while evaluating the option `containers.client.networking.interfaces':
… while evaluating definitions from `/nix/store/vlhb7haagkjabf20g1vg9kxi53fcpi17-source/nixos/modules/hardware/facter/networking':
… while evaluating the option `containers.client.hardware.facter.enable':
… while evaluating the option `containers.client.hardware.facter.report':
… while evaluating the option `containers.client.hardware.facter.reportPath':
… while evaluating definitions from `/nix/store/rdgc1j2f1j05idz4l97fp775910gcjxd-source/nixosModules/clanCore/nixos-facter.nix':
(stack trace truncated; use '--show-trace' to show the full, detailed trace)
error: build of '/nix/store/d5almx1kbj048lc954ydsais4g48mjcj-merged-test-dir-dm-dns.drv^out' failed: error: gave up after 9 reschedules
|
||
checks.aarch64-linux.dyndns
|
— | |
error: … while evaluating the attribute 'drvPath' at «https://releases.nixos.org/nixpkgs/nixpkgs-26.11pre1085827.aa48d3470809/nixexprs.tar.xz?na …error:
… while evaluating the attribute 'drvPath'
at «https://releases.nixos.org/nixpkgs/nixpkgs-26.11pre1085827.aa48d3470809/nixexprs.tar.xz?narHash=sha256-R4B%2BRRYmze9htmPZ8xeF19mchTSH99GdaqanKCW8CF8%3D»/lib/customisation.nix:416:11:
415| // {
416| drvPath =
| ^
417| assert condition;
… while calling the 'derivationStrict' builtin
at «nix-internal»/derivation-internal.nix:37:12:
36|
37| strict = derivationStrict drvAttrs;
| ^
38|
… while evaluating the option `driverConfiguration.vlans':
… while evaluating definitions from `/nix/store/vlhb7haagkjabf20g1vg9kxi53fcpi17-source/nixos/lib/testing/driver-configuration.nix':
… while evaluating the option `containers.server.networking.interfaces':
… while evaluating definitions from `/nix/store/vlhb7haagkjabf20g1vg9kxi53fcpi17-source/nixos/modules/hardware/facter/networking':
… while evaluating the option `containers.server.hardware.facter.enable':
… while evaluating the option `containers.server.hardware.facter.report':
… while evaluating the option `containers.server.hardware.facter.reportPath':
… while evaluating definitions from `/nix/store/rdgc1j2f1j05idz4l97fp775910gcjxd-source/nixosModules/clanCore/nixos-facter.nix':
(stack trace truncated; use '--show-trace' to show the full, detailed trace)
error: build of '/nix/store/q1h8mm06ana3jj6ljhmhy9apaa9h0kli-merged-test-dir-dyndns.drv^out' failed: error: error: gRPC AddMultipleToStore on 'nix-store.geninf.io:50051' failed: error: path '/nix/store/7w43kv9n44l91xjg9x0pmqqldk6k95pb-vm' is required, but there is no substituter that can build it
|
||
checks.aarch64-linux.garage
|
— | |
error: … while evaluating the attribute 'drvPath' at «https://releases.nixos.org/nixpkgs/nixpkgs-26.11pre1085827.aa48d3470809/nixexprs.tar.xz?na …error:
… while evaluating the attribute 'drvPath'
at «https://releases.nixos.org/nixpkgs/nixpkgs-26.11pre1085827.aa48d3470809/nixexprs.tar.xz?narHash=sha256-R4B%2BRRYmze9htmPZ8xeF19mchTSH99GdaqanKCW8CF8%3D»/lib/customisation.nix:416:11:
415| // {
416| drvPath =
| ^
417| assert condition;
… while calling the 'derivationStrict' builtin
at «nix-internal»/derivation-internal.nix:37:12:
36|
37| strict = derivationStrict drvAttrs;
| ^
38|
… while evaluating the option `driverConfiguration.vlans':
… while evaluating definitions from `/nix/store/vlhb7haagkjabf20g1vg9kxi53fcpi17-source/nixos/lib/testing/driver-configuration.nix':
… while evaluating the option `containers.server.networking.interfaces':
… while evaluating definitions from `/nix/store/vlhb7haagkjabf20g1vg9kxi53fcpi17-source/nixos/modules/hardware/facter/networking':
… while evaluating the option `containers.server.hardware.facter.enable':
… while evaluating the option `containers.server.hardware.facter.report':
… while evaluating the option `containers.server.hardware.facter.reportPath':
… while evaluating definitions from `/nix/store/rdgc1j2f1j05idz4l97fp775910gcjxd-source/nixosModules/clanCore/nixos-facter.nix':
(stack trace truncated; use '--show-trace' to show the full, detailed trace)
error: build of '/nix/store/pxwv2ysglq7205k0pn3rzmv4k07k9nz9-merged-test-dir-garage.drv^out' failed: error: gave up after 9 reschedules
|
||
checks.aarch64-linux.hello-service
|
— | |
error: … while evaluating the attribute 'drvPath' at «https://releases.nixos.org/nixpkgs/nixpkgs-26.11pre1085827.aa48d3470809/nixexprs.tar.xz?na …error:
… while evaluating the attribute 'drvPath'
at «https://releases.nixos.org/nixpkgs/nixpkgs-26.11pre1085827.aa48d3470809/nixexprs.tar.xz?narHash=sha256-R4B%2BRRYmze9htmPZ8xeF19mchTSH99GdaqanKCW8CF8%3D»/lib/customisation.nix:416:11:
415| // {
416| drvPath =
| ^
417| assert condition;
… while calling the 'derivationStrict' builtin
at «nix-internal»/derivation-internal.nix:37:12:
36|
37| strict = derivationStrict drvAttrs;
| ^
38|
… while evaluating the option `driverConfiguration.vlans':
… while evaluating definitions from `/nix/store/vlhb7haagkjabf20g1vg9kxi53fcpi17-source/nixos/lib/testing/driver-configuration.nix':
… while evaluating the option `containers.peer1.networking.interfaces':
… while evaluating definitions from `/nix/store/vlhb7haagkjabf20g1vg9kxi53fcpi17-source/nixos/modules/hardware/facter/networking':
… while evaluating the option `containers.peer1.hardware.facter.enable':
… while evaluating the option `containers.peer1.hardware.facter.report':
… while evaluating the option `containers.peer1.hardware.facter.reportPath':
… while evaluating definitions from `/nix/store/rdgc1j2f1j05idz4l97fp775910gcjxd-source/nixosModules/clanCore/nixos-facter.nix':
(stack trace truncated; use '--show-trace' to show the full, detailed trace)
error: build of '/nix/store/w57zn5d5mvjpj5m3vx6ha3l25anzmm6j-merged-test-dir-hello-service.drv^out' failed: error: gave up after 9 reschedules
|
||
checks.aarch64-linux.kde
|
— | |
error: … while evaluating the attribute 'drvPath' at «https://releases.nixos.org/nixpkgs/nixpkgs-26.11pre1085827.aa48d3470809/nixexprs.tar.xz?na …error:
… while evaluating the attribute 'drvPath'
at «https://releases.nixos.org/nixpkgs/nixpkgs-26.11pre1085827.aa48d3470809/nixexprs.tar.xz?narHash=sha256-R4B%2BRRYmze9htmPZ8xeF19mchTSH99GdaqanKCW8CF8%3D»/lib/customisation.nix:416:11:
415| // {
416| drvPath =
| ^
417| assert condition;
… while calling the 'derivationStrict' builtin
at «nix-internal»/derivation-internal.nix:37:12:
36|
37| strict = derivationStrict drvAttrs;
| ^
38|
… while evaluating the option `driverConfiguration.vlans':
… while evaluating definitions from `/nix/store/vlhb7haagkjabf20g1vg9kxi53fcpi17-source/nixos/lib/testing/driver-configuration.nix':
… while evaluating the option `containers.client.networking.interfaces':
… while evaluating definitions from `/nix/store/vlhb7haagkjabf20g1vg9kxi53fcpi17-source/nixos/modules/hardware/facter/networking':
… while evaluating the option `containers.client.hardware.facter.enable':
… while evaluating the option `containers.client.hardware.facter.report':
… while evaluating the option `containers.client.hardware.facter.reportPath':
… while evaluating definitions from `/nix/store/rdgc1j2f1j05idz4l97fp775910gcjxd-source/nixosModules/clanCore/nixos-facter.nix':
(stack trace truncated; use '--show-trace' to show the full, detailed trace)
error: build of '/nix/store/7ss8jk5j8lvlkvz9z21kmdvs01hrphhs-merged-test-dir-kde.drv^out' failed: error: gave up after 9 reschedules
|
||
checks.aarch64-linux.localbackup
|
— | |
error: … while evaluating the attribute 'drvPath' at «https://releases.nixos.org/nixpkgs/nixpkgs-26.11pre1085827.aa48d3470809/nixexprs.tar.xz?na …error:
… while evaluating the attribute 'drvPath'
at «https://releases.nixos.org/nixpkgs/nixpkgs-26.11pre1085827.aa48d3470809/nixexprs.tar.xz?narHash=sha256-R4B%2BRRYmze9htmPZ8xeF19mchTSH99GdaqanKCW8CF8%3D»/lib/customisation.nix:416:11:
415| // {
416| drvPath =
| ^
417| assert condition;
… while calling the 'derivationStrict' builtin
at «nix-internal»/derivation-internal.nix:37:12:
36|
37| strict = derivationStrict drvAttrs;
| ^
38|
… while evaluating the option `driverConfiguration.vlans':
… while evaluating definitions from `/nix/store/vlhb7haagkjabf20g1vg9kxi53fcpi17-source/nixos/lib/testing/driver-configuration.nix':
… while evaluating the option `containers.machine.networking.interfaces':
… while evaluating definitions from `/nix/store/vlhb7haagkjabf20g1vg9kxi53fcpi17-source/nixos/modules/hardware/facter/networking':
… while evaluating the option `containers.machine.hardware.facter.enable':
… while evaluating the option `containers.machine.hardware.facter.report':
… while evaluating the option `containers.machine.hardware.facter.reportPath':
… while evaluating definitions from `/nix/store/rdgc1j2f1j05idz4l97fp775910gcjxd-source/nixosModules/clanCore/nixos-facter.nix':
(stack trace truncated; use '--show-trace' to show the full, detailed trace)
error: build of '/nix/store/5m2vgn4i1s4amwk8pnrgs25mzmiqbvr0-merged-test-dir-localbackup.drv^out' failed: error: gave up after 9 reschedules
|
||
checks.aarch64-linux.machine-id
|
— | |
error: … while evaluating the attribute 'drvPath' at «https://releases.nixos.org/nixpkgs/nixpkgs-26.11pre1085827.aa48d3470809/nixexprs.tar.xz?na …error:
… while evaluating the attribute 'drvPath'
at «https://releases.nixos.org/nixpkgs/nixpkgs-26.11pre1085827.aa48d3470809/nixexprs.tar.xz?narHash=sha256-R4B%2BRRYmze9htmPZ8xeF19mchTSH99GdaqanKCW8CF8%3D»/lib/customisation.nix:416:11:
415| // {
416| drvPath =
| ^
417| assert condition;
… while calling the 'derivationStrict' builtin
at «nix-internal»/derivation-internal.nix:37:12:
36|
37| strict = derivationStrict drvAttrs;
| ^
38|
… while evaluating the option `driverConfiguration.vlans':
… while evaluating definitions from `/nix/store/vlhb7haagkjabf20g1vg9kxi53fcpi17-source/nixos/lib/testing/driver-configuration.nix':
… while evaluating the option `containers.server.networking.interfaces':
… while evaluating definitions from `/nix/store/vlhb7haagkjabf20g1vg9kxi53fcpi17-source/nixos/modules/hardware/facter/networking':
… while evaluating the option `containers.server.hardware.facter.enable':
… while evaluating the option `containers.server.hardware.facter.report':
… while evaluating the option `containers.server.hardware.facter.reportPath':
… while evaluating definitions from `/nix/store/rdgc1j2f1j05idz4l97fp775910gcjxd-source/nixosModules/clanCore/nixos-facter.nix':
(stack trace truncated; use '--show-trace' to show the full, detailed trace)
error: build of '/nix/store/xh8bqz8463ag3rml28aln1fwahy9phhj-merged-test-dir-service-machine-id.drv^out' failed: error: gave up after 9 reschedules
|
||
checks.aarch64-linux.matrix-synapse
|
— | |
error: … while evaluating the attribute 'drvPath' at «https://releases.nixos.org/nixpkgs/nixpkgs-26.11pre1085827.aa48d3470809/nixexprs.tar.xz?na …error:
… while evaluating the attribute 'drvPath'
at «https://releases.nixos.org/nixpkgs/nixpkgs-26.11pre1085827.aa48d3470809/nixexprs.tar.xz?narHash=sha256-R4B%2BRRYmze9htmPZ8xeF19mchTSH99GdaqanKCW8CF8%3D»/lib/customisation.nix:416:11:
415| // {
416| drvPath =
| ^
417| assert condition;
… while calling the 'derivationStrict' builtin
at «nix-internal»/derivation-internal.nix:37:12:
36|
37| strict = derivationStrict drvAttrs;
| ^
38|
… while evaluating the option `driverConfiguration.vlans':
… while evaluating definitions from `/nix/store/vlhb7haagkjabf20g1vg9kxi53fcpi17-source/nixos/lib/testing/driver-configuration.nix':
… while evaluating the option `containers.machine.networking.interfaces':
… while evaluating definitions from `/nix/store/vlhb7haagkjabf20g1vg9kxi53fcpi17-source/nixos/modules/hardware/facter/networking':
… while evaluating the option `containers.machine.hardware.facter.enable':
… while evaluating the option `containers.machine.hardware.facter.report':
… while evaluating the option `containers.machine.hardware.facter.reportPath':
… while evaluating definitions from `/nix/store/rdgc1j2f1j05idz4l97fp775910gcjxd-source/nixosModules/clanCore/nixos-facter.nix':
(stack trace truncated; use '--show-trace' to show the full, detailed trace)
error: build of '/nix/store/86asji4bmwf0nk34wr94a16h090d08mi-merged-test-dir-matrix-synapse.drv^out' failed: error: error: gRPC AddMultipleToStore on 'nix-store.geninf.io:50051' failed: error: path '/nix/store/ngz73n5ksvnrzw0p5cay8pxl7fm5hph5-vm' is required, but there is no substituter that can build it
|
||
checks.aarch64-linux.monitoring
|
— | |
error: … while evaluating the attribute 'drvPath' at «https://releases.nixos.org/nixpkgs/nixpkgs-26.11pre1085827.aa48d3470809/nixexprs.tar.xz?na …error:
… while evaluating the attribute 'drvPath'
at «https://releases.nixos.org/nixpkgs/nixpkgs-26.11pre1085827.aa48d3470809/nixexprs.tar.xz?narHash=sha256-R4B%2BRRYmze9htmPZ8xeF19mchTSH99GdaqanKCW8CF8%3D»/lib/customisation.nix:416:11:
415| // {
416| drvPath =
| ^
417| assert condition;
… while calling the 'derivationStrict' builtin
at «nix-internal»/derivation-internal.nix:37:12:
36|
37| strict = derivationStrict drvAttrs;
| ^
38|
… while evaluating the option `driverConfiguration.vlans':
… while evaluating definitions from `/nix/store/vlhb7haagkjabf20g1vg9kxi53fcpi17-source/nixos/lib/testing/driver-configuration.nix':
… while evaluating the option `containers.machine1.networking.interfaces':
… while evaluating definitions from `/nix/store/vlhb7haagkjabf20g1vg9kxi53fcpi17-source/nixos/modules/hardware/facter/networking':
… while evaluating the option `containers.machine1.hardware.facter.enable':
… while evaluating the option `containers.machine1.hardware.facter.report':
… while evaluating the option `containers.machine1.hardware.facter.reportPath':
… while evaluating definitions from `/nix/store/rdgc1j2f1j05idz4l97fp775910gcjxd-source/nixosModules/clanCore/nixos-facter.nix':
(stack trace truncated; use '--show-trace' to show the full, detailed trace)
error: build of '/nix/store/zxbvacfhq72cfbwqbkvps2lqr6z2nfcm-merged-test-dir-monitoring.drv^out' failed: error: gave up after 9 reschedules
|
||
checks.aarch64-linux.mycelium
|
— | |
error: … while evaluating the attribute 'drvPath' at «https://releases.nixos.org/nixpkgs/nixpkgs-26.11pre1085827.aa48d3470809/nixexprs.tar.xz?na …error:
… while evaluating the attribute 'drvPath'
at «https://releases.nixos.org/nixpkgs/nixpkgs-26.11pre1085827.aa48d3470809/nixexprs.tar.xz?narHash=sha256-R4B%2BRRYmze9htmPZ8xeF19mchTSH99GdaqanKCW8CF8%3D»/lib/customisation.nix:416:11:
415| // {
416| drvPath =
| ^
417| assert condition;
… while calling the 'derivationStrict' builtin
at «nix-internal»/derivation-internal.nix:37:12:
36|
37| strict = derivationStrict drvAttrs;
| ^
38|
… while evaluating the option `driverConfiguration.vlans':
… while evaluating definitions from `/nix/store/vlhb7haagkjabf20g1vg9kxi53fcpi17-source/nixos/lib/testing/driver-configuration.nix':
… while evaluating the option `nodes.server.networking.interfaces':
… while evaluating definitions from `/nix/store/vlhb7haagkjabf20g1vg9kxi53fcpi17-source/nixos/modules/hardware/facter/networking':
… while evaluating the option `nodes.server.hardware.facter.enable':
… while evaluating the option `nodes.server.hardware.facter.report':
… while evaluating the option `nodes.server.hardware.facter.reportPath':
… while evaluating definitions from `/nix/store/rdgc1j2f1j05idz4l97fp775910gcjxd-source/nixosModules/clanCore/nixos-facter.nix':
(stack trace truncated; use '--show-trace' to show the full, detailed trace)
error: build of '/nix/store/xqzx5sw4sqqflh84m47lx6fcajavz3s3-merged-test-dir-mycelium.drv^out' failed: error: gave up after 9 reschedules
|
||
checks.aarch64-linux.ncps
|
— | |
error: … while evaluating the attribute 'drvPath' at «https://releases.nixos.org/nixpkgs/nixpkgs-26.11pre1085827.aa48d3470809/nixexprs.tar.xz?na …error:
… while evaluating the attribute 'drvPath'
at «https://releases.nixos.org/nixpkgs/nixpkgs-26.11pre1085827.aa48d3470809/nixexprs.tar.xz?narHash=sha256-R4B%2BRRYmze9htmPZ8xeF19mchTSH99GdaqanKCW8CF8%3D»/lib/customisation.nix:416:11:
415| // {
416| drvPath =
| ^
417| assert condition;
… while calling the 'derivationStrict' builtin
at «nix-internal»/derivation-internal.nix:37:12:
36|
37| strict = derivationStrict drvAttrs;
| ^
38|
… while evaluating the option `driverConfiguration.vlans':
… while evaluating definitions from `/nix/store/vlhb7haagkjabf20g1vg9kxi53fcpi17-source/nixos/lib/testing/driver-configuration.nix':
… while evaluating the option `nodes.alice.networking.interfaces':
… while evaluating definitions from `/nix/store/vlhb7haagkjabf20g1vg9kxi53fcpi17-source/nixos/modules/hardware/facter/networking':
… while evaluating the option `nodes.alice.hardware.facter.enable':
… while evaluating the option `nodes.alice.hardware.facter.report':
… while evaluating the option `nodes.alice.hardware.facter.reportPath':
… while evaluating definitions from `/nix/store/rdgc1j2f1j05idz4l97fp775910gcjxd-source/nixosModules/clanCore/nixos-facter.nix':
(stack trace truncated; use '--show-trace' to show the full, detailed trace)
error: build of '/nix/store/xcqvs306r9b9384ybng2iznhxssi40q1-merged-test-dir-ncps.drv^out' failed: error: error: gRPC AddMultipleToStore on 'nix-store.geninf.io:50051' failed: error: path '/nix/store/r18cbjyhbww33z0qqzbs14gfqlj5fiki-vm' is required, but there is no substituter that can build it
|
||
checks.aarch64-linux.nixos-test-password-store-mounts
|
— | |
error: … while evaluating the attribute 'drvPath' at «https://releases.nixos.org/nixpkgs/nixpkgs-26.11pre1085827.aa48d3470809/nixexprs.tar.xz?na …error:
… while evaluating the attribute 'drvPath'
at «https://releases.nixos.org/nixpkgs/nixpkgs-26.11pre1085827.aa48d3470809/nixexprs.tar.xz?narHash=sha256-R4B%2BRRYmze9htmPZ8xeF19mchTSH99GdaqanKCW8CF8%3D»/lib/customisation.nix:416:11:
415| // {
416| drvPath =
| ^
417| assert condition;
… while calling the 'derivationStrict' builtin
at «nix-internal»/derivation-internal.nix:37:12:
36|
37| strict = derivationStrict drvAttrs;
| ^
38|
… while evaluating the option `driverConfiguration.vlans':
… while evaluating definitions from `/nix/store/vlhb7haagkjabf20g1vg9kxi53fcpi17-source/nixos/lib/testing/driver-configuration.nix':
… while evaluating the option `nodes.machine.networking.interfaces':
… while evaluating definitions from `/nix/store/vlhb7haagkjabf20g1vg9kxi53fcpi17-source/nixos/modules/hardware/facter/networking':
… while evaluating the option `nodes.machine.hardware.facter.enable':
… while evaluating the option `nodes.machine.hardware.facter.report':
… while evaluating the option `nodes.machine.hardware.facter.reportPath':
… while evaluating definitions from `/nix/store/rdgc1j2f1j05idz4l97fp775910gcjxd-source/nixosModules/clanCore/nixos-facter.nix':
(stack trace truncated; use '--show-trace' to show the full, detailed trace)
error: build of '/nix/store/fd4w6z1djq3452qfd2yvp55jcbvcfrmg-merged-test-dir-nixos-test-password-store-mounts.drv^out' failed: error: error: gRPC AddMultipleToStore on 'nix-store.geninf.io:50051' failed: error: path '/nix/store/147rxl0010d5n36k0a98hw6n0f6w4kri-tests' is required, but there is no substituter that can build it
|
||
checks.aarch64-linux.p2p-ssh-iroh
|
— | |
error: … while evaluating the attribute 'drvPath' at «https://releases.nixos.org/nixpkgs/nixpkgs-26.11pre1085827.aa48d3470809/nixexprs.tar.xz?na …error:
… while evaluating the attribute 'drvPath'
at «https://releases.nixos.org/nixpkgs/nixpkgs-26.11pre1085827.aa48d3470809/nixexprs.tar.xz?narHash=sha256-R4B%2BRRYmze9htmPZ8xeF19mchTSH99GdaqanKCW8CF8%3D»/lib/customisation.nix:416:11:
415| // {
416| drvPath =
| ^
417| assert condition;
… while calling the 'derivationStrict' builtin
at «nix-internal»/derivation-internal.nix:37:12:
36|
37| strict = derivationStrict drvAttrs;
| ^
38|
… while evaluating the option `driverConfiguration.vlans':
… while evaluating definitions from `/nix/store/vlhb7haagkjabf20g1vg9kxi53fcpi17-source/nixos/lib/testing/driver-configuration.nix':
… while evaluating the option `containers.client.networking.interfaces':
… while evaluating definitions from `/nix/store/vlhb7haagkjabf20g1vg9kxi53fcpi17-source/nixos/modules/hardware/facter/networking':
… while evaluating the option `containers.client.hardware.facter.enable':
… while evaluating the option `containers.client.hardware.facter.report':
… while evaluating the option `containers.client.hardware.facter.reportPath':
… while evaluating definitions from `/nix/store/rdgc1j2f1j05idz4l97fp775910gcjxd-source/nixosModules/clanCore/nixos-facter.nix':
(stack trace truncated; use '--show-trace' to show the full, detailed trace)
error: build of '/nix/store/g1ydbrlzfvbi1y56lscz5z0n0s495y26-merged-test-dir-clan-test-p2p-ssh-iroh.drv^out' failed: error: error: gRPC AddMultipleToStore on 'nix-store.geninf.io:50051' failed: error: path '/nix/store/jbmz1rgwv3c5640ab19nanq0yvy3lyxn-vm' is required, but there is no substituter that can build it
|
||
checks.aarch64-linux.packages
|
— | |
error: … while evaluating the attribute 'drvPath' at «https://releases.nixos.org/nixpkgs/nixpkgs-26.11pre1085827.aa48d3470809/nixexprs.tar.xz?na …error:
… while evaluating the attribute 'drvPath'
at «https://releases.nixos.org/nixpkgs/nixpkgs-26.11pre1085827.aa48d3470809/nixexprs.tar.xz?narHash=sha256-R4B%2BRRYmze9htmPZ8xeF19mchTSH99GdaqanKCW8CF8%3D»/lib/customisation.nix:416:11:
415| // {
416| drvPath =
| ^
417| assert condition;
… while calling the 'derivationStrict' builtin
at «nix-internal»/derivation-internal.nix:37:12:
36|
37| strict = derivationStrict drvAttrs;
| ^
38|
… while evaluating the option `driverConfiguration.vlans':
… while evaluating definitions from `/nix/store/vlhb7haagkjabf20g1vg9kxi53fcpi17-source/nixos/lib/testing/driver-configuration.nix':
… while evaluating the option `containers.server.networking.interfaces':
… while evaluating definitions from `/nix/store/vlhb7haagkjabf20g1vg9kxi53fcpi17-source/nixos/modules/hardware/facter/networking':
… while evaluating the option `containers.server.hardware.facter.enable':
… while evaluating the option `containers.server.hardware.facter.report':
… while evaluating the option `containers.server.hardware.facter.reportPath':
… while evaluating definitions from `/nix/store/rdgc1j2f1j05idz4l97fp775910gcjxd-source/nixosModules/clanCore/nixos-facter.nix':
(stack trace truncated; use '--show-trace' to show the full, detailed trace)
error: build of '/nix/store/nyz3rmrrm4qcxdwbln0414mkr6ldfpqa-merged-test-dir-packages.drv^out' failed: error: error: gRPC AddMultipleToStore on 'nix-store.geninf.io:50051' failed: error: path '/nix/store/3hwv4qpg203232ngaimvmxbx2xmvv9qf-vm' is required, but there is no substituter that can build it
|
||
checks.aarch64-linux.pki
|
— | |
error: … while evaluating the attribute 'drvPath' at «https://releases.nixos.org/nixpkgs/nixpkgs-26.11pre1085827.aa48d3470809/nixexprs.tar.xz?na …error:
… while evaluating the attribute 'drvPath'
at «https://releases.nixos.org/nixpkgs/nixpkgs-26.11pre1085827.aa48d3470809/nixexprs.tar.xz?narHash=sha256-R4B%2BRRYmze9htmPZ8xeF19mchTSH99GdaqanKCW8CF8%3D»/lib/customisation.nix:416:11:
415| // {
416| drvPath =
| ^
417| assert condition;
… while calling the 'derivationStrict' builtin
at «nix-internal»/derivation-internal.nix:37:12:
36|
37| strict = derivationStrict drvAttrs;
| ^
38|
… while evaluating the option `driverConfiguration.vlans':
… while evaluating definitions from `/nix/store/vlhb7haagkjabf20g1vg9kxi53fcpi17-source/nixos/lib/testing/driver-configuration.nix':
… while evaluating the option `nodes.caddy.networking.interfaces':
… while evaluating definitions from `/nix/store/vlhb7haagkjabf20g1vg9kxi53fcpi17-source/nixos/modules/hardware/facter/networking':
… while evaluating the option `nodes.caddy.hardware.facter.enable':
… while evaluating the option `nodes.caddy.hardware.facter.report':
… while evaluating the option `nodes.caddy.hardware.facter.reportPath':
… while evaluating definitions from `/nix/store/rdgc1j2f1j05idz4l97fp775910gcjxd-source/nixosModules/clanCore/nixos-facter.nix':
(stack trace truncated; use '--show-trace' to show the full, detailed trace)
error: build of '/nix/store/w8kr1wjhbsz621nwm6cchg61w4hpfsa2-merged-test-dir-pki.drv^out' failed: error: gave up after 9 reschedules
|
||
checks.aarch64-linux.postgresql
|
— | |
error: … while evaluating the attribute 'drvPath' at «https://releases.nixos.org/nixpkgs/nixpkgs-26.11pre1085827.aa48d3470809/nixexprs.tar.xz?na …error:
… while evaluating the attribute 'drvPath'
at «https://releases.nixos.org/nixpkgs/nixpkgs-26.11pre1085827.aa48d3470809/nixexprs.tar.xz?narHash=sha256-R4B%2BRRYmze9htmPZ8xeF19mchTSH99GdaqanKCW8CF8%3D»/lib/customisation.nix:416:11:
415| // {
416| drvPath =
| ^
417| assert condition;
… while calling the 'derivationStrict' builtin
at «nix-internal»/derivation-internal.nix:37:12:
36|
37| strict = derivationStrict drvAttrs;
| ^
38|
… while evaluating the option `driverConfiguration.vlans':
… while evaluating definitions from `/nix/store/vlhb7haagkjabf20g1vg9kxi53fcpi17-source/nixos/lib/testing/driver-configuration.nix':
… while evaluating the option `containers.machine.networking.interfaces':
… while evaluating definitions from `/nix/store/vlhb7haagkjabf20g1vg9kxi53fcpi17-source/nixos/modules/hardware/facter/networking':
… while evaluating the option `containers.machine.hardware.facter.enable':
… while evaluating the option `containers.machine.hardware.facter.report':
… while evaluating the option `containers.machine.hardware.facter.reportPath':
… while evaluating definitions from `/nix/store/rdgc1j2f1j05idz4l97fp775910gcjxd-source/nixosModules/clanCore/nixos-facter.nix':
(stack trace truncated; use '--show-trace' to show the full, detailed trace)
error: build of '/nix/store/5iibba5p38fym6ym62k83fx13cnqvabv-merged-test-dir-service-postgresql.drv^out' failed: error: gave up after 9 reschedules
|
||
checks.aarch64-linux.service-dummy-test
|
— | |
error: … while evaluating the attribute 'drvPath' at «https://releases.nixos.org/nixpkgs/nixpkgs-26.11pre1085827.aa48d3470809/nixexprs.tar.xz?na …error:
… while evaluating the attribute 'drvPath'
at «https://releases.nixos.org/nixpkgs/nixpkgs-26.11pre1085827.aa48d3470809/nixexprs.tar.xz?narHash=sha256-R4B%2BRRYmze9htmPZ8xeF19mchTSH99GdaqanKCW8CF8%3D»/lib/customisation.nix:416:11:
415| // {
416| drvPath =
| ^
417| assert condition;
… while calling the 'derivationStrict' builtin
at «nix-internal»/derivation-internal.nix:37:12:
36|
37| strict = derivationStrict drvAttrs;
| ^
38|
… while evaluating the option `driverConfiguration.vlans':
… while evaluating definitions from `/nix/store/vlhb7haagkjabf20g1vg9kxi53fcpi17-source/nixos/lib/testing/driver-configuration.nix':
… while evaluating the option `containers.admin1.networking.interfaces':
… while evaluating definitions from `/nix/store/vlhb7haagkjabf20g1vg9kxi53fcpi17-source/nixos/modules/hardware/facter/networking':
… while evaluating the option `containers.admin1.hardware.facter.enable':
… while evaluating the option `containers.admin1.hardware.facter.report':
… while evaluating the option `containers.admin1.hardware.facter.reportPath':
… while evaluating definitions from `/nix/store/rdgc1j2f1j05idz4l97fp775910gcjxd-source/nixosModules/clanCore/nixos-facter.nix':
(stack trace truncated; use '--show-trace' to show the full, detailed trace)
error: build of '/nix/store/z9naskk0hp6d2q9xbqc6m55zqa3y7vhr-merged-test-dir-service-dummy-test.drv^out' failed: error: gave up after 9 reschedules
|
||
checks.aarch64-linux.service-dummy-test-from-flake
|
— | |
error: … while evaluating the attribute 'drvPath' at «https://releases.nixos.org/nixpkgs/nixpkgs-26.11pre1085827.aa48d3470809/nixexprs.tar.xz?na …error:
… while evaluating the attribute 'drvPath'
at «https://releases.nixos.org/nixpkgs/nixpkgs-26.11pre1085827.aa48d3470809/nixexprs.tar.xz?narHash=sha256-R4B%2BRRYmze9htmPZ8xeF19mchTSH99GdaqanKCW8CF8%3D»/lib/customisation.nix:416:11:
415| // {
416| drvPath =
| ^
417| assert condition;
… while calling the 'derivationStrict' builtin
at «nix-internal»/derivation-internal.nix:37:12:
36|
37| strict = derivationStrict drvAttrs;
| ^
38|
… while evaluating the option `driverConfiguration.vlans':
… while evaluating definitions from `/nix/store/vlhb7haagkjabf20g1vg9kxi53fcpi17-source/nixos/lib/testing/driver-configuration.nix':
… while evaluating the option `containers.admin1.networking.interfaces':
… while evaluating definitions from `/nix/store/vlhb7haagkjabf20g1vg9kxi53fcpi17-source/nixos/modules/hardware/facter/networking':
… while evaluating the option `containers.admin1.hardware.facter.enable':
… while evaluating the option `containers.admin1.hardware.facter.report':
… while evaluating the option `containers.admin1.hardware.facter.reportPath':
… while evaluating definitions from `/nix/store/rdgc1j2f1j05idz4l97fp775910gcjxd-source/nixosModules/clanCore/nixos-facter.nix':
(stack trace truncated; use '--show-trace' to show the full, detailed trace)
error: build of '/nix/store/1dannijgk3pn19dzpad13p17lhqca1nl-merged-test-dir-service-dummy-test-from-flake.drv^out' failed: error: gave up after 9 reschedules
|
||
checks.aarch64-linux.sshd
|
— | |
error: … while evaluating the attribute 'drvPath' at «https://releases.nixos.org/nixpkgs/nixpkgs-26.11pre1085827.aa48d3470809/nixexprs.tar.xz?na …error:
… while evaluating the attribute 'drvPath'
at «https://releases.nixos.org/nixpkgs/nixpkgs-26.11pre1085827.aa48d3470809/nixexprs.tar.xz?narHash=sha256-R4B%2BRRYmze9htmPZ8xeF19mchTSH99GdaqanKCW8CF8%3D»/lib/customisation.nix:416:11:
415| // {
416| drvPath =
| ^
417| assert condition;
… while calling the 'derivationStrict' builtin
at «nix-internal»/derivation-internal.nix:37:12:
36|
37| strict = derivationStrict drvAttrs;
| ^
38|
… while evaluating the option `driverConfiguration.vlans':
… while evaluating definitions from `/nix/store/vlhb7haagkjabf20g1vg9kxi53fcpi17-source/nixos/lib/testing/driver-configuration.nix':
… while evaluating the option `containers.client.networking.interfaces':
… while evaluating definitions from `/nix/store/vlhb7haagkjabf20g1vg9kxi53fcpi17-source/nixos/modules/hardware/facter/networking':
… while evaluating the option `containers.client.hardware.facter.enable':
… while evaluating the option `containers.client.hardware.facter.report':
… while evaluating the option `containers.client.hardware.facter.reportPath':
… while evaluating definitions from `/nix/store/rdgc1j2f1j05idz4l97fp775910gcjxd-source/nixosModules/clanCore/nixos-facter.nix':
(stack trace truncated; use '--show-trace' to show the full, detailed trace)
error: build of '/nix/store/zs4n7j21fmqm1ylli4k5bzv0blvwa0b1-merged-test-dir-sshd.drv^out' failed: error: error: gRPC AddMultipleToStore on 'nix-store.geninf.io:50051' failed: error: path '/nix/store/g53sn3s312i6d08b0wcxpjnq44fyffi8-vm' is required, but there is no substituter that can build it
|
||
checks.aarch64-linux.sshd-no-ca
|
— | |
error: … while evaluating the attribute 'drvPath' at «https://releases.nixos.org/nixpkgs/nixpkgs-26.11pre1085827.aa48d3470809/nixexprs.tar.xz?na …error:
… while evaluating the attribute 'drvPath'
at «https://releases.nixos.org/nixpkgs/nixpkgs-26.11pre1085827.aa48d3470809/nixexprs.tar.xz?narHash=sha256-R4B%2BRRYmze9htmPZ8xeF19mchTSH99GdaqanKCW8CF8%3D»/lib/customisation.nix:416:11:
415| // {
416| drvPath =
| ^
417| assert condition;
… while calling the 'derivationStrict' builtin
at «nix-internal»/derivation-internal.nix:37:12:
36|
37| strict = derivationStrict drvAttrs;
| ^
38|
… while evaluating the option `driverConfiguration.vlans':
… while evaluating definitions from `/nix/store/vlhb7haagkjabf20g1vg9kxi53fcpi17-source/nixos/lib/testing/driver-configuration.nix':
… while evaluating the option `containers.client.networking.interfaces':
… while evaluating definitions from `/nix/store/vlhb7haagkjabf20g1vg9kxi53fcpi17-source/nixos/modules/hardware/facter/networking':
… while evaluating the option `containers.client.hardware.facter.enable':
… while evaluating the option `containers.client.hardware.facter.report':
… while evaluating the option `containers.client.hardware.facter.reportPath':
… while evaluating definitions from `/nix/store/rdgc1j2f1j05idz4l97fp775910gcjxd-source/nixosModules/clanCore/nixos-facter.nix':
(stack trace truncated; use '--show-trace' to show the full, detailed trace)
error: build of '/nix/store/avs3c65z02f9gg37cj2lf2qy48pvvlmc-merged-test-dir-sshd.drv^out' failed: error: error: gRPC AddMultipleToStore on 'nix-store.geninf.io:50051' failed: error: path '/nix/store/g53sn3s312i6d08b0wcxpjnq44fyffi8-vm' is required, but there is no substituter that can build it
|
||
checks.aarch64-linux.state-version
|
— | |
error: … while evaluating the attribute 'drvPath' at «https://releases.nixos.org/nixpkgs/nixpkgs-26.11pre1085827.aa48d3470809/nixexprs.tar.xz?na …error:
… while evaluating the attribute 'drvPath'
at «https://releases.nixos.org/nixpkgs/nixpkgs-26.11pre1085827.aa48d3470809/nixexprs.tar.xz?narHash=sha256-R4B%2BRRYmze9htmPZ8xeF19mchTSH99GdaqanKCW8CF8%3D»/lib/customisation.nix:416:11:
415| // {
416| drvPath =
| ^
417| assert condition;
… while calling the 'derivationStrict' builtin
at «nix-internal»/derivation-internal.nix:37:12:
36|
37| strict = derivationStrict drvAttrs;
| ^
38|
… while evaluating the option `driverConfiguration.vlans':
… while evaluating definitions from `/nix/store/vlhb7haagkjabf20g1vg9kxi53fcpi17-source/nixos/lib/testing/driver-configuration.nix':
… while evaluating the option `containers.server.networking.interfaces':
… while evaluating definitions from `/nix/store/vlhb7haagkjabf20g1vg9kxi53fcpi17-source/nixos/modules/hardware/facter/networking':
… while evaluating the option `containers.server.hardware.facter.enable':
… while evaluating the option `containers.server.hardware.facter.report':
… while evaluating the option `containers.server.hardware.facter.reportPath':
… while evaluating definitions from `/nix/store/rdgc1j2f1j05idz4l97fp775910gcjxd-source/nixosModules/clanCore/nixos-facter.nix':
(stack trace truncated; use '--show-trace' to show the full, detailed trace)
error: build of '/nix/store/qjlaaplnjd8nacvm4ncscjyl2ixpdnhp-merged-test-dir-service-state-version.drv^out' failed: error: gave up after 9 reschedules
|
||
checks.aarch64-linux.syncthing-service
|
— | |
error: … while evaluating the attribute 'drvPath' at «https://releases.nixos.org/nixpkgs/nixpkgs-26.11pre1085827.aa48d3470809/nixexprs.tar.xz?na …error:
… while evaluating the attribute 'drvPath'
at «https://releases.nixos.org/nixpkgs/nixpkgs-26.11pre1085827.aa48d3470809/nixexprs.tar.xz?narHash=sha256-R4B%2BRRYmze9htmPZ8xeF19mchTSH99GdaqanKCW8CF8%3D»/lib/customisation.nix:416:11:
415| // {
416| drvPath =
| ^
417| assert condition;
… while calling the 'derivationStrict' builtin
at «nix-internal»/derivation-internal.nix:37:12:
36|
37| strict = derivationStrict drvAttrs;
| ^
38|
… while evaluating the option `driverConfiguration.vlans':
… while evaluating definitions from `/nix/store/vlhb7haagkjabf20g1vg9kxi53fcpi17-source/nixos/lib/testing/driver-configuration.nix':
… while evaluating the option `containers.machine1.networking.interfaces':
… while evaluating definitions from `/nix/store/vlhb7haagkjabf20g1vg9kxi53fcpi17-source/nixos/modules/hardware/facter/networking':
… while evaluating the option `containers.machine1.hardware.facter.enable':
… while evaluating the option `containers.machine1.hardware.facter.report':
… while evaluating the option `containers.machine1.hardware.facter.reportPath':
… while evaluating definitions from `/nix/store/rdgc1j2f1j05idz4l97fp775910gcjxd-source/nixosModules/clanCore/nixos-facter.nix':
(stack trace truncated; use '--show-trace' to show the full, detailed trace)
error: build of '/nix/store/7pq323b8ncdqa64xkh24ryldvpyqzmxx-merged-test-dir-syncthing-service.drv^out' failed: error: gave up after 9 reschedules
|
||
checks.aarch64-linux.trusted-nix-caches
|
— | |
error: … while evaluating the attribute 'drvPath' at «https://releases.nixos.org/nixpkgs/nixpkgs-26.11pre1085827.aa48d3470809/nixexprs.tar.xz?na …error:
… while evaluating the attribute 'drvPath'
at «https://releases.nixos.org/nixpkgs/nixpkgs-26.11pre1085827.aa48d3470809/nixexprs.tar.xz?narHash=sha256-R4B%2BRRYmze9htmPZ8xeF19mchTSH99GdaqanKCW8CF8%3D»/lib/customisation.nix:416:11:
415| // {
416| drvPath =
| ^
417| assert condition;
… while calling the 'derivationStrict' builtin
at «nix-internal»/derivation-internal.nix:37:12:
36|
37| strict = derivationStrict drvAttrs;
| ^
38|
… while evaluating the option `driverConfiguration.vlans':
… while evaluating definitions from `/nix/store/vlhb7haagkjabf20g1vg9kxi53fcpi17-source/nixos/lib/testing/driver-configuration.nix':
… while evaluating the option `containers.server.networking.interfaces':
… while evaluating definitions from `/nix/store/vlhb7haagkjabf20g1vg9kxi53fcpi17-source/nixos/modules/hardware/facter/networking':
… while evaluating the option `containers.server.hardware.facter.enable':
… while evaluating the option `containers.server.hardware.facter.report':
… while evaluating the option `containers.server.hardware.facter.reportPath':
… while evaluating definitions from `/nix/store/rdgc1j2f1j05idz4l97fp775910gcjxd-source/nixosModules/clanCore/nixos-facter.nix':
(stack trace truncated; use '--show-trace' to show the full, detailed trace)
error: build of '/nix/store/dpb92ps6qqwgi1mfb9sp3p8d0ckj9nn3-merged-test-dir-trusted-nix-caches.drv^out' failed: error: error: gRPC AddMultipleToStore on 'nix-store.geninf.io:50051' failed: error: path '/nix/store/79ajsf4ajd494ickr8rdsrbalk7an5f7-vm' is required, but there is no substituter that can build it
|
||
checks.aarch64-linux.users
|
— | |
error: … while evaluating the attribute 'drvPath' at «https://releases.nixos.org/nixpkgs/nixpkgs-26.11pre1085827.aa48d3470809/nixexprs.tar.xz?na …error:
… while evaluating the attribute 'drvPath'
at «https://releases.nixos.org/nixpkgs/nixpkgs-26.11pre1085827.aa48d3470809/nixexprs.tar.xz?narHash=sha256-R4B%2BRRYmze9htmPZ8xeF19mchTSH99GdaqanKCW8CF8%3D»/lib/customisation.nix:416:11:
415| // {
416| drvPath =
| ^
417| assert condition;
… while calling the 'derivationStrict' builtin
at «nix-internal»/derivation-internal.nix:37:12:
36|
37| strict = derivationStrict drvAttrs;
| ^
38|
… while evaluating the option `driverConfiguration.vlans':
… while evaluating definitions from `/nix/store/vlhb7haagkjabf20g1vg9kxi53fcpi17-source/nixos/lib/testing/driver-configuration.nix':
… while evaluating the option `containers.server.networking.interfaces':
… while evaluating definitions from `/nix/store/vlhb7haagkjabf20g1vg9kxi53fcpi17-source/nixos/modules/hardware/facter/networking':
… while evaluating the option `containers.server.hardware.facter.enable':
… while evaluating the option `containers.server.hardware.facter.report':
… while evaluating the option `containers.server.hardware.facter.reportPath':
… while evaluating definitions from `/nix/store/rdgc1j2f1j05idz4l97fp775910gcjxd-source/nixosModules/clanCore/nixos-facter.nix':
(stack trace truncated; use '--show-trace' to show the full, detailed trace)
error: build of '/nix/store/74mgk3pp0ff54g80wqfdmxfp0cl282k4-merged-test-dir-users.drv^out' failed: error: gave up after 9 reschedules
|
||
checks.aarch64-linux.wifi
|
— | |
error: … while evaluating the attribute 'drvPath' at «https://releases.nixos.org/nixpkgs/nixpkgs-26.11pre1085827.aa48d3470809/nixexprs.tar.xz?na …error:
… while evaluating the attribute 'drvPath'
at «https://releases.nixos.org/nixpkgs/nixpkgs-26.11pre1085827.aa48d3470809/nixexprs.tar.xz?narHash=sha256-R4B%2BRRYmze9htmPZ8xeF19mchTSH99GdaqanKCW8CF8%3D»/lib/customisation.nix:416:11:
415| // {
416| drvPath =
| ^
417| assert condition;
… while calling the 'derivationStrict' builtin
at «nix-internal»/derivation-internal.nix:37:12:
36|
37| strict = derivationStrict drvAttrs;
| ^
38|
… while evaluating the option `driverConfiguration.vlans':
… while evaluating definitions from `/nix/store/vlhb7haagkjabf20g1vg9kxi53fcpi17-source/nixos/lib/testing/driver-configuration.nix':
… while evaluating the option `nodes.second.networking.interfaces':
… while evaluating definitions from `/nix/store/vlhb7haagkjabf20g1vg9kxi53fcpi17-source/nixos/modules/hardware/facter/networking':
… while evaluating the option `nodes.second.hardware.facter.enable':
… while evaluating the option `nodes.second.hardware.facter.report':
… while evaluating the option `nodes.second.hardware.facter.reportPath':
… while evaluating definitions from `/nix/store/rdgc1j2f1j05idz4l97fp775910gcjxd-source/nixosModules/clanCore/nixos-facter.nix':
(stack trace truncated; use '--show-trace' to show the full, detailed trace)
error: build of '/nix/store/5afm43bgg3cqc6a3640y3kz1vkd43swn-merged-test-dir-wifi.drv^out' failed: error: gave up after 9 reschedules
|
||
checks.aarch64-linux.wireguard
|
— | |
error: … while evaluating the attribute 'drvPath' at «https://releases.nixos.org/nixpkgs/nixpkgs-26.11pre1085827.aa48d3470809/nixexprs.tar.xz?na …error:
… while evaluating the attribute 'drvPath'
at «https://releases.nixos.org/nixpkgs/nixpkgs-26.11pre1085827.aa48d3470809/nixexprs.tar.xz?narHash=sha256-R4B%2BRRYmze9htmPZ8xeF19mchTSH99GdaqanKCW8CF8%3D»/lib/customisation.nix:416:11:
415| // {
416| drvPath =
| ^
417| assert condition;
… while calling the 'derivationStrict' builtin
at «nix-internal»/derivation-internal.nix:37:12:
36|
37| strict = derivationStrict drvAttrs;
| ^
38|
… while evaluating the option `driverConfiguration.vlans':
… while evaluating definitions from `/nix/store/vlhb7haagkjabf20g1vg9kxi53fcpi17-source/nixos/lib/testing/driver-configuration.nix':
… while evaluating the option `containers.ctrl1.networking.interfaces':
… while evaluating definitions from `/nix/store/vlhb7haagkjabf20g1vg9kxi53fcpi17-source/nixos/modules/hardware/facter/networking':
… while evaluating the option `containers.ctrl1.hardware.facter.enable':
… while evaluating the option `containers.ctrl1.hardware.facter.report':
… while evaluating the option `containers.ctrl1.hardware.facter.reportPath':
… while evaluating definitions from `/nix/store/rdgc1j2f1j05idz4l97fp775910gcjxd-source/nixosModules/clanCore/nixos-facter.nix':
(stack trace truncated; use '--show-trace' to show the full, detailed trace)
error: build of '/nix/store/5wfp9wvkv2k4xjhxygwlp45dvxzpc8kg-merged-test-dir-wireguard.drv^out' failed: error: error: gRPC AddMultipleToStore on 'nix-store.geninf.io:50051' failed: error: path '/nix/store/qby9qhjrad2qghglkl4cr62835sslwbj-vm' is required, but there is no substituter that can build it
|
||
checks.aarch64-linux.yggdrasil
|
— | |
error: … while evaluating the attribute 'drvPath' at «https://releases.nixos.org/nixpkgs/nixpkgs-26.11pre1085827.aa48d3470809/nixexprs.tar.xz?na …error:
… while evaluating the attribute 'drvPath'
at «https://releases.nixos.org/nixpkgs/nixpkgs-26.11pre1085827.aa48d3470809/nixexprs.tar.xz?narHash=sha256-R4B%2BRRYmze9htmPZ8xeF19mchTSH99GdaqanKCW8CF8%3D»/lib/customisation.nix:416:11:
415| // {
416| drvPath =
| ^
417| assert condition;
… while calling the 'derivationStrict' builtin
at «nix-internal»/derivation-internal.nix:37:12:
36|
37| strict = derivationStrict drvAttrs;
| ^
38|
… while evaluating the option `driverConfiguration.vlans':
… while evaluating definitions from `/nix/store/vlhb7haagkjabf20g1vg9kxi53fcpi17-source/nixos/lib/testing/driver-configuration.nix':
… while evaluating the option `nodes.outsider.networking.interfaces':
… while evaluating definitions from `/nix/store/vlhb7haagkjabf20g1vg9kxi53fcpi17-source/nixos/modules/hardware/facter/networking':
… while evaluating the option `nodes.outsider.hardware.facter.enable':
… while evaluating the option `nodes.outsider.hardware.facter.report':
… while evaluating the option `nodes.outsider.hardware.facter.reportPath':
… while evaluating definitions from `/nix/store/rdgc1j2f1j05idz4l97fp775910gcjxd-source/nixosModules/clanCore/nixos-facter.nix':
(stack trace truncated; use '--show-trace' to show the full, detailed trace)
error: build of '/nix/store/ys05v6p3b2h4kv99fjkmryckr8x6zq4d-merged-test-dir-yggdrasil.drv^out' failed: error: error: gRPC AddMultipleToStore on 'nix-store.geninf.io:50051' failed: error: path '/nix/store/cpq75gs9406rcri2axlirpi84vx0rda4-vm' is required, but there is no substituter that can build it
|
||
checks.aarch64-linux.zerotier
|
— | |
error: … while evaluating the attribute 'drvPath' at «https://releases.nixos.org/nixpkgs/nixpkgs-26.11pre1085827.aa48d3470809/nixexprs.tar.xz?na …error:
… while evaluating the attribute 'drvPath'
at «https://releases.nixos.org/nixpkgs/nixpkgs-26.11pre1085827.aa48d3470809/nixexprs.tar.xz?narHash=sha256-R4B%2BRRYmze9htmPZ8xeF19mchTSH99GdaqanKCW8CF8%3D»/lib/customisation.nix:416:11:
415| // {
416| drvPath =
| ^
417| assert condition;
… while calling the 'derivationStrict' builtin
at «nix-internal»/derivation-internal.nix:37:12:
36|
37| strict = derivationStrict drvAttrs;
| ^
38|
… while evaluating the option `driverConfiguration.vlans':
… while evaluating definitions from `/nix/store/vlhb7haagkjabf20g1vg9kxi53fcpi17-source/nixos/lib/testing/driver-configuration.nix':
… while evaluating the option `nodes.controller.networking.interfaces':
… while evaluating definitions from `/nix/store/vlhb7haagkjabf20g1vg9kxi53fcpi17-source/nixos/modules/hardware/facter/networking':
… while evaluating the option `nodes.controller.hardware.facter.enable':
… while evaluating the option `nodes.controller.hardware.facter.report':
… while evaluating the option `nodes.controller.hardware.facter.reportPath':
… while evaluating definitions from `/nix/store/rdgc1j2f1j05idz4l97fp775910gcjxd-source/nixosModules/clanCore/nixos-facter.nix':
(stack trace truncated; use '--show-trace' to show the full, detailed trace)
error: build of '/nix/store/2y0qla7jnff6jkkbmqzj924kfcyr5d9h-merged-test-dir-zerotier.drv^out' failed: error: error: gRPC AddMultipleToStore on 'nix-store.geninf.io:50051' failed: error: path '/nix/store/gpk7rg8bhpzcfk6zqqgz8pm8n0zr334l-vm' is required, but there is no substituter that can build it
|
||
checks.aarch64-linux.zerotier-multi-instance
|
— | |
error: … while evaluating the attribute 'drvPath' at «https://releases.nixos.org/nixpkgs/nixpkgs-26.11pre1085827.aa48d3470809/nixexprs.tar.xz?na …error:
… while evaluating the attribute 'drvPath'
at «https://releases.nixos.org/nixpkgs/nixpkgs-26.11pre1085827.aa48d3470809/nixexprs.tar.xz?narHash=sha256-R4B%2BRRYmze9htmPZ8xeF19mchTSH99GdaqanKCW8CF8%3D»/lib/customisation.nix:416:11:
415| // {
416| drvPath =
| ^
417| assert condition;
… while calling the 'derivationStrict' builtin
at «nix-internal»/derivation-internal.nix:37:12:
36|
37| strict = derivationStrict drvAttrs;
| ^
38|
… while evaluating the option `driverConfiguration.vlans':
… while evaluating definitions from `/nix/store/vlhb7haagkjabf20g1vg9kxi53fcpi17-source/nixos/lib/testing/driver-configuration.nix':
… while evaluating the option `nodes.alpha.networking.interfaces':
… while evaluating definitions from `/nix/store/vlhb7haagkjabf20g1vg9kxi53fcpi17-source/nixos/modules/hardware/facter/networking':
… while evaluating the option `nodes.alpha.hardware.facter.enable':
… while evaluating the option `nodes.alpha.hardware.facter.report':
… while evaluating the option `nodes.alpha.hardware.facter.reportPath':
… while evaluating definitions from `/nix/store/rdgc1j2f1j05idz4l97fp775910gcjxd-source/nixosModules/clanCore/nixos-facter.nix':
(stack trace truncated; use '--show-trace' to show the full, detailed trace)
error: build of '/nix/store/zi7hx8rgbdz0gqjrz64hsyv4l8lk9vgb-merged-test-dir-zerotier-multi-instance.drv^out' failed: error: gave up after 9 reschedules
|
||
checks.x86_64-linux.admin
|
— | |
error: … while evaluating the attribute 'drvPath' at «https://releases.nixos.org/nixpkgs/nixpkgs-26.11pre1085827.aa48d3470809/nixexprs.tar.xz?na …error:
… while evaluating the attribute 'drvPath'
at «https://releases.nixos.org/nixpkgs/nixpkgs-26.11pre1085827.aa48d3470809/nixexprs.tar.xz?narHash=sha256-R4B%2BRRYmze9htmPZ8xeF19mchTSH99GdaqanKCW8CF8%3D»/lib/customisation.nix:416:11:
415| // {
416| drvPath =
| ^
417| assert condition;
… while calling the 'derivationStrict' builtin
at «nix-internal»/derivation-internal.nix:37:12:
36|
37| strict = derivationStrict drvAttrs;
| ^
38|
… while evaluating the option `driverConfiguration.vlans':
… while evaluating definitions from `/nix/store/vlhb7haagkjabf20g1vg9kxi53fcpi17-source/nixos/lib/testing/driver-configuration.nix':
… while evaluating the option `containers.client.networking.interfaces':
… while evaluating definitions from `/nix/store/vlhb7haagkjabf20g1vg9kxi53fcpi17-source/nixos/modules/hardware/facter/networking':
… while evaluating the option `containers.client.hardware.facter.enable':
… while evaluating the option `containers.client.hardware.facter.report':
… while evaluating the option `containers.client.hardware.facter.reportPath':
… while evaluating definitions from `/nix/store/rdgc1j2f1j05idz4l97fp775910gcjxd-source/nixosModules/clanCore/nixos-facter.nix':
(stack trace truncated; use '--show-trace' to show the full, detailed trace)
error: build of '/nix/store/zl84skhp27xnl77b62lzjihlbq07vryd-merged-test-dir-admin.drv^out' failed: error: gave up after 9 reschedules
|
||
checks.x86_64-linux.borgbackup
|
— | |
error: … while evaluating the attribute 'drvPath' at «https://releases.nixos.org/nixpkgs/nixpkgs-26.11pre1085827.aa48d3470809/nixexprs.tar.xz?na …error:
… while evaluating the attribute 'drvPath'
at «https://releases.nixos.org/nixpkgs/nixpkgs-26.11pre1085827.aa48d3470809/nixexprs.tar.xz?narHash=sha256-R4B%2BRRYmze9htmPZ8xeF19mchTSH99GdaqanKCW8CF8%3D»/lib/customisation.nix:416:11:
415| // {
416| drvPath =
| ^
417| assert condition;
… while calling the 'derivationStrict' builtin
at «nix-internal»/derivation-internal.nix:37:12:
36|
37| strict = derivationStrict drvAttrs;
| ^
38|
… while evaluating the option `driverConfiguration.vlans':
… while evaluating definitions from `/nix/store/vlhb7haagkjabf20g1vg9kxi53fcpi17-source/nixos/lib/testing/driver-configuration.nix':
… while evaluating the option `containers.clientone.networking.interfaces':
… while evaluating definitions from `/nix/store/vlhb7haagkjabf20g1vg9kxi53fcpi17-source/nixos/modules/hardware/facter/networking':
… while evaluating the option `containers.clientone.hardware.facter.enable':
… while evaluating the option `containers.clientone.hardware.facter.report':
… while evaluating the option `containers.clientone.hardware.facter.reportPath':
… while evaluating definitions from `/nix/store/rdgc1j2f1j05idz4l97fp775910gcjxd-source/nixosModules/clanCore/nixos-facter.nix':
(stack trace truncated; use '--show-trace' to show the full, detailed trace)
error: build of '/nix/store/zivl2hinxs22isnb9dsqbllzg1228q3c-merged-test-dir-borgbackup.drv^out' failed: error: gave up after 9 reschedules
|
||
checks.x86_64-linux.dyndns
|
— | |
error: … while evaluating the attribute 'drvPath' at «https://releases.nixos.org/nixpkgs/nixpkgs-26.11pre1085827.aa48d3470809/nixexprs.tar.xz?na …error:
… while evaluating the attribute 'drvPath'
at «https://releases.nixos.org/nixpkgs/nixpkgs-26.11pre1085827.aa48d3470809/nixexprs.tar.xz?narHash=sha256-R4B%2BRRYmze9htmPZ8xeF19mchTSH99GdaqanKCW8CF8%3D»/lib/customisation.nix:416:11:
415| // {
416| drvPath =
| ^
417| assert condition;
… while calling the 'derivationStrict' builtin
at «nix-internal»/derivation-internal.nix:37:12:
36|
37| strict = derivationStrict drvAttrs;
| ^
38|
… while evaluating the option `driverConfiguration.vlans':
… while evaluating definitions from `/nix/store/vlhb7haagkjabf20g1vg9kxi53fcpi17-source/nixos/lib/testing/driver-configuration.nix':
… while evaluating the option `containers.server.networking.interfaces':
… while evaluating definitions from `/nix/store/vlhb7haagkjabf20g1vg9kxi53fcpi17-source/nixos/modules/hardware/facter/networking':
… while evaluating the option `containers.server.hardware.facter.enable':
… while evaluating the option `containers.server.hardware.facter.report':
… while evaluating the option `containers.server.hardware.facter.reportPath':
… while evaluating definitions from `/nix/store/rdgc1j2f1j05idz4l97fp775910gcjxd-source/nixosModules/clanCore/nixos-facter.nix':
(stack trace truncated; use '--show-trace' to show the full, detailed trace)
error: build of '/nix/store/hijqbkrw6bdhd7i3nl64xzd4ldkxna0g-merged-test-dir-dyndns.drv^out' failed: error: gave up after 9 reschedules
|
||
checks.x86_64-linux.garage
|
— | |
error: … while evaluating the attribute 'drvPath' at «https://releases.nixos.org/nixpkgs/nixpkgs-26.11pre1085827.aa48d3470809/nixexprs.tar.xz?na …error:
… while evaluating the attribute 'drvPath'
at «https://releases.nixos.org/nixpkgs/nixpkgs-26.11pre1085827.aa48d3470809/nixexprs.tar.xz?narHash=sha256-R4B%2BRRYmze9htmPZ8xeF19mchTSH99GdaqanKCW8CF8%3D»/lib/customisation.nix:416:11:
415| // {
416| drvPath =
| ^
417| assert condition;
… while calling the 'derivationStrict' builtin
at «nix-internal»/derivation-internal.nix:37:12:
36|
37| strict = derivationStrict drvAttrs;
| ^
38|
… while evaluating the option `driverConfiguration.vlans':
… while evaluating definitions from `/nix/store/vlhb7haagkjabf20g1vg9kxi53fcpi17-source/nixos/lib/testing/driver-configuration.nix':
… while evaluating the option `containers.server.networking.interfaces':
… while evaluating definitions from `/nix/store/vlhb7haagkjabf20g1vg9kxi53fcpi17-source/nixos/modules/hardware/facter/networking':
… while evaluating the option `containers.server.hardware.facter.enable':
… while evaluating the option `containers.server.hardware.facter.report':
… while evaluating the option `containers.server.hardware.facter.reportPath':
… while evaluating definitions from `/nix/store/rdgc1j2f1j05idz4l97fp775910gcjxd-source/nixosModules/clanCore/nixos-facter.nix':
(stack trace truncated; use '--show-trace' to show the full, detailed trace)
error: build of '/nix/store/hyijhzy1ws3zn2n62vxpx45kps0b8l2m-merged-test-dir-garage.drv^out' failed: error: gave up after 9 reschedules
|
||
checks.x86_64-linux.matrix-synapse
|
— | |
error: … while evaluating the attribute 'drvPath' at «https://releases.nixos.org/nixpkgs/nixpkgs-26.11pre1085827.aa48d3470809/nixexprs.tar.xz?na …error:
… while evaluating the attribute 'drvPath'
at «https://releases.nixos.org/nixpkgs/nixpkgs-26.11pre1085827.aa48d3470809/nixexprs.tar.xz?narHash=sha256-R4B%2BRRYmze9htmPZ8xeF19mchTSH99GdaqanKCW8CF8%3D»/lib/customisation.nix:416:11:
415| // {
416| drvPath =
| ^
417| assert condition;
… while calling the 'derivationStrict' builtin
at «nix-internal»/derivation-internal.nix:37:12:
36|
37| strict = derivationStrict drvAttrs;
| ^
38|
… while evaluating the option `driverConfiguration.vlans':
… while evaluating definitions from `/nix/store/vlhb7haagkjabf20g1vg9kxi53fcpi17-source/nixos/lib/testing/driver-configuration.nix':
… while evaluating the option `containers.machine.networking.interfaces':
… while evaluating definitions from `/nix/store/vlhb7haagkjabf20g1vg9kxi53fcpi17-source/nixos/modules/hardware/facter/networking':
… while evaluating the option `containers.machine.hardware.facter.enable':
… while evaluating the option `containers.machine.hardware.facter.report':
… while evaluating the option `containers.machine.hardware.facter.reportPath':
… while evaluating definitions from `/nix/store/rdgc1j2f1j05idz4l97fp775910gcjxd-source/nixosModules/clanCore/nixos-facter.nix':
(stack trace truncated; use '--show-trace' to show the full, detailed trace)
error: build of '/nix/store/sdl93209s82p5xhn4v9294pv3hf185c5-merged-test-dir-matrix-synapse.drv^out' failed: error: gave up after 9 reschedules
|
||
checks.x86_64-linux.monitoring
|
— | |
error: … while evaluating the attribute 'drvPath' at «https://releases.nixos.org/nixpkgs/nixpkgs-26.11pre1085827.aa48d3470809/nixexprs.tar.xz?na …error:
… while evaluating the attribute 'drvPath'
at «https://releases.nixos.org/nixpkgs/nixpkgs-26.11pre1085827.aa48d3470809/nixexprs.tar.xz?narHash=sha256-R4B%2BRRYmze9htmPZ8xeF19mchTSH99GdaqanKCW8CF8%3D»/lib/customisation.nix:416:11:
415| // {
416| drvPath =
| ^
417| assert condition;
… while calling the 'derivationStrict' builtin
at «nix-internal»/derivation-internal.nix:37:12:
36|
37| strict = derivationStrict drvAttrs;
| ^
38|
… while evaluating the option `driverConfiguration.vlans':
… while evaluating definitions from `/nix/store/vlhb7haagkjabf20g1vg9kxi53fcpi17-source/nixos/lib/testing/driver-configuration.nix':
… while evaluating the option `containers.machine1.networking.interfaces':
… while evaluating definitions from `/nix/store/vlhb7haagkjabf20g1vg9kxi53fcpi17-source/nixos/modules/hardware/facter/networking':
… while evaluating the option `containers.machine1.hardware.facter.enable':
… while evaluating the option `containers.machine1.hardware.facter.report':
… while evaluating the option `containers.machine1.hardware.facter.reportPath':
… while evaluating definitions from `/nix/store/rdgc1j2f1j05idz4l97fp775910gcjxd-source/nixosModules/clanCore/nixos-facter.nix':
(stack trace truncated; use '--show-trace' to show the full, detailed trace)
error: build of '/nix/store/pk6c6n73k6gbg9idc748ca11w67cxmwj-merged-test-dir-monitoring.drv^out' failed: error: gave up after 9 reschedules
|
||
checks.x86_64-linux.ncps
|
— | |
error: … while evaluating the attribute 'drvPath' at «https://releases.nixos.org/nixpkgs/nixpkgs-26.11pre1085827.aa48d3470809/nixexprs.tar.xz?na …error:
… while evaluating the attribute 'drvPath'
at «https://releases.nixos.org/nixpkgs/nixpkgs-26.11pre1085827.aa48d3470809/nixexprs.tar.xz?narHash=sha256-R4B%2BRRYmze9htmPZ8xeF19mchTSH99GdaqanKCW8CF8%3D»/lib/customisation.nix:416:11:
415| // {
416| drvPath =
| ^
417| assert condition;
… while calling the 'derivationStrict' builtin
at «nix-internal»/derivation-internal.nix:37:12:
36|
37| strict = derivationStrict drvAttrs;
| ^
38|
… while evaluating the option `driverConfiguration.vlans':
… while evaluating definitions from `/nix/store/vlhb7haagkjabf20g1vg9kxi53fcpi17-source/nixos/lib/testing/driver-configuration.nix':
… while evaluating the option `nodes.alice.networking.interfaces':
… while evaluating definitions from `/nix/store/vlhb7haagkjabf20g1vg9kxi53fcpi17-source/nixos/modules/hardware/facter/networking':
… while evaluating the option `nodes.alice.hardware.facter.enable':
… while evaluating the option `nodes.alice.hardware.facter.report':
… while evaluating the option `nodes.alice.hardware.facter.reportPath':
… while evaluating definitions from `/nix/store/rdgc1j2f1j05idz4l97fp775910gcjxd-source/nixosModules/clanCore/nixos-facter.nix':
(stack trace truncated; use '--show-trace' to show the full, detailed trace)
error: build of '/nix/store/n45h6kvx18h3iigq74lv8a1gyc50kwma-merged-test-dir-ncps.drv^out' failed: error: gave up after 9 reschedules
|
||
checks.x86_64-linux.packages
|
— | |
error: … while evaluating the attribute 'drvPath' at «https://releases.nixos.org/nixpkgs/nixpkgs-26.11pre1085827.aa48d3470809/nixexprs.tar.xz?na …error:
… while evaluating the attribute 'drvPath'
at «https://releases.nixos.org/nixpkgs/nixpkgs-26.11pre1085827.aa48d3470809/nixexprs.tar.xz?narHash=sha256-R4B%2BRRYmze9htmPZ8xeF19mchTSH99GdaqanKCW8CF8%3D»/lib/customisation.nix:416:11:
415| // {
416| drvPath =
| ^
417| assert condition;
… while calling the 'derivationStrict' builtin
at «nix-internal»/derivation-internal.nix:37:12:
36|
37| strict = derivationStrict drvAttrs;
| ^
38|
… while evaluating the option `driverConfiguration.vlans':
… while evaluating definitions from `/nix/store/vlhb7haagkjabf20g1vg9kxi53fcpi17-source/nixos/lib/testing/driver-configuration.nix':
… while evaluating the option `containers.server.networking.interfaces':
… while evaluating definitions from `/nix/store/vlhb7haagkjabf20g1vg9kxi53fcpi17-source/nixos/modules/hardware/facter/networking':
… while evaluating the option `containers.server.hardware.facter.enable':
… while evaluating the option `containers.server.hardware.facter.report':
… while evaluating the option `containers.server.hardware.facter.reportPath':
… while evaluating definitions from `/nix/store/rdgc1j2f1j05idz4l97fp775910gcjxd-source/nixosModules/clanCore/nixos-facter.nix':
(stack trace truncated; use '--show-trace' to show the full, detailed trace)
error: build of '/nix/store/0znb3q62jw8kp0lp8yzvksx4xg0ykvmy-merged-test-dir-packages.drv^out' failed: error: error: gRPC AddMultipleToStore on 'nix-store.geninf.io:50051' failed: error: path '/nix/store/3hwv4qpg203232ngaimvmxbx2xmvv9qf-vm' is required, but there is no substituter that can build it
|
||
checks.x86_64-linux.service-dummy-test
|
— | |
error: … while evaluating the attribute 'drvPath' at «https://releases.nixos.org/nixpkgs/nixpkgs-26.11pre1085827.aa48d3470809/nixexprs.tar.xz?na …error:
… while evaluating the attribute 'drvPath'
at «https://releases.nixos.org/nixpkgs/nixpkgs-26.11pre1085827.aa48d3470809/nixexprs.tar.xz?narHash=sha256-R4B%2BRRYmze9htmPZ8xeF19mchTSH99GdaqanKCW8CF8%3D»/lib/customisation.nix:416:11:
415| // {
416| drvPath =
| ^
417| assert condition;
… while calling the 'derivationStrict' builtin
at «nix-internal»/derivation-internal.nix:37:12:
36|
37| strict = derivationStrict drvAttrs;
| ^
38|
… while evaluating the option `driverConfiguration.vlans':
… while evaluating definitions from `/nix/store/vlhb7haagkjabf20g1vg9kxi53fcpi17-source/nixos/lib/testing/driver-configuration.nix':
… while evaluating the option `containers.admin1.networking.interfaces':
… while evaluating definitions from `/nix/store/vlhb7haagkjabf20g1vg9kxi53fcpi17-source/nixos/modules/hardware/facter/networking':
… while evaluating the option `containers.admin1.hardware.facter.enable':
… while evaluating the option `containers.admin1.hardware.facter.report':
… while evaluating the option `containers.admin1.hardware.facter.reportPath':
… while evaluating definitions from `/nix/store/rdgc1j2f1j05idz4l97fp775910gcjxd-source/nixosModules/clanCore/nixos-facter.nix':
(stack trace truncated; use '--show-trace' to show the full, detailed trace)
error: build of '/nix/store/czlliyn8fcyjsg46j3ls7fyn7m0hwb2v-merged-test-dir-service-dummy-test.drv^out' failed: error: gave up after 9 reschedules
|
||
checks.x86_64-linux.service-dummy-test-from-flake
|
— | |
error: … while evaluating the attribute 'drvPath' at «https://releases.nixos.org/nixpkgs/nixpkgs-26.11pre1085827.aa48d3470809/nixexprs.tar.xz?na …error:
… while evaluating the attribute 'drvPath'
at «https://releases.nixos.org/nixpkgs/nixpkgs-26.11pre1085827.aa48d3470809/nixexprs.tar.xz?narHash=sha256-R4B%2BRRYmze9htmPZ8xeF19mchTSH99GdaqanKCW8CF8%3D»/lib/customisation.nix:416:11:
415| // {
416| drvPath =
| ^
417| assert condition;
… while calling the 'derivationStrict' builtin
at «nix-internal»/derivation-internal.nix:37:12:
36|
37| strict = derivationStrict drvAttrs;
| ^
38|
… while evaluating the option `driverConfiguration.vlans':
… while evaluating definitions from `/nix/store/vlhb7haagkjabf20g1vg9kxi53fcpi17-source/nixos/lib/testing/driver-configuration.nix':
… while evaluating the option `containers.admin1.networking.interfaces':
… while evaluating definitions from `/nix/store/vlhb7haagkjabf20g1vg9kxi53fcpi17-source/nixos/modules/hardware/facter/networking':
… while evaluating the option `containers.admin1.hardware.facter.enable':
… while evaluating the option `containers.admin1.hardware.facter.report':
… while evaluating the option `containers.admin1.hardware.facter.reportPath':
… while evaluating definitions from `/nix/store/rdgc1j2f1j05idz4l97fp775910gcjxd-source/nixosModules/clanCore/nixos-facter.nix':
(stack trace truncated; use '--show-trace' to show the full, detailed trace)
error: build of '/nix/store/zgdpzhqa3sxqx7fgzv2k6pkhz7jcmz6j-merged-test-dir-service-dummy-test-from-flake.drv^out' failed: error: gave up after 9 reschedules
|
||
checks.x86_64-linux.users
|
— | |
error: … while evaluating the attribute 'drvPath' at «https://releases.nixos.org/nixpkgs/nixpkgs-26.11pre1085827.aa48d3470809/nixexprs.tar.xz?na …error:
… while evaluating the attribute 'drvPath'
at «https://releases.nixos.org/nixpkgs/nixpkgs-26.11pre1085827.aa48d3470809/nixexprs.tar.xz?narHash=sha256-R4B%2BRRYmze9htmPZ8xeF19mchTSH99GdaqanKCW8CF8%3D»/lib/customisation.nix:416:11:
415| // {
416| drvPath =
| ^
417| assert condition;
… while calling the 'derivationStrict' builtin
at «nix-internal»/derivation-internal.nix:37:12:
36|
37| strict = derivationStrict drvAttrs;
| ^
38|
… while evaluating the option `driverConfiguration.vlans':
… while evaluating definitions from `/nix/store/vlhb7haagkjabf20g1vg9kxi53fcpi17-source/nixos/lib/testing/driver-configuration.nix':
… while evaluating the option `containers.server.networking.interfaces':
… while evaluating definitions from `/nix/store/vlhb7haagkjabf20g1vg9kxi53fcpi17-source/nixos/modules/hardware/facter/networking':
… while evaluating the option `containers.server.hardware.facter.enable':
… while evaluating the option `containers.server.hardware.facter.report':
… while evaluating the option `containers.server.hardware.facter.reportPath':
… while evaluating definitions from `/nix/store/rdgc1j2f1j05idz4l97fp775910gcjxd-source/nixosModules/clanCore/nixos-facter.nix':
(stack trace truncated; use '--show-trace' to show the full, detailed trace)
error: build of '/nix/store/5jqa0ccazzz79ffqwxs63ag4wbmw6r2c-merged-test-dir-users.drv^out' failed: error: gave up after 9 reschedules
|
||
checks.x86_64-linux.zerotier
|
— | |
error: … while evaluating the attribute 'drvPath' at «https://releases.nixos.org/nixpkgs/nixpkgs-26.11pre1085827.aa48d3470809/nixexprs.tar.xz?na …error:
… while evaluating the attribute 'drvPath'
at «https://releases.nixos.org/nixpkgs/nixpkgs-26.11pre1085827.aa48d3470809/nixexprs.tar.xz?narHash=sha256-R4B%2BRRYmze9htmPZ8xeF19mchTSH99GdaqanKCW8CF8%3D»/lib/customisation.nix:416:11:
415| // {
416| drvPath =
| ^
417| assert condition;
… while calling the 'derivationStrict' builtin
at «nix-internal»/derivation-internal.nix:37:12:
36|
37| strict = derivationStrict drvAttrs;
| ^
38|
… while evaluating the option `driverConfiguration.vlans':
… while evaluating definitions from `/nix/store/vlhb7haagkjabf20g1vg9kxi53fcpi17-source/nixos/lib/testing/driver-configuration.nix':
… while evaluating the option `nodes.controller.networking.interfaces':
… while evaluating definitions from `/nix/store/vlhb7haagkjabf20g1vg9kxi53fcpi17-source/nixos/modules/hardware/facter/networking':
… while evaluating the option `nodes.controller.hardware.facter.enable':
… while evaluating the option `nodes.controller.hardware.facter.report':
… while evaluating the option `nodes.controller.hardware.facter.reportPath':
… while evaluating definitions from `/nix/store/rdgc1j2f1j05idz4l97fp775910gcjxd-source/nixosModules/clanCore/nixos-facter.nix':
(stack trace truncated; use '--show-trace' to show the full, detailed trace)
error: build of '/nix/store/s51axixpnzcwgjid3rn3hdbphbh02zd2-merged-test-dir-zerotier.drv^out' failed: error: gave up after 9 reschedules
|
||
checks.x86_64-linux.zerotier-multi-instance
|
— | |
error: … while evaluating the attribute 'drvPath' at «https://releases.nixos.org/nixpkgs/nixpkgs-26.11pre1085827.aa48d3470809/nixexprs.tar.xz?na …error:
… while evaluating the attribute 'drvPath'
at «https://releases.nixos.org/nixpkgs/nixpkgs-26.11pre1085827.aa48d3470809/nixexprs.tar.xz?narHash=sha256-R4B%2BRRYmze9htmPZ8xeF19mchTSH99GdaqanKCW8CF8%3D»/lib/customisation.nix:416:11:
415| // {
416| drvPath =
| ^
417| assert condition;
… while calling the 'derivationStrict' builtin
at «nix-internal»/derivation-internal.nix:37:12:
36|
37| strict = derivationStrict drvAttrs;
| ^
38|
… while evaluating the option `driverConfiguration.vlans':
… while evaluating definitions from `/nix/store/vlhb7haagkjabf20g1vg9kxi53fcpi17-source/nixos/lib/testing/driver-configuration.nix':
… while evaluating the option `nodes.alpha.networking.interfaces':
… while evaluating definitions from `/nix/store/vlhb7haagkjabf20g1vg9kxi53fcpi17-source/nixos/modules/hardware/facter/networking':
… while evaluating the option `nodes.alpha.hardware.facter.enable':
… while evaluating the option `nodes.alpha.hardware.facter.report':
… while evaluating the option `nodes.alpha.hardware.facter.reportPath':
… while evaluating definitions from `/nix/store/rdgc1j2f1j05idz4l97fp775910gcjxd-source/nixosModules/clanCore/nixos-facter.nix':
(stack trace truncated; use '--show-trace' to show the full, detailed trace)
error: build of '/nix/store/6hg0vipg9pla54dgnknx7jn1gbzmwd8r-merged-test-dir-zerotier-multi-instance.drv^out' failed: error: gave up after 9 reschedules
|
||
25 succeeded ⚠ 1
69 already built
| status | attribute | duration |
|---|---|---|
| loading… | ||