nixbot

builds

clan/clan-core build #931 failed

branch 26.05 · PR #8208 · commit f387659c22 · · took 5m 9s · eval 1m 57s

eval warnings 50 kinds · 385 occurrences
  • error …-merged-test-dir-borgbackup.drv: build-x86-01: build-x86-01: input not substitutable: error: path '/nix/store/…-test-vars-generated' is required, but there is no substituter that can build it, asking the scheduler again ×4
  • error …-merged-test-dir-certificates.drv: gi-build-x86-02: gi-build-x86-02: input not substitutable: error: path '/nix/store/…-test-vars-generated' is required, but there is no substituter that can build it, asking the scheduler again ×17
  • error …-merged-test-dir-borgbackup.drv: gi-build-x86-02: gi-build-x86-02: input not substitutable: error: path '/nix/store/…-test-vars-generated' is required, but there is no substituter that can build it, asking the scheduler again ×14
  • error …-merged-test-dir-data-mesher.drv: gi-build-x86-02: gi-build-x86-02: input not substitutable: error: path '/nix/store/…-test-vars-generated' is required, but there is no substituter that can build it, asking the scheduler again ×16
  • error …-merged-test-dir-mycelium.drv: gi-build-x86-02: gi-build-x86-02: input not substitutable: error: path '/nix/store/…-test-vars-generated' is required, but there is no substituter that can build it, asking the scheduler again ×11
  • error …-merged-test-dir-dm-dns.drv: build-x86-01: build-x86-01: input not substitutable: error: path '/nix/store/…-test-vars-generated' is required, but there is no substituter that can build it, asking the scheduler again ×7
  • error …-merged-test-dir-certificates.drv: build-x86-01: build-x86-01: input not substitutable: error: path '/nix/store/…-test-vars-generated' is required, but there is no substituter that can build it, asking the scheduler again ×1
  • error ×41
  • error build of '/nix/store/…-merged-test-dir-certificates.drv^out' failed: error: gave up after 9 reschedules ×2
  • error …-merged-test-dir-dm-dns.drv: gi-build-x86-02: gi-build-x86-02: input not substitutable: error: path '/nix/store/…-test-vars-generated' is required, but there is no substituter that can build it, asking the scheduler again ×11
  • error …-merged-test-dir-mycelium.drv: build-x86-01: build-x86-01: input not substitutable: error: path '/nix/store/…-test-vars-generated' is required, but there is no substituter that can build it, asking the scheduler again ×7
  • error …-merged-test-dir-service-machine-id.drv: gi-build-x86-02: gi-build-x86-02: input not substitutable: error: path '/nix/store/…-test-vars-generated' is required, but there is no substituter that can build it, asking the scheduler again ×14
  • error …-merged-test-dir-garage.drv: build-x86-01: build-x86-01: input not substitutable: error: path '/nix/store/…-test-vars-generated' is required, but there is no substituter that can build it, asking the scheduler again ×9
  • error …-merged-test-dir-monitoring.drv: gi-build-x86-02: gi-build-x86-02: input not substitutable: error: path '/nix/store/…-test-vars-generated' is required, but there is no substituter that can build it, asking the scheduler again ×4
  • error …-merged-test-dir-service-machine-id.drv: build-x86-01: build-x86-01: input not substitutable: error: path '/nix/store/…-test-vars-generated' is required, but there is no substituter that can build it, asking the scheduler again ×4
  • error …-merged-test-dir-matrix-synapse.drv: build-x86-01: build-x86-01: input not substitutable: error: path '/nix/store/…-test-vars-generated' is required, but there is no substituter that can build it, asking the scheduler again ×5
  • error …-merged-test-dir-ncps.drv: build-x86-01: build-x86-01: input not substitutable: error: path '/nix/store/…-test-vars-generated' is required, but there is no substituter that can build it, asking the scheduler again ×9
  • error …-merged-test-dir-garage.drv: gi-build-x86-02: gi-build-x86-02: input not substitutable: error: path '/nix/store/…-test-vars-generated' is required, but there is no substituter that can build it, asking the scheduler again ×9
  • error build of '/nix/store/…-merged-test-dir-borgbackup.drv^out' failed: error: gave up after 9 reschedules ×2
  • error …-merged-test-dir-monitoring.drv: build-x86-01: build-x86-01: input not substitutable: error: path '/nix/store/…-test-vars-generated' is required, but there is no substituter that can build it, asking the scheduler again ×14
  • error …-merged-test-dir-matrix-synapse.drv: gi-build-x86-02: gi-build-x86-02: input not substitutable: error: path '/nix/store/…-test-vars-generated' is required, but there is no substituter that can build it, asking the scheduler again ×13
  • error …-merged-test-dir-data-mesher.drv: build-x86-01: build-x86-01: input not substitutable: error: path '/nix/store/…-test-vars-generated' is required, but there is no substituter that can build it, asking the scheduler again ×2
  • error …-merged-test-dir-ncps.drv: gi-build-x86-02: gi-build-x86-02: input not substitutable: error: path '/nix/store/…-test-vars-generated' is required, but there is no substituter that can build it, asking the scheduler again ×9
  • error build of '/nix/store/…-merged-test-dir-data-mesher.drv^out' failed: error: gave up after 9 reschedules ×2
  • error …-merged-test-dir-nixos-test-password-store-mounts.drv: gi-build-x86-02: gi-build-x86-02: input not substitutable: error: path '/nix/store/…-test-vars-generated' is required, but there is no substituter that can build it, asking the scheduler again ×10
  • error …-merged-test-dir-nixos-test-password-store-mounts.drv: build-x86-01: build-x86-01: input not substitutable: error: path '/nix/store/…-test-vars-generated' is required, but there is no substituter that can build it, asking the scheduler again ×8
  • error build of '/nix/store/…-merged-test-dir-dm-dns.drv^out' failed: error: gave up after 9 reschedules ×2
  • error build of '/nix/store/…-merged-test-dir-monitoring.drv^out' failed: error: gave up after 9 reschedules ×2
  • error build of '/nix/store/…-merged-test-dir-mycelium.drv^out' failed: error: gave up after 9 reschedules ×2
  • error build of '/nix/store/…-merged-test-dir-ncps.drv^out' failed: error: gave up after 9 reschedules ×2
  • error build of '/nix/store/…-merged-test-dir-garage.drv^out' failed: error: gave up after 9 reschedules ×2
  • error …-merged-test-dir-clan-test-p2p-ssh-iroh.drv: gi-build-x86-02: gi-build-x86-02: input not substitutable: error: path '/nix/store/…-test-vars-generated' is required, but there is no substituter that can build it, asking the scheduler again ×15
  • error build of '/nix/store/…-merged-test-dir-matrix-synapse.drv^out' failed: error: gave up after 9 reschedules ×2
  • error …-merged-test-dir-clan-test-p2p-ssh-iroh.drv: build-x86-01: build-x86-01: input not substitutable: error: path '/nix/store/…-test-vars-generated' is required, but there is no substituter that can build it, asking the scheduler again ×3
  • error build of '/nix/store/…-merged-test-dir-service-machine-id.drv^out' failed: error: gave up after 9 reschedules ×2
  • error …-merged-test-dir-service-dummy-test-from-flake.drv: gi-build-x86-02: gi-build-x86-02: input not substitutable: error: path '/nix/store/…-test-vars-generated' is required, but there is no substituter that can build it, asking the scheduler again ×18
  • error build of '/nix/store/…-merged-test-dir-nixos-test-password-store-mounts.drv^out' failed: error: gave up after 9 reschedules ×2
  • error …-merged-test-dir-syncthing-service.drv: build-x86-01: build-x86-01: input not substitutable: error: path '/nix/store/…-test-vars-generated' is required, but there is no substituter that can build it, asking the scheduler again ×8
  • error …-merged-test-dir-pki.drv: gi-build-x86-02: gi-build-x86-02: input not substitutable: error: path '/nix/store/…-test-vars-generated' is required, but there is no substituter that can build it, asking the scheduler again ×13
  • error …-merged-test-dir-pki.drv: build-x86-01: build-x86-01: input not substitutable: error: path '/nix/store/…-test-vars-generated' is required, but there is no substituter that can build it, asking the scheduler again ×5
  • error …-merged-test-dir-syncthing-service.drv: gi-build-x86-02: gi-build-x86-02: input not substitutable: error: path '/nix/store/…-test-vars-generated' is required, but there is no substituter that can build it, asking the scheduler again ×10
  • error …-merged-test-dir-wireguard.drv: build-x86-01: build-x86-01: input not substitutable: error: path '/nix/store/…-test-vars-generated' is required, but there is no substituter that can build it, asking the scheduler again ×4
  • error …-merged-test-dir-service-dummy-test.drv: gi-build-x86-02: gi-build-x86-02: input not substitutable: error: path '/nix/store/…-test-vars-generated' is required, but there is no substituter that can build it, asking the scheduler again ×17
  • error …-merged-test-dir-users.drv: gi-build-x86-02: gi-build-x86-02: input not substitutable: error: path '/nix/store/…-test-vars-generated' is required, but there is no substituter that can build it, asking the scheduler again ×8
  • error build of '/nix/store/…-merged-test-dir-clan-test-p2p-ssh-iroh.drv^out' failed: error: gave up after 9 reschedules ×2
  • error build of '/nix/store/…-merged-test-dir-service-dummy-test-from-flake.drv^out' failed: error: gave up after 9 reschedules ×2
  • error …-merged-test-dir-service-dummy-test.drv: build-x86-01: build-x86-01: input not substitutable: error: path '/nix/store/…-test-vars-generated' is required, but there is no substituter that can build it, asking the scheduler again ×1
  • error build of '/nix/store/…-merged-test-dir-syncthing-service.drv^out' failed: error: gave up after 9 reschedules ×2
  • error build of '/nix/store/…-merged-test-dir-pki.drv^out' failed: error: gave up after 9 reschedules ×2
  • error …-merged-test-dir-wireguard.drv: gi-build-x86-02: gi-build-x86-02: input not substitutable: error: path '/nix/store/…-test-vars-generated' is required, but there is no substituter that can build it, asking the scheduler again ×14

52 failed
failed attributes
status attribute duration
failed checks.aarch64-darwin.all-packages 2m 4s
setup: /nix/store/jjlwnz5xzkxgql1v0dbbj611j6b4m469-zstd-1.5.7-dev /nix/store/2im2w9bb1h2gdm1g6j1x9hhjkqmrvs11-zxing-cpp-2.3.0 warning: ignoring the client-s …
setup:
  /nix/store/jjlwnz5xzkxgql1v0dbbj611j6b4m469-zstd-1.5.7-dev
  /nix/store/2im2w9bb1h2gdm1g6j1x9hhjkqmrvs11-zxing-cpp-2.3.0
warning: ignoring the client-specified setting 'store', because it is a restricted setting and you are not a trusted user
warning: 6g620wg253bdrp499fh3xyqmazxqa5qg-clan-core-flake.drv: no connected, non-draining worker for system 'aarch64-darwin' offers features {}, the workers offer {}, waiting up to 120s for a worker
warning: fdxiadmy1ap88rbn2k5g7ssj2wf3mikv-rendered.drv: no connected, non-draining worker for system 'aarch64-darwin' offers features {}, the workers offer {}, waiting up to 120s for a worker
6g620wg253bdrp499fh3xyqmazxqa5qg-clan-core-flake.drv: no connected, non-draining worker for system 'aarch64-darwin' offers features {}, the workers offer {}
fdxiadmy1ap88rbn2k5g7ssj2wf3mikv-rendered.drv: no connected, non-draining worker for system 'aarch64-darwin' offers features {}, the workers offer {}
error: dependency 'fdxiadmy1ap88rbn2k5g7ssj2wf3mikv-rendered.drv' failed
failed checks.aarch64-darwin.clan-pytest-without-core 2m 3s
setup: don't know how to build these paths: /nix/store/kn4hn3xljjl90fmjvqiqn4km3b8c6z0m-clan-pytest-without-core.drv warning: ignoring the client-specified se …
setup:
don't know how to build these paths:
  /nix/store/kn4hn3xljjl90fmjvqiqn4km3b8c6z0m-clan-pytest-without-core.drv
warning: ignoring the client-specified setting 'store', because it is a restricted setting and you are not a trusted user
warning: hwkpwqv8lj2mg99q1qhiwqqil7rk0vrl-clan-cli-source.drv: no connected, non-draining worker for system 'aarch64-darwin' offers features {}, the workers offer {}, waiting up to 120s for a worker
hwkpwqv8lj2mg99q1qhiwqqil7rk0vrl-clan-cli-source.drv: no connected, non-draining worker for system 'aarch64-darwin' offers features {}, the workers offer {}
error: dependency 'hwkpwqv8lj2mg99q1qhiwqqil7rk0vrl-clan-cli-source.drv' failed
failed checks.aarch64-darwin.devShell-clan-site 2m 4s
setup: /nix/store/5ds9fysxln35sqh4krqw9imr4m5lnr1q-zlib-ng-2.3.3 /nix/store/mxajghyzvi968fzv2vcwq368mxi92niw-zstd-1.5.7 /nix/store/sj5gmvy8rr4r60sdfic9w42 …
setup:
  /nix/store/5ds9fysxln35sqh4krqw9imr4m5lnr1q-zlib-ng-2.3.3
  /nix/store/mxajghyzvi968fzv2vcwq368mxi92niw-zstd-1.5.7
  /nix/store/sj5gmvy8rr4r60sdfic9w426addgjpq3-zstd-1.5.7-bin
  /nix/store/jjlwnz5xzkxgql1v0dbbj611j6b4m469-zstd-1.5.7-dev
warning: ignoring the client-specified setting 'store', because it is a restricted setting and you are not a trusted user
warning: fdxiadmy1ap88rbn2k5g7ssj2wf3mikv-rendered.drv: no connected, non-draining worker for system 'aarch64-darwin' offers features {}, the workers offer {}, waiting up to 120s for a worker
fdxiadmy1ap88rbn2k5g7ssj2wf3mikv-rendered.drv: no connected, non-draining worker for system 'aarch64-darwin' offers features {}, the workers offer {}
error: dependency '82k774cbkp3yarsmivnbjvrd7vjwq0ks-generated-docs.drv' failed
failed checks.aarch64-darwin.treefmt 2m 2s
setup: don't know how to build these paths: /nix/store/75bmqb96j93qh8wpyj6wcy61143abgkh-treefmt-check.drv warning: ignoring the client-specified setting 'stor …
setup:
don't know how to build these paths:
  /nix/store/75bmqb96j93qh8wpyj6wcy61143abgkh-treefmt-check.drv
warning: ignoring the client-specified setting 'store', because it is a restricted setting and you are not a trusted user
warning: 75bmqb96j93qh8wpyj6wcy61143abgkh-treefmt-check.drv: no connected, non-draining worker for system 'aarch64-darwin' offers features {}, the workers offer {}, waiting up to 120s for a worker
75bmqb96j93qh8wpyj6wcy61143abgkh-treefmt-check.drv: no connected, non-draining worker for system 'aarch64-darwin' offers features {}, the workers offer {}
error: no connected, non-draining worker for system 'aarch64-darwin' offers features {}, the workers offer {}
failed checks.aarch64-linux.all-packages 37s
setup: njn1h5sp6sn3pnb8mk7742n0wclgij55-rendered.drv: build01: build01: input not substitutable: error: path '/nix/store/6k2720j6wj0il6d7qdp34pzfig98jn93-option …
setup:
njn1h5sp6sn3pnb8mk7742n0wclgij55-rendered.drv: build01: build01: input not substitutable: error: path '/nix/store/6k2720j6wj0il6d7qdp34pzfig98jn93-options.json' is required, but there is no substituter that can build it, asking the scheduler again
njn1h5sp6sn3pnb8mk7742n0wclgij55-rendered.drv: build01: the build this call attached to did not finish, retry, asking the scheduler again
njn1h5sp6sn3pnb8mk7742n0wclgij55-rendered.drv: build01: build01: input not substitutable: error: path '/nix/store/6k2720j6wj0il6d7qdp34pzfig98jn93-options.json' is required, but there is no substituter that can build it, asking the scheduler again
njn1h5sp6sn3pnb8mk7742n0wclgij55-rendered.drv: build01: build01: input not substitutable: error: path '/nix/store/6k2720j6wj0il6d7qdp34pzfig98jn93-options.json' is required, but there is no substituter that can build it, asking the scheduler again
njn1h5sp6sn3pnb8mk7742n0wclgij55-rendered.drv: build01: build01: input not substitutable: error: path '/nix/store/6k2720j6wj0il6d7qdp34pzfig98jn93-options.json' is required, but there is no substituter that can build it, asking the scheduler again
njn1h5sp6sn3pnb8mk7742n0wclgij55-rendered.drv: build01: build01: input not substitutable: error: path '/nix/store/6k2720j6wj0il6d7qdp34pzfig98jn93-options.json' is required, but there is no substituter that can build it, asking the scheduler again
njn1h5sp6sn3pnb8mk7742n0wclgij55-rendered.drv: build01: build01: input not substitutable: error: path '/nix/store/6k2720j6wj0il6d7qdp34pzfig98jn93-options.json' is required, but there is no substituter that can build it, asking the scheduler again
error: dependency 'njn1h5sp6sn3pnb8mk7742n0wclgij55-rendered.drv' failed
failed eval checks.aarch64-linux.borgbackup —
error: … while evaluating the attribute 'drvPath' at «https://releases.nixos.org/nixos/26.05/nixos-26.05.11045.774debe7a0d1/nixexprs.tar.xz?narH …
error:
       … while evaluating the attribute 'drvPath'
         at «https://releases.nixos.org/nixos/26.05/nixos-26.05.11045.774debe7a0d1/nixexprs.tar.xz?narHash=sha256-S5MjznoY0gbQbcANPLz5RYjg%2B5/WQmFRgNbHcP%2Bydcg%3D»/lib/customisation.nix:427:7:
          426|     // {
          427|       drvPath =
             |       ^
          428|         assert condition;

       … while calling the 'derivationStrict' builtin
         at «nix-internal»/derivation-internal.nix:37:12:
           36|
           37|   strict = derivationStrict drvAttrs;
             |            ^
           38|

       … while evaluating the option `nodes.clientone.networking.interfaces':

       … while evaluating definitions from `/nix/store/csk881ggvmifg4qf1cal0r1ffflbmlhp-source/nixos/modules/hardware/facter/networking':

       … while evaluating the option `nodes.clientone.hardware.facter.enable':

       … while evaluating the option `nodes.clientone.hardware.facter.report':

       … while evaluating the option `nodes.clientone.hardware.facter.reportPath':

       … while evaluating definitions from `/nix/store/j7g24pc3fm3h212288bvz19vq0jlja50-source/nixosModules/clanCore/nixos-facter.nix':

       (stack trace truncated; use '--show-trace' to show the full, detailed trace)

       error: build of '/nix/store/c20nf5ixxlkl98byh90mdyscphw2i96v-merged-test-dir-borgbackup.drv^out' failed: error: gave up after 9 reschedules
failed eval checks.aarch64-linux.certificates —
error: … while evaluating the attribute 'drvPath' at «https://releases.nixos.org/nixos/26.05/nixos-26.05.11045.774debe7a0d1/nixexprs.tar.xz?narH …
error:
       … while evaluating the attribute 'drvPath'
         at «https://releases.nixos.org/nixos/26.05/nixos-26.05.11045.774debe7a0d1/nixexprs.tar.xz?narHash=sha256-S5MjznoY0gbQbcANPLz5RYjg%2B5/WQmFRgNbHcP%2Bydcg%3D»/lib/customisation.nix:427:7:
          426|     // {
          427|       drvPath =
             |       ^
          428|         assert condition;

       … while calling the 'derivationStrict' builtin
         at «nix-internal»/derivation-internal.nix:37:12:
           36|
           37|   strict = derivationStrict drvAttrs;
             |            ^
           38|

       … while evaluating the option `nodes.ca.networking.interfaces':

       … while evaluating definitions from `/nix/store/csk881ggvmifg4qf1cal0r1ffflbmlhp-source/nixos/modules/hardware/facter/networking':

       … while evaluating the option `nodes.ca.hardware.facter.enable':

       … while evaluating the option `nodes.ca.hardware.facter.report':

       … while evaluating the option `nodes.ca.hardware.facter.reportPath':

       … while evaluating definitions from `/nix/store/j7g24pc3fm3h212288bvz19vq0jlja50-source/nixosModules/clanCore/nixos-facter.nix':

       (stack trace truncated; use '--show-trace' to show the full, detailed trace)

       error: build of '/nix/store/2sfs7lp26wpjls0kgvikwkqadn400rph-merged-test-dir-certificates.drv^out' failed: error: gave up after 9 reschedules
failed checks.aarch64-linux.clan-app-pytest 7s
setup: dwcjdshs3lfqy6ix34xbcnv3ralga8gv-python3-3.13.15-env.drv: build01: build01: input not substitutable: error: some references of path '/nix/store/8fiaigjbn …
setup:
dwcjdshs3lfqy6ix34xbcnv3ralga8gv-python3-3.13.15-env.drv: build01: build01: input not substitutable: error: some references of path '/nix/store/8fiaigjbngkmgb70k0z9lpjccfj9wqr9-clan-cli' could not be realised, asking the scheduler again
dwcjdshs3lfqy6ix34xbcnv3ralga8gv-python3-3.13.15-env.drv: build01: build01: input not substitutable: error: some references of path '/nix/store/8fiaigjbngkmgb70k0z9lpjccfj9wqr9-clan-cli' could not be realised, asking the scheduler again
dwcjdshs3lfqy6ix34xbcnv3ralga8gv-python3-3.13.15-env.drv: build01: build01: input not substitutable: error: some references of path '/nix/store/8fiaigjbngkmgb70k0z9lpjccfj9wqr9-clan-cli' could not be realised, asking the scheduler again
dwcjdshs3lfqy6ix34xbcnv3ralga8gv-python3-3.13.15-env.drv: build01: build01: input not substitutable: error: some references of path '/nix/store/8fiaigjbngkmgb70k0z9lpjccfj9wqr9-clan-cli' could not be realised, asking the scheduler again
dwcjdshs3lfqy6ix34xbcnv3ralga8gv-python3-3.13.15-env.drv: build01: build01: input not substitutable: error: some references of path '/nix/store/8fiaigjbngkmgb70k0z9lpjccfj9wqr9-clan-cli' could not be realised, asking the scheduler again
dwcjdshs3lfqy6ix34xbcnv3ralga8gv-python3-3.13.15-env.drv: build01: build01: input not substitutable: error: some references of path '/nix/store/8fiaigjbngkmgb70k0z9lpjccfj9wqr9-clan-cli' could not be realised, asking the scheduler again
dwcjdshs3lfqy6ix34xbcnv3ralga8gv-python3-3.13.15-env.drv: build01: build01: input not substitutable: error: some references of path '/nix/store/8fiaigjbngkmgb70k0z9lpjccfj9wqr9-clan-cli' could not be realised, asking the scheduler again
error: dependency 'dwcjdshs3lfqy6ix34xbcnv3ralga8gv-python3-3.13.15-env.drv' failed
failed checks.aarch64-linux.clan-site-lint 36s
setup: njn1h5sp6sn3pnb8mk7742n0wclgij55-rendered.drv: build01: build01: input not substitutable: error: path '/nix/store/6k2720j6wj0il6d7qdp34pzfig98jn93-option …
setup:
njn1h5sp6sn3pnb8mk7742n0wclgij55-rendered.drv: build01: build01: input not substitutable: error: path '/nix/store/6k2720j6wj0il6d7qdp34pzfig98jn93-options.json' is required, but there is no substituter that can build it, asking the scheduler again
njn1h5sp6sn3pnb8mk7742n0wclgij55-rendered.drv: build01: the build this call attached to did not finish, retry, asking the scheduler again
njn1h5sp6sn3pnb8mk7742n0wclgij55-rendered.drv: build01: build01: input not substitutable: error: path '/nix/store/6k2720j6wj0il6d7qdp34pzfig98jn93-options.json' is required, but there is no substituter that can build it, asking the scheduler again
njn1h5sp6sn3pnb8mk7742n0wclgij55-rendered.drv: build01: the build this call attached to did not finish, retry, asking the scheduler again
njn1h5sp6sn3pnb8mk7742n0wclgij55-rendered.drv: build01: the build this call attached to did not finish, retry, asking the scheduler again
njn1h5sp6sn3pnb8mk7742n0wclgij55-rendered.drv: build01: the build this call attached to did not finish, retry, asking the scheduler again
njn1h5sp6sn3pnb8mk7742n0wclgij55-rendered.drv: build01: build01: input not substitutable: error: path '/nix/store/6k2720j6wj0il6d7qdp34pzfig98jn93-options.json' is required, but there is no substituter that can build it, asking the scheduler again
error: dependency 'axzkhci4m4r11sfpqrr1gp2zl872746c-generated-docs.drv' failed
failed eval checks.aarch64-linux.data-mesher —
error: … while evaluating the attribute 'drvPath' at «https://releases.nixos.org/nixos/26.05/nixos-26.05.11045.774debe7a0d1/nixexprs.tar.xz?narH …
error:
       … while evaluating the attribute 'drvPath'
         at «https://releases.nixos.org/nixos/26.05/nixos-26.05.11045.774debe7a0d1/nixexprs.tar.xz?narHash=sha256-S5MjznoY0gbQbcANPLz5RYjg%2B5/WQmFRgNbHcP%2Bydcg%3D»/lib/customisation.nix:427:7:
          426|     // {
          427|       drvPath =
             |       ^
          428|         assert condition;

       … while calling the 'derivationStrict' builtin
         at «nix-internal»/derivation-internal.nix:37:12:
           36|
           37|   strict = derivationStrict drvAttrs;
             |            ^
           38|

       … while evaluating the option `nodes.alpha.networking.interfaces':

       … while evaluating definitions from `/nix/store/csk881ggvmifg4qf1cal0r1ffflbmlhp-source/nixos/modules/hardware/facter/networking':

       … while evaluating the option `nodes.alpha.hardware.facter.enable':

       … while evaluating the option `nodes.alpha.hardware.facter.report':

       … while evaluating the option `nodes.alpha.hardware.facter.reportPath':

       … while evaluating definitions from `/nix/store/j7g24pc3fm3h212288bvz19vq0jlja50-source/nixosModules/clanCore/nixos-facter.nix':

       (stack trace truncated; use '--show-trace' to show the full, detailed trace)

       error: build of '/nix/store/bisdrchsk95mhvw467p4wq5b2f79msnx-merged-test-dir-data-mesher.drv^out' failed: error: gave up after 9 reschedules
failed checks.aarch64-linux.devShell-clan-site 31s
setup: njn1h5sp6sn3pnb8mk7742n0wclgij55-rendered.drv: build01: build01: input not substitutable: error: path '/nix/store/6k2720j6wj0il6d7qdp34pzfig98jn93-option …
setup:
njn1h5sp6sn3pnb8mk7742n0wclgij55-rendered.drv: build01: build01: input not substitutable: error: path '/nix/store/6k2720j6wj0il6d7qdp34pzfig98jn93-options.json' is required, but there is no substituter that can build it, asking the scheduler again
njn1h5sp6sn3pnb8mk7742n0wclgij55-rendered.drv: build01: build01: input not substitutable: error: path '/nix/store/6k2720j6wj0il6d7qdp34pzfig98jn93-options.json' is required, but there is no substituter that can build it, asking the scheduler again
njn1h5sp6sn3pnb8mk7742n0wclgij55-rendered.drv: build01: build01: input not substitutable: error: path '/nix/store/6k2720j6wj0il6d7qdp34pzfig98jn93-options.json' is required, but there is no substituter that can build it, asking the scheduler again
njn1h5sp6sn3pnb8mk7742n0wclgij55-rendered.drv: build01: build01: input not substitutable: error: path '/nix/store/6k2720j6wj0il6d7qdp34pzfig98jn93-options.json' is required, but there is no substituter that can build it, asking the scheduler again
njn1h5sp6sn3pnb8mk7742n0wclgij55-rendered.drv: build01: build01: input not substitutable: error: path '/nix/store/6k2720j6wj0il6d7qdp34pzfig98jn93-options.json' is required, but there is no substituter that can build it, asking the scheduler again
njn1h5sp6sn3pnb8mk7742n0wclgij55-rendered.drv: build01: build01: input not substitutable: error: path '/nix/store/6k2720j6wj0il6d7qdp34pzfig98jn93-options.json' is required, but there is no substituter that can build it, asking the scheduler again
njn1h5sp6sn3pnb8mk7742n0wclgij55-rendered.drv: build01: build01: input not substitutable: error: path '/nix/store/6k2720j6wj0il6d7qdp34pzfig98jn93-options.json' is required, but there is no substituter that can build it, asking the scheduler again
error: dependency 'axzkhci4m4r11sfpqrr1gp2zl872746c-generated-docs.drv' failed
failed checks.aarch64-linux.devShell-docs 36s
setup: njn1h5sp6sn3pnb8mk7742n0wclgij55-rendered.drv: build01: build01: input not substitutable: error: path '/nix/store/6k2720j6wj0il6d7qdp34pzfig98jn93-option …
setup:
njn1h5sp6sn3pnb8mk7742n0wclgij55-rendered.drv: build01: build01: input not substitutable: error: path '/nix/store/6k2720j6wj0il6d7qdp34pzfig98jn93-options.json' is required, but there is no substituter that can build it, asking the scheduler again
njn1h5sp6sn3pnb8mk7742n0wclgij55-rendered.drv: build01: build01: input not substitutable: error: path '/nix/store/6k2720j6wj0il6d7qdp34pzfig98jn93-options.json' is required, but there is no substituter that can build it, asking the scheduler again
njn1h5sp6sn3pnb8mk7742n0wclgij55-rendered.drv: build01: the build this call attached to did not finish, retry, asking the scheduler again
njn1h5sp6sn3pnb8mk7742n0wclgij55-rendered.drv: build01: build01: input not substitutable: error: path '/nix/store/6k2720j6wj0il6d7qdp34pzfig98jn93-options.json' is required, but there is no substituter that can build it, asking the scheduler again
njn1h5sp6sn3pnb8mk7742n0wclgij55-rendered.drv: build01: the build this call attached to did not finish, retry, asking the scheduler again
njn1h5sp6sn3pnb8mk7742n0wclgij55-rendered.drv: build01: build01: input not substitutable: error: path '/nix/store/6k2720j6wj0il6d7qdp34pzfig98jn93-options.json' is required, but there is no substituter that can build it, asking the scheduler again
njn1h5sp6sn3pnb8mk7742n0wclgij55-rendered.drv: build01: the build this call attached to did not finish, retry, asking the scheduler again
error: dependency 'axzkhci4m4r11sfpqrr1gp2zl872746c-generated-docs.drv' failed
failed eval checks.aarch64-linux.dm-dns —
error: … while evaluating the attribute 'drvPath' at «https://releases.nixos.org/nixos/26.05/nixos-26.05.11045.774debe7a0d1/nixexprs.tar.xz?narH …
error:
       … while evaluating the attribute 'drvPath'
         at «https://releases.nixos.org/nixos/26.05/nixos-26.05.11045.774debe7a0d1/nixexprs.tar.xz?narHash=sha256-S5MjznoY0gbQbcANPLz5RYjg%2B5/WQmFRgNbHcP%2Bydcg%3D»/lib/customisation.nix:427:7:
          426|     // {
          427|       drvPath =
             |       ^
          428|         assert condition;

       … while calling the 'derivationStrict' builtin
         at «nix-internal»/derivation-internal.nix:37:12:
           36|
           37|   strict = derivationStrict drvAttrs;
             |            ^
           38|

       … while evaluating the option `nodes.client.networking.interfaces':

       … while evaluating definitions from `/nix/store/csk881ggvmifg4qf1cal0r1ffflbmlhp-source/nixos/modules/hardware/facter/networking':

       … while evaluating the option `nodes.client.hardware.facter.enable':

       … while evaluating the option `nodes.client.hardware.facter.report':

       … while evaluating the option `nodes.client.hardware.facter.reportPath':

       … while evaluating definitions from `/nix/store/j7g24pc3fm3h212288bvz19vq0jlja50-source/nixosModules/clanCore/nixos-facter.nix':

       (stack trace truncated; use '--show-trace' to show the full, detailed trace)

       error: build of '/nix/store/yln3f9jkdz1nwbsd4mb869zl8hfcnvyl-merged-test-dir-dm-dns.drv^out' failed: error: gave up after 9 reschedules
failed eval checks.aarch64-linux.garage —
error: … while evaluating the attribute 'drvPath' at «https://releases.nixos.org/nixos/26.05/nixos-26.05.11045.774debe7a0d1/nixexprs.tar.xz?narH …
error:
       … while evaluating the attribute 'drvPath'
         at «https://releases.nixos.org/nixos/26.05/nixos-26.05.11045.774debe7a0d1/nixexprs.tar.xz?narHash=sha256-S5MjznoY0gbQbcANPLz5RYjg%2B5/WQmFRgNbHcP%2Bydcg%3D»/lib/customisation.nix:427:7:
          426|     // {
          427|       drvPath =
             |       ^
          428|         assert condition;

       … while calling the 'derivationStrict' builtin
         at «nix-internal»/derivation-internal.nix:37:12:
           36|
           37|   strict = derivationStrict drvAttrs;
             |            ^
           38|

       … while evaluating the option `nodes.server.networking.interfaces':

       … while evaluating definitions from `/nix/store/csk881ggvmifg4qf1cal0r1ffflbmlhp-source/nixos/modules/hardware/facter/networking':

       … while evaluating the option `nodes.server.hardware.facter.enable':

       … while evaluating the option `nodes.server.hardware.facter.report':

       … while evaluating the option `nodes.server.hardware.facter.reportPath':

       … while evaluating definitions from `/nix/store/j7g24pc3fm3h212288bvz19vq0jlja50-source/nixosModules/clanCore/nixos-facter.nix':

       (stack trace truncated; use '--show-trace' to show the full, detailed trace)

       error: build of '/nix/store/m5bznfa9ljfbjad6mr813wqn4ncj0h1c-merged-test-dir-garage.drv^out' failed: error: gave up after 9 reschedules
failed eval checks.aarch64-linux.machine-id —
error: … while evaluating the attribute 'drvPath' at «https://releases.nixos.org/nixos/26.05/nixos-26.05.11045.774debe7a0d1/nixexprs.tar.xz?narH …
error:
       … while evaluating the attribute 'drvPath'
         at «https://releases.nixos.org/nixos/26.05/nixos-26.05.11045.774debe7a0d1/nixexprs.tar.xz?narHash=sha256-S5MjznoY0gbQbcANPLz5RYjg%2B5/WQmFRgNbHcP%2Bydcg%3D»/lib/customisation.nix:427:7:
          426|     // {
          427|       drvPath =
             |       ^
          428|         assert condition;

       … while calling the 'derivationStrict' builtin
         at «nix-internal»/derivation-internal.nix:37:12:
           36|
           37|   strict = derivationStrict drvAttrs;
             |            ^
           38|

       … while evaluating the option `nodes.server.networking.interfaces':

       … while evaluating definitions from `/nix/store/csk881ggvmifg4qf1cal0r1ffflbmlhp-source/nixos/modules/hardware/facter/networking':

       … while evaluating the option `nodes.server.hardware.facter.enable':

       … while evaluating the option `nodes.server.hardware.facter.report':

       … while evaluating the option `nodes.server.hardware.facter.reportPath':

       … while evaluating definitions from `/nix/store/j7g24pc3fm3h212288bvz19vq0jlja50-source/nixosModules/clanCore/nixos-facter.nix':

       (stack trace truncated; use '--show-trace' to show the full, detailed trace)

       error: build of '/nix/store/1aw9g733adh7hh3dcxcs1bmkzhb8izr1-merged-test-dir-service-machine-id.drv^out' failed: error: gave up after 9 reschedules
failed eval checks.aarch64-linux.matrix-synapse —
error: … while evaluating the attribute 'drvPath' at «https://releases.nixos.org/nixos/26.05/nixos-26.05.11045.774debe7a0d1/nixexprs.tar.xz?narH …
error:
       … while evaluating the attribute 'drvPath'
         at «https://releases.nixos.org/nixos/26.05/nixos-26.05.11045.774debe7a0d1/nixexprs.tar.xz?narHash=sha256-S5MjznoY0gbQbcANPLz5RYjg%2B5/WQmFRgNbHcP%2Bydcg%3D»/lib/customisation.nix:427:7:
          426|     // {
          427|       drvPath =
             |       ^
          428|         assert condition;

       … while calling the 'derivationStrict' builtin
         at «nix-internal»/derivation-internal.nix:37:12:
           36|
           37|   strict = derivationStrict drvAttrs;
             |            ^
           38|

       … while evaluating the option `nodes.machine.networking.interfaces':

       … while evaluating definitions from `/nix/store/csk881ggvmifg4qf1cal0r1ffflbmlhp-source/nixos/modules/hardware/facter/networking':

       … while evaluating the option `nodes.machine.hardware.facter.enable':

       … while evaluating the option `nodes.machine.hardware.facter.report':

       … while evaluating the option `nodes.machine.hardware.facter.reportPath':

       … while evaluating definitions from `/nix/store/j7g24pc3fm3h212288bvz19vq0jlja50-source/nixosModules/clanCore/nixos-facter.nix':

       (stack trace truncated; use '--show-trace' to show the full, detailed trace)

       error: build of '/nix/store/1k4q4h7b0264nnw73rgmiyag11gv3b9k-merged-test-dir-matrix-synapse.drv^out' failed: error: gave up after 9 reschedules
failed eval checks.aarch64-linux.monitoring —
error: … while evaluating the attribute 'drvPath' at «https://releases.nixos.org/nixos/26.05/nixos-26.05.11045.774debe7a0d1/nixexprs.tar.xz?narH …
error:
       … while evaluating the attribute 'drvPath'
         at «https://releases.nixos.org/nixos/26.05/nixos-26.05.11045.774debe7a0d1/nixexprs.tar.xz?narHash=sha256-S5MjznoY0gbQbcANPLz5RYjg%2B5/WQmFRgNbHcP%2Bydcg%3D»/lib/customisation.nix:427:7:
          426|     // {
          427|       drvPath =
             |       ^
          428|         assert condition;

       … while calling the 'derivationStrict' builtin
         at «nix-internal»/derivation-internal.nix:37:12:
           36|
           37|   strict = derivationStrict drvAttrs;
             |            ^
           38|

       … while evaluating the option `nodes.machine1.networking.interfaces':

       … while evaluating definitions from `/nix/store/csk881ggvmifg4qf1cal0r1ffflbmlhp-source/nixos/modules/hardware/facter/networking':

       … while evaluating the option `nodes.machine1.hardware.facter.enable':

       … while evaluating the option `nodes.machine1.hardware.facter.report':

       … while evaluating the option `nodes.machine1.hardware.facter.reportPath':

       … while evaluating definitions from `/nix/store/j7g24pc3fm3h212288bvz19vq0jlja50-source/nixosModules/clanCore/nixos-facter.nix':

       (stack trace truncated; use '--show-trace' to show the full, detailed trace)

       error: build of '/nix/store/w7lsmv9zb3ng21k9akkmgq342l47ylf2-merged-test-dir-monitoring.drv^out' failed: error: gave up after 9 reschedules
failed eval checks.aarch64-linux.mycelium —
error: … while evaluating the attribute 'drvPath' at «https://releases.nixos.org/nixos/26.05/nixos-26.05.11045.774debe7a0d1/nixexprs.tar.xz?narH …
error:
       … while evaluating the attribute 'drvPath'
         at «https://releases.nixos.org/nixos/26.05/nixos-26.05.11045.774debe7a0d1/nixexprs.tar.xz?narHash=sha256-S5MjznoY0gbQbcANPLz5RYjg%2B5/WQmFRgNbHcP%2Bydcg%3D»/lib/customisation.nix:427:7:
          426|     // {
          427|       drvPath =
             |       ^
          428|         assert condition;

       … while calling the 'derivationStrict' builtin
         at «nix-internal»/derivation-internal.nix:37:12:
           36|
           37|   strict = derivationStrict drvAttrs;
             |            ^
           38|

       … while evaluating the option `driverConfiguration.vlans':

       … while evaluating definitions from `/nix/store/csk881ggvmifg4qf1cal0r1ffflbmlhp-source/nixos/lib/testing/driver-configuration.nix':

       … while evaluating the option `nodes.server.networking.interfaces':

       … while evaluating definitions from `/nix/store/csk881ggvmifg4qf1cal0r1ffflbmlhp-source/nixos/modules/hardware/facter/networking':

       … while evaluating the option `nodes.server.hardware.facter.enable':

       … while evaluating the option `nodes.server.hardware.facter.report':

       … while evaluating the option `nodes.server.hardware.facter.reportPath':

       … while evaluating definitions from `/nix/store/j7g24pc3fm3h212288bvz19vq0jlja50-source/nixosModules/clanCore/nixos-facter.nix':

       (stack trace truncated; use '--show-trace' to show the full, detailed trace)

       error: build of '/nix/store/wrfb0i91rk06qpfq4p27lyskcqjlvfl6-merged-test-dir-mycelium.drv^out' failed: error: gave up after 9 reschedules
failed eval checks.aarch64-linux.ncps —
error: … while evaluating the attribute 'drvPath' at «https://releases.nixos.org/nixos/26.05/nixos-26.05.11045.774debe7a0d1/nixexprs.tar.xz?narH …
error:
       … while evaluating the attribute 'drvPath'
         at «https://releases.nixos.org/nixos/26.05/nixos-26.05.11045.774debe7a0d1/nixexprs.tar.xz?narHash=sha256-S5MjznoY0gbQbcANPLz5RYjg%2B5/WQmFRgNbHcP%2Bydcg%3D»/lib/customisation.nix:427:7:
          426|     // {
          427|       drvPath =
             |       ^
          428|         assert condition;

       … while calling the 'derivationStrict' builtin
         at «nix-internal»/derivation-internal.nix:37:12:
           36|
           37|   strict = derivationStrict drvAttrs;
             |            ^
           38|

       … while evaluating the option `nodes.alice.networking.interfaces':

       … while evaluating definitions from `/nix/store/csk881ggvmifg4qf1cal0r1ffflbmlhp-source/nixos/modules/hardware/facter/networking':

       … while evaluating the option `nodes.alice.hardware.facter.enable':

       … while evaluating the option `nodes.alice.hardware.facter.report':

       … while evaluating the option `nodes.alice.hardware.facter.reportPath':

       … while evaluating definitions from `/nix/store/j7g24pc3fm3h212288bvz19vq0jlja50-source/nixosModules/clanCore/nixos-facter.nix':

       (stack trace truncated; use '--show-trace' to show the full, detailed trace)

       error: build of '/nix/store/0b9va4azqjj9ka1fylgah8qwbq7xx0l5-merged-test-dir-ncps.drv^out' failed: error: gave up after 9 reschedules
failed checks.aarch64-linux.nixos-systemd-abstraction 35s
setup: don't know how to build these paths: /nix/store/xsx6d1v0whw37wdbw2k6ysxz5anwbz2f-container-test-run-systemd-abstraction.drv warning: ignoring the clien …
setup:
don't know how to build these paths:
  /nix/store/xsx6d1v0whw37wdbw2k6ysxz5anwbz2f-container-test-run-systemd-abstraction.drv
warning: ignoring the client-specified setting 'store', because it is a restricted setting and you are not a trusted user
iq2y2in8awap3dkjpkwwf16ffqrad1zf-system-path.drv: error: gRPC AddMultipleToStore on 'nix-store.geninf.io:50051' failed: error: some references of path '/nix/store/n2p02gjiqfhl4sy08ay55klv7jbz845l-perl-5.42.0-env.drv' could not be realised
error: dependency '3y7xbmz6036cdlpvji2hyw4rh51mvcn0-nixos-test-driver-systemd-abstraction.drv' failed
failed eval checks.aarch64-linux.nixos-test-password-store-mounts —
error: … while evaluating the attribute 'drvPath' at «https://releases.nixos.org/nixos/26.05/nixos-26.05.11045.774debe7a0d1/nixexprs.tar.xz?narH …
error:
       … while evaluating the attribute 'drvPath'
         at «https://releases.nixos.org/nixos/26.05/nixos-26.05.11045.774debe7a0d1/nixexprs.tar.xz?narHash=sha256-S5MjznoY0gbQbcANPLz5RYjg%2B5/WQmFRgNbHcP%2Bydcg%3D»/lib/customisation.nix:427:7:
          426|     // {
          427|       drvPath =
             |       ^
          428|         assert condition;

       … while calling the 'derivationStrict' builtin
         at «nix-internal»/derivation-internal.nix:37:12:
           36|
           37|   strict = derivationStrict drvAttrs;
             |            ^
           38|

       … while evaluating the option `driverConfiguration.vlans':

       … while evaluating definitions from `/nix/store/csk881ggvmifg4qf1cal0r1ffflbmlhp-source/nixos/lib/testing/driver-configuration.nix':

       … while evaluating the option `nodes.machine.networking.interfaces':

       … while evaluating definitions from `/nix/store/csk881ggvmifg4qf1cal0r1ffflbmlhp-source/nixos/modules/hardware/facter/networking':

       … while evaluating the option `nodes.machine.hardware.facter.enable':

       … while evaluating the option `nodes.machine.hardware.facter.report':

       … while evaluating the option `nodes.machine.hardware.facter.reportPath':

       … while evaluating definitions from `/nix/store/j7g24pc3fm3h212288bvz19vq0jlja50-source/nixosModules/clanCore/nixos-facter.nix':

       (stack trace truncated; use '--show-trace' to show the full, detailed trace)

       error: build of '/nix/store/f3zzvddf2jfahb56201p48pfrxvn9qkr-merged-test-dir-nixos-test-password-store-mounts.drv^out' failed: error: gave up after 9 reschedules
failed eval checks.aarch64-linux.p2p-ssh-iroh —
error: … while evaluating the attribute 'drvPath' at «https://releases.nixos.org/nixos/26.05/nixos-26.05.11045.774debe7a0d1/nixexprs.tar.xz?narH …
error:
       … while evaluating the attribute 'drvPath'
         at «https://releases.nixos.org/nixos/26.05/nixos-26.05.11045.774debe7a0d1/nixexprs.tar.xz?narHash=sha256-S5MjznoY0gbQbcANPLz5RYjg%2B5/WQmFRgNbHcP%2Bydcg%3D»/lib/customisation.nix:427:7:
          426|     // {
          427|       drvPath =
             |       ^
          428|         assert condition;

       … while calling the 'derivationStrict' builtin
         at «nix-internal»/derivation-internal.nix:37:12:
           36|
           37|   strict = derivationStrict drvAttrs;
             |            ^
           38|

       … while evaluating the option `nodes.client.networking.interfaces':

       … while evaluating definitions from `/nix/store/csk881ggvmifg4qf1cal0r1ffflbmlhp-source/nixos/modules/hardware/facter/networking':

       … while evaluating the option `nodes.client.hardware.facter.enable':

       … while evaluating the option `nodes.client.hardware.facter.report':

       … while evaluating the option `nodes.client.hardware.facter.reportPath':

       … while evaluating definitions from `/nix/store/j7g24pc3fm3h212288bvz19vq0jlja50-source/nixosModules/clanCore/nixos-facter.nix':

       (stack trace truncated; use '--show-trace' to show the full, detailed trace)

       error: build of '/nix/store/66ndbbglvmibsd07r7ajj48sdckr2kcz-merged-test-dir-clan-test-p2p-ssh-iroh.drv^out' failed: error: gave up after 9 reschedules
failed eval checks.aarch64-linux.pki —
error: … while evaluating the attribute 'drvPath' at «https://releases.nixos.org/nixos/26.05/nixos-26.05.11045.774debe7a0d1/nixexprs.tar.xz?narH …
error:
       … while evaluating the attribute 'drvPath'
         at «https://releases.nixos.org/nixos/26.05/nixos-26.05.11045.774debe7a0d1/nixexprs.tar.xz?narHash=sha256-S5MjznoY0gbQbcANPLz5RYjg%2B5/WQmFRgNbHcP%2Bydcg%3D»/lib/customisation.nix:427:7:
          426|     // {
          427|       drvPath =
             |       ^
          428|         assert condition;

       … while calling the 'derivationStrict' builtin
         at «nix-internal»/derivation-internal.nix:37:12:
           36|
           37|   strict = derivationStrict drvAttrs;
             |            ^
           38|

       … while evaluating the option `driverConfiguration.vlans':

       … while evaluating definitions from `/nix/store/csk881ggvmifg4qf1cal0r1ffflbmlhp-source/nixos/lib/testing/driver-configuration.nix':

       … while evaluating the option `nodes.caddy.networking.interfaces':

       … while evaluating definitions from `/nix/store/csk881ggvmifg4qf1cal0r1ffflbmlhp-source/nixos/modules/hardware/facter/networking':

       … while evaluating the option `nodes.caddy.hardware.facter.enable':

       … while evaluating the option `nodes.caddy.hardware.facter.report':

       … while evaluating the option `nodes.caddy.hardware.facter.reportPath':

       … while evaluating definitions from `/nix/store/j7g24pc3fm3h212288bvz19vq0jlja50-source/nixosModules/clanCore/nixos-facter.nix':

       (stack trace truncated; use '--show-trace' to show the full, detailed trace)

       error: build of '/nix/store/jifhxdzffi03r9ax3ri3nqdg8rcg62ax-merged-test-dir-pki.drv^out' failed: error: gave up after 9 reschedules
failed eval checks.aarch64-linux.service-dummy-test —
error: … while evaluating the attribute 'drvPath' at «https://releases.nixos.org/nixos/26.05/nixos-26.05.11045.774debe7a0d1/nixexprs.tar.xz?narH …
error:
       … while evaluating the attribute 'drvPath'
         at «https://releases.nixos.org/nixos/26.05/nixos-26.05.11045.774debe7a0d1/nixexprs.tar.xz?narHash=sha256-S5MjznoY0gbQbcANPLz5RYjg%2B5/WQmFRgNbHcP%2Bydcg%3D»/lib/customisation.nix:427:7:
          426|     // {
          427|       drvPath =
             |       ^
          428|         assert condition;

       … while calling the 'derivationStrict' builtin
         at «nix-internal»/derivation-internal.nix:37:12:
           36|
           37|   strict = derivationStrict drvAttrs;
             |            ^
           38|

       … while evaluating the option `nodes.admin1.networking.interfaces':

       … while evaluating definitions from `/nix/store/csk881ggvmifg4qf1cal0r1ffflbmlhp-source/nixos/modules/hardware/facter/networking':

       … while evaluating the option `nodes.admin1.hardware.facter.enable':

       … while evaluating the option `nodes.admin1.hardware.facter.report':

       … while evaluating the option `nodes.admin1.hardware.facter.reportPath':

       … while evaluating definitions from `/nix/store/j7g24pc3fm3h212288bvz19vq0jlja50-source/nixosModules/clanCore/nixos-facter.nix':

       (stack trace truncated; use '--show-trace' to show the full, detailed trace)

       error: build of '/nix/store/93r99wqlyhxzhj15ga3hbs1inkv5rq1w-merged-test-dir-service-dummy-test.drv^out' failed: error: gave up after 9 reschedules
failed eval checks.aarch64-linux.service-dummy-test-from-flake —
error: … while evaluating the attribute 'drvPath' at «https://releases.nixos.org/nixos/26.05/nixos-26.05.11045.774debe7a0d1/nixexprs.tar.xz?narH …
error:
       … while evaluating the attribute 'drvPath'
         at «https://releases.nixos.org/nixos/26.05/nixos-26.05.11045.774debe7a0d1/nixexprs.tar.xz?narHash=sha256-S5MjznoY0gbQbcANPLz5RYjg%2B5/WQmFRgNbHcP%2Bydcg%3D»/lib/customisation.nix:427:7:
          426|     // {
          427|       drvPath =
             |       ^
          428|         assert condition;

       … while calling the 'derivationStrict' builtin
         at «nix-internal»/derivation-internal.nix:37:12:
           36|
           37|   strict = derivationStrict drvAttrs;
             |            ^
           38|

       … while evaluating the option `nodes.admin1.networking.interfaces':

       … while evaluating definitions from `/nix/store/csk881ggvmifg4qf1cal0r1ffflbmlhp-source/nixos/modules/hardware/facter/networking':

       … while evaluating the option `nodes.admin1.hardware.facter.enable':

       … while evaluating the option `nodes.admin1.hardware.facter.report':

       … while evaluating the option `nodes.admin1.hardware.facter.reportPath':

       … while evaluating definitions from `/nix/store/j7g24pc3fm3h212288bvz19vq0jlja50-source/nixosModules/clanCore/nixos-facter.nix':

       (stack trace truncated; use '--show-trace' to show the full, detailed trace)

       error: build of '/nix/store/qsfzrf8p2qb5lhr0nf2j11s5gyi38qbl-merged-test-dir-service-dummy-test-from-flake.drv^out' failed: error: gave up after 9 reschedules
failed eval checks.aarch64-linux.syncthing-service —
error: … while evaluating the attribute 'drvPath' at «https://releases.nixos.org/nixos/26.05/nixos-26.05.11045.774debe7a0d1/nixexprs.tar.xz?narH …
error:
       … while evaluating the attribute 'drvPath'
         at «https://releases.nixos.org/nixos/26.05/nixos-26.05.11045.774debe7a0d1/nixexprs.tar.xz?narHash=sha256-S5MjznoY0gbQbcANPLz5RYjg%2B5/WQmFRgNbHcP%2Bydcg%3D»/lib/customisation.nix:427:7:
          426|     // {
          427|       drvPath =
             |       ^
          428|         assert condition;

       … while calling the 'derivationStrict' builtin
         at «nix-internal»/derivation-internal.nix:37:12:
           36|
           37|   strict = derivationStrict drvAttrs;
             |            ^
           38|

       … while evaluating the option `nodes.machine1.networking.interfaces':

       … while evaluating definitions from `/nix/store/csk881ggvmifg4qf1cal0r1ffflbmlhp-source/nixos/modules/hardware/facter/networking':

       … while evaluating the option `nodes.machine1.hardware.facter.enable':

       … while evaluating the option `nodes.machine1.hardware.facter.report':

       … while evaluating the option `nodes.machine1.hardware.facter.reportPath':

       … while evaluating definitions from `/nix/store/j7g24pc3fm3h212288bvz19vq0jlja50-source/nixosModules/clanCore/nixos-facter.nix':

       (stack trace truncated; use '--show-trace' to show the full, detailed trace)

       error: build of '/nix/store/8ixbnwzwsadhimss7kqf9qm86dgjzchh-merged-test-dir-syncthing-service.drv^out' failed: error: gave up after 9 reschedules
failed checks.aarch64-linux.treefmt 36s
setup: fdqbj4aygy42dhl65wmzxsh5gvzaj7az-treefmt-check.drv: build01: build01: input not substitutable: error: some references of path '/nix/store/nq7qhm9f18ilkx5 …
setup:
fdqbj4aygy42dhl65wmzxsh5gvzaj7az-treefmt-check.drv: build01: build01: input not substitutable: error: some references of path '/nix/store/nq7qhm9f18ilkx5ffi48gs0sfyxzcgs2-treefmt' could not be realised, asking the scheduler again
fdqbj4aygy42dhl65wmzxsh5gvzaj7az-treefmt-check.drv: build01: build01: input not substitutable: error: some references of path '/nix/store/nq7qhm9f18ilkx5ffi48gs0sfyxzcgs2-treefmt' could not be realised, asking the scheduler again
fdqbj4aygy42dhl65wmzxsh5gvzaj7az-treefmt-check.drv: build01: build01: input not substitutable: error: some references of path '/nix/store/nq7qhm9f18ilkx5ffi48gs0sfyxzcgs2-treefmt' could not be realised, asking the scheduler again
fdqbj4aygy42dhl65wmzxsh5gvzaj7az-treefmt-check.drv: build01: build01: input not substitutable: error: some references of path '/nix/store/nq7qhm9f18ilkx5ffi48gs0sfyxzcgs2-treefmt' could not be realised, asking the scheduler again
fdqbj4aygy42dhl65wmzxsh5gvzaj7az-treefmt-check.drv: build01: build01: input not substitutable: error: some references of path '/nix/store/nq7qhm9f18ilkx5ffi48gs0sfyxzcgs2-treefmt' could not be realised, asking the scheduler again
fdqbj4aygy42dhl65wmzxsh5gvzaj7az-treefmt-check.drv: build01: build01: input not substitutable: error: some references of path '/nix/store/nq7qhm9f18ilkx5ffi48gs0sfyxzcgs2-treefmt' could not be realised, asking the scheduler again
fdqbj4aygy42dhl65wmzxsh5gvzaj7az-treefmt-check.drv: build01: build01: input not substitutable: error: some references of path '/nix/store/nq7qhm9f18ilkx5ffi48gs0sfyxzcgs2-treefmt' could not be realised, asking the scheduler again
error: gave up after 9 reschedules
failed eval checks.aarch64-linux.users —
error: … while evaluating the attribute 'drvPath' at «https://releases.nixos.org/nixos/26.05/nixos-26.05.11045.774debe7a0d1/nixexprs.tar.xz?narH …
error:
       … while evaluating the attribute 'drvPath'
         at «https://releases.nixos.org/nixos/26.05/nixos-26.05.11045.774debe7a0d1/nixexprs.tar.xz?narHash=sha256-S5MjznoY0gbQbcANPLz5RYjg%2B5/WQmFRgNbHcP%2Bydcg%3D»/lib/customisation.nix:427:7:
          426|     // {
          427|       drvPath =
             |       ^
          428|         assert condition;

       … while calling the 'derivationStrict' builtin
         at «nix-internal»/derivation-internal.nix:37:12:
           36|
           37|   strict = derivationStrict drvAttrs;
             |            ^
           38|

       … while evaluating the option `nodes.server.networking.interfaces':

       … while evaluating definitions from `/nix/store/csk881ggvmifg4qf1cal0r1ffflbmlhp-source/nixos/modules/hardware/facter/networking':

       … while evaluating the option `nodes.server.hardware.facter.enable':

       … while evaluating the option `nodes.server.hardware.facter.report':

       … while evaluating the option `nodes.server.hardware.facter.reportPath':

       … while evaluating definitions from `/nix/store/j7g24pc3fm3h212288bvz19vq0jlja50-source/nixosModules/clanCore/nixos-facter.nix':

       (stack trace truncated; use '--show-trace' to show the full, detailed trace)

       error: build of '/nix/store/rx39mmxfmdxw2hp0hy63igdj7q0j0mqw-merged-test-dir-users.drv^out' failed: error: gave up after 9 reschedules
failed eval checks.aarch64-linux.wireguard —
error: … while evaluating the attribute 'drvPath' at «https://releases.nixos.org/nixos/26.05/nixos-26.05.11045.774debe7a0d1/nixexprs.tar.xz?narH …
error:
       … while evaluating the attribute 'drvPath'
         at «https://releases.nixos.org/nixos/26.05/nixos-26.05.11045.774debe7a0d1/nixexprs.tar.xz?narHash=sha256-S5MjznoY0gbQbcANPLz5RYjg%2B5/WQmFRgNbHcP%2Bydcg%3D»/lib/customisation.nix:427:7:
          426|     // {
          427|       drvPath =
             |       ^
          428|         assert condition;

       … while calling the 'derivationStrict' builtin
         at «nix-internal»/derivation-internal.nix:37:12:
           36|
           37|   strict = derivationStrict drvAttrs;
             |            ^
           38|

       … while evaluating the option `nodes.controller1.networking.interfaces':

       … while evaluating definitions from `/nix/store/csk881ggvmifg4qf1cal0r1ffflbmlhp-source/nixos/modules/hardware/facter/networking':

       … while evaluating the option `nodes.controller1.hardware.facter.enable':

       … while evaluating the option `nodes.controller1.hardware.facter.report':

       … while evaluating the option `nodes.controller1.hardware.facter.reportPath':

       … while evaluating definitions from `/nix/store/j7g24pc3fm3h212288bvz19vq0jlja50-source/nixosModules/clanCore/nixos-facter.nix':

       (stack trace truncated; use '--show-trace' to show the full, detailed trace)

       error: build of '/nix/store/k99w3l2gf1wlzjh8lihbaw1rh078jaka-merged-test-dir-wireguard.drv^out' failed: error: gave up after 9 reschedules
failed eval checks.aarch64-linux.zerotier —
error: … while evaluating the attribute 'drvPath' at «https://releases.nixos.org/nixos/26.05/nixos-26.05.11045.774debe7a0d1/nixexprs.tar.xz?narH …
error:
       … while evaluating the attribute 'drvPath'
         at «https://releases.nixos.org/nixos/26.05/nixos-26.05.11045.774debe7a0d1/nixexprs.tar.xz?narHash=sha256-S5MjznoY0gbQbcANPLz5RYjg%2B5/WQmFRgNbHcP%2Bydcg%3D»/lib/customisation.nix:427:7:
          426|     // {
          427|       drvPath =
             |       ^
          428|         assert condition;

       … while calling the 'derivationStrict' builtin
         at «nix-internal»/derivation-internal.nix:37:12:
           36|
           37|   strict = derivationStrict drvAttrs;
             |            ^
           38|

       … while evaluating the option `driverConfiguration.vlans':

       … while evaluating definitions from `/nix/store/csk881ggvmifg4qf1cal0r1ffflbmlhp-source/nixos/lib/testing/driver-configuration.nix':

       … while evaluating the option `nodes.controller.networking.interfaces':

       … while evaluating definitions from `/nix/store/csk881ggvmifg4qf1cal0r1ffflbmlhp-source/nixos/modules/hardware/facter/networking':

       … while evaluating the option `nodes.controller.hardware.facter.enable':

       … while evaluating the option `nodes.controller.hardware.facter.report':

       … while evaluating the option `nodes.controller.hardware.facter.reportPath':

       … while evaluating definitions from `/nix/store/j7g24pc3fm3h212288bvz19vq0jlja50-source/nixosModules/clanCore/nixos-facter.nix':

       (stack trace truncated; use '--show-trace' to show the full, detailed trace)

       error: build of '/nix/store/plrafijfzclzss9dl00yfdm906l5p3xx-merged-test-dir-zerotier.drv^out' failed: error: gave up after 9 reschedules
failed eval checks.aarch64-linux.zerotier-multi-instance —
error: … while evaluating the attribute 'drvPath' at «https://releases.nixos.org/nixos/26.05/nixos-26.05.11045.774debe7a0d1/nixexprs.tar.xz?narH …
error:
       … while evaluating the attribute 'drvPath'
         at «https://releases.nixos.org/nixos/26.05/nixos-26.05.11045.774debe7a0d1/nixexprs.tar.xz?narHash=sha256-S5MjznoY0gbQbcANPLz5RYjg%2B5/WQmFRgNbHcP%2Bydcg%3D»/lib/customisation.nix:427:7:
          426|     // {
          427|       drvPath =
             |       ^
          428|         assert condition;

       … while calling the 'derivationStrict' builtin
         at «nix-internal»/derivation-internal.nix:37:12:
           36|
           37|   strict = derivationStrict drvAttrs;
             |            ^
           38|

       … while evaluating the option `driverConfiguration.vlans':

       … while evaluating definitions from `/nix/store/csk881ggvmifg4qf1cal0r1ffflbmlhp-source/nixos/lib/testing/driver-configuration.nix':

       … while evaluating the option `nodes.alpha.networking.interfaces':

       … while evaluating definitions from `/nix/store/csk881ggvmifg4qf1cal0r1ffflbmlhp-source/nixos/modules/hardware/facter/networking':

       … while evaluating the option `nodes.alpha.hardware.facter.enable':

       … while evaluating the option `nodes.alpha.hardware.facter.report':

       … while evaluating the option `nodes.alpha.hardware.facter.reportPath':

       … while evaluating definitions from `/nix/store/j7g24pc3fm3h212288bvz19vq0jlja50-source/nixosModules/clanCore/nixos-facter.nix':

       (stack trace truncated; use '--show-trace' to show the full, detailed trace)

       error: build of '/nix/store/gb0pvdh3p89c6fjyqzfav5y3w7dlns4m-merged-test-dir-zerotier-multi-instance.drv^out' failed: error: gave up after 9 reschedules
failed eval checks.x86_64-linux.borgbackup —
error: … while evaluating the attribute 'drvPath' at «https://releases.nixos.org/nixos/26.05/nixos-26.05.11045.774debe7a0d1/nixexprs.tar.xz?narH …
error:
       … while evaluating the attribute 'drvPath'
         at «https://releases.nixos.org/nixos/26.05/nixos-26.05.11045.774debe7a0d1/nixexprs.tar.xz?narHash=sha256-S5MjznoY0gbQbcANPLz5RYjg%2B5/WQmFRgNbHcP%2Bydcg%3D»/lib/customisation.nix:427:7:
          426|     // {
          427|       drvPath =
             |       ^
          428|         assert condition;

       … while calling the 'derivationStrict' builtin
         at «nix-internal»/derivation-internal.nix:37:12:
           36|
           37|   strict = derivationStrict drvAttrs;
             |            ^
           38|

       … while evaluating the option `nodes.clientone.networking.interfaces':

       … while evaluating definitions from `/nix/store/csk881ggvmifg4qf1cal0r1ffflbmlhp-source/nixos/modules/hardware/facter/networking':

       … while evaluating the option `nodes.clientone.hardware.facter.enable':

       … while evaluating the option `nodes.clientone.hardware.facter.report':

       … while evaluating the option `nodes.clientone.hardware.facter.reportPath':

       … while evaluating definitions from `/nix/store/j7g24pc3fm3h212288bvz19vq0jlja50-source/nixosModules/clanCore/nixos-facter.nix':

       (stack trace truncated; use '--show-trace' to show the full, detailed trace)

       error: build of '/nix/store/c20nf5ixxlkl98byh90mdyscphw2i96v-merged-test-dir-borgbackup.drv^out' failed: error: gave up after 9 reschedules
failed eval checks.x86_64-linux.certificates —
error: … while evaluating the attribute 'drvPath' at «https://releases.nixos.org/nixos/26.05/nixos-26.05.11045.774debe7a0d1/nixexprs.tar.xz?narH …
error:
       … while evaluating the attribute 'drvPath'
         at «https://releases.nixos.org/nixos/26.05/nixos-26.05.11045.774debe7a0d1/nixexprs.tar.xz?narHash=sha256-S5MjznoY0gbQbcANPLz5RYjg%2B5/WQmFRgNbHcP%2Bydcg%3D»/lib/customisation.nix:427:7:
          426|     // {
          427|       drvPath =
             |       ^
          428|         assert condition;

       … while calling the 'derivationStrict' builtin
         at «nix-internal»/derivation-internal.nix:37:12:
           36|
           37|   strict = derivationStrict drvAttrs;
             |            ^
           38|

       … while evaluating the option `nodes.ca.networking.interfaces':

       … while evaluating definitions from `/nix/store/csk881ggvmifg4qf1cal0r1ffflbmlhp-source/nixos/modules/hardware/facter/networking':

       … while evaluating the option `nodes.ca.hardware.facter.enable':

       … while evaluating the option `nodes.ca.hardware.facter.report':

       … while evaluating the option `nodes.ca.hardware.facter.reportPath':

       … while evaluating definitions from `/nix/store/j7g24pc3fm3h212288bvz19vq0jlja50-source/nixosModules/clanCore/nixos-facter.nix':

       (stack trace truncated; use '--show-trace' to show the full, detailed trace)

       error: build of '/nix/store/2sfs7lp26wpjls0kgvikwkqadn400rph-merged-test-dir-certificates.drv^out' failed: error: gave up after 9 reschedules
failed eval checks.x86_64-linux.clan-test-update —
error: … while evaluating the attribute 'drvPath' at «https://releases.nixos.org/nixos/26.05/nixos-26.05.11045.774debe7a0d1/nixexprs.tar.xz?narH …
error:
       … while evaluating the attribute 'drvPath'
         at «https://releases.nixos.org/nixos/26.05/nixos-26.05.11045.774debe7a0d1/nixexprs.tar.xz?narHash=sha256-S5MjznoY0gbQbcANPLz5RYjg%2B5/WQmFRgNbHcP%2Bydcg%3D»/lib/customisation.nix:427:7:
          426|     // {
          427|       drvPath =
             |       ^
          428|         assert condition;

       … while calling the 'derivationStrict' builtin
         at «nix-internal»/derivation-internal.nix:37:12:
           36|
           37|   strict = derivationStrict drvAttrs;
             |            ^
           38|

       … while evaluating the option `nodes.test-update-machine.networking.interfaces':

       … while evaluating definitions from `/nix/store/csk881ggvmifg4qf1cal0r1ffflbmlhp-source/nixos/modules/hardware/facter/networking':

       … while evaluating the option `nodes.test-update-machine.hardware.facter.enable':

       … while evaluating the option `nodes.test-update-machine.hardware.facter.report':

       … while evaluating the option `nodes.test-update-machine.hardware.facter.reportPath':

       … while evaluating definitions from `/nix/store/j7g24pc3fm3h212288bvz19vq0jlja50-source/nixosModules/clanCore/nixos-facter.nix':

       (stack trace truncated; use '--show-trace' to show the full, detailed trace)

       error: build of '/nix/store/3ny5bysiwfn40mfsp9682fq77wi4dvpl-merged-test-dir-clan-test-update.drv^out' failed: error: gave up after 9 reschedules
failed eval checks.x86_64-linux.data-mesher —
error: … while evaluating the attribute 'drvPath' at «https://releases.nixos.org/nixos/26.05/nixos-26.05.11045.774debe7a0d1/nixexprs.tar.xz?narH …
error:
       … while evaluating the attribute 'drvPath'
         at «https://releases.nixos.org/nixos/26.05/nixos-26.05.11045.774debe7a0d1/nixexprs.tar.xz?narHash=sha256-S5MjznoY0gbQbcANPLz5RYjg%2B5/WQmFRgNbHcP%2Bydcg%3D»/lib/customisation.nix:427:7:
          426|     // {
          427|       drvPath =
             |       ^
          428|         assert condition;

       … while calling the 'derivationStrict' builtin
         at «nix-internal»/derivation-internal.nix:37:12:
           36|
           37|   strict = derivationStrict drvAttrs;
             |            ^
           38|

       … while evaluating the option `nodes.alpha.networking.interfaces':

       … while evaluating definitions from `/nix/store/csk881ggvmifg4qf1cal0r1ffflbmlhp-source/nixos/modules/hardware/facter/networking':

       … while evaluating the option `nodes.alpha.hardware.facter.enable':

       … while evaluating the option `nodes.alpha.hardware.facter.report':

       … while evaluating the option `nodes.alpha.hardware.facter.reportPath':

       … while evaluating definitions from `/nix/store/j7g24pc3fm3h212288bvz19vq0jlja50-source/nixosModules/clanCore/nixos-facter.nix':

       (stack trace truncated; use '--show-trace' to show the full, detailed trace)

       error: build of '/nix/store/bisdrchsk95mhvw467p4wq5b2f79msnx-merged-test-dir-data-mesher.drv^out' failed: error: gave up after 9 reschedules
failed eval checks.x86_64-linux.dm-dns —
error: … while evaluating the attribute 'drvPath' at «https://releases.nixos.org/nixos/26.05/nixos-26.05.11045.774debe7a0d1/nixexprs.tar.xz?narH …
error:
       … while evaluating the attribute 'drvPath'
         at «https://releases.nixos.org/nixos/26.05/nixos-26.05.11045.774debe7a0d1/nixexprs.tar.xz?narHash=sha256-S5MjznoY0gbQbcANPLz5RYjg%2B5/WQmFRgNbHcP%2Bydcg%3D»/lib/customisation.nix:427:7:
          426|     // {
          427|       drvPath =
             |       ^
          428|         assert condition;

       … while calling the 'derivationStrict' builtin
         at «nix-internal»/derivation-internal.nix:37:12:
           36|
           37|   strict = derivationStrict drvAttrs;
             |            ^
           38|

       … while evaluating the option `nodes.client.networking.interfaces':

       … while evaluating definitions from `/nix/store/csk881ggvmifg4qf1cal0r1ffflbmlhp-source/nixos/modules/hardware/facter/networking':

       … while evaluating the option `nodes.client.hardware.facter.enable':

       … while evaluating the option `nodes.client.hardware.facter.report':

       … while evaluating the option `nodes.client.hardware.facter.reportPath':

       … while evaluating definitions from `/nix/store/j7g24pc3fm3h212288bvz19vq0jlja50-source/nixosModules/clanCore/nixos-facter.nix':

       (stack trace truncated; use '--show-trace' to show the full, detailed trace)

       error: build of '/nix/store/yln3f9jkdz1nwbsd4mb869zl8hfcnvyl-merged-test-dir-dm-dns.drv^out' failed: error: gave up after 9 reschedules
failed eval checks.x86_64-linux.garage —
error: … while evaluating the attribute 'drvPath' at «https://releases.nixos.org/nixos/26.05/nixos-26.05.11045.774debe7a0d1/nixexprs.tar.xz?narH …
error:
       … while evaluating the attribute 'drvPath'
         at «https://releases.nixos.org/nixos/26.05/nixos-26.05.11045.774debe7a0d1/nixexprs.tar.xz?narHash=sha256-S5MjznoY0gbQbcANPLz5RYjg%2B5/WQmFRgNbHcP%2Bydcg%3D»/lib/customisation.nix:427:7:
          426|     // {
          427|       drvPath =
             |       ^
          428|         assert condition;

       … while calling the 'derivationStrict' builtin
         at «nix-internal»/derivation-internal.nix:37:12:
           36|
           37|   strict = derivationStrict drvAttrs;
             |            ^
           38|

       … while evaluating the option `nodes.server.networking.interfaces':

       … while evaluating definitions from `/nix/store/csk881ggvmifg4qf1cal0r1ffflbmlhp-source/nixos/modules/hardware/facter/networking':

       … while evaluating the option `nodes.server.hardware.facter.enable':

       … while evaluating the option `nodes.server.hardware.facter.report':

       … while evaluating the option `nodes.server.hardware.facter.reportPath':

       … while evaluating definitions from `/nix/store/j7g24pc3fm3h212288bvz19vq0jlja50-source/nixosModules/clanCore/nixos-facter.nix':

       (stack trace truncated; use '--show-trace' to show the full, detailed trace)

       error: build of '/nix/store/m5bznfa9ljfbjad6mr813wqn4ncj0h1c-merged-test-dir-garage.drv^out' failed: error: gave up after 9 reschedules
failed eval checks.x86_64-linux.machine-id —
error: … while evaluating the attribute 'drvPath' at «https://releases.nixos.org/nixos/26.05/nixos-26.05.11045.774debe7a0d1/nixexprs.tar.xz?narH …
error:
       … while evaluating the attribute 'drvPath'
         at «https://releases.nixos.org/nixos/26.05/nixos-26.05.11045.774debe7a0d1/nixexprs.tar.xz?narHash=sha256-S5MjznoY0gbQbcANPLz5RYjg%2B5/WQmFRgNbHcP%2Bydcg%3D»/lib/customisation.nix:427:7:
          426|     // {
          427|       drvPath =
             |       ^
          428|         assert condition;

       … while calling the 'derivationStrict' builtin
         at «nix-internal»/derivation-internal.nix:37:12:
           36|
           37|   strict = derivationStrict drvAttrs;
             |            ^
           38|

       … while evaluating the option `nodes.server.networking.interfaces':

       … while evaluating definitions from `/nix/store/csk881ggvmifg4qf1cal0r1ffflbmlhp-source/nixos/modules/hardware/facter/networking':

       … while evaluating the option `nodes.server.hardware.facter.enable':

       … while evaluating the option `nodes.server.hardware.facter.report':

       … while evaluating the option `nodes.server.hardware.facter.reportPath':

       … while evaluating definitions from `/nix/store/j7g24pc3fm3h212288bvz19vq0jlja50-source/nixosModules/clanCore/nixos-facter.nix':

       (stack trace truncated; use '--show-trace' to show the full, detailed trace)

       error: build of '/nix/store/1aw9g733adh7hh3dcxcs1bmkzhb8izr1-merged-test-dir-service-machine-id.drv^out' failed: error: gave up after 9 reschedules
failed eval checks.x86_64-linux.matrix-synapse —
error: … while evaluating the attribute 'drvPath' at «https://releases.nixos.org/nixos/26.05/nixos-26.05.11045.774debe7a0d1/nixexprs.tar.xz?narH …
error:
       … while evaluating the attribute 'drvPath'
         at «https://releases.nixos.org/nixos/26.05/nixos-26.05.11045.774debe7a0d1/nixexprs.tar.xz?narHash=sha256-S5MjznoY0gbQbcANPLz5RYjg%2B5/WQmFRgNbHcP%2Bydcg%3D»/lib/customisation.nix:427:7:
          426|     // {
          427|       drvPath =
             |       ^
          428|         assert condition;

       … while calling the 'derivationStrict' builtin
         at «nix-internal»/derivation-internal.nix:37:12:
           36|
           37|   strict = derivationStrict drvAttrs;
             |            ^
           38|

       … while evaluating the option `nodes.machine.networking.interfaces':

       … while evaluating definitions from `/nix/store/csk881ggvmifg4qf1cal0r1ffflbmlhp-source/nixos/modules/hardware/facter/networking':

       … while evaluating the option `nodes.machine.hardware.facter.enable':

       … while evaluating the option `nodes.machine.hardware.facter.report':

       … while evaluating the option `nodes.machine.hardware.facter.reportPath':

       … while evaluating definitions from `/nix/store/j7g24pc3fm3h212288bvz19vq0jlja50-source/nixosModules/clanCore/nixos-facter.nix':

       (stack trace truncated; use '--show-trace' to show the full, detailed trace)

       error: build of '/nix/store/1k4q4h7b0264nnw73rgmiyag11gv3b9k-merged-test-dir-matrix-synapse.drv^out' failed: error: gave up after 9 reschedules
failed eval checks.x86_64-linux.monitoring —
error: … while evaluating the attribute 'drvPath' at «https://releases.nixos.org/nixos/26.05/nixos-26.05.11045.774debe7a0d1/nixexprs.tar.xz?narH …
error:
       … while evaluating the attribute 'drvPath'
         at «https://releases.nixos.org/nixos/26.05/nixos-26.05.11045.774debe7a0d1/nixexprs.tar.xz?narHash=sha256-S5MjznoY0gbQbcANPLz5RYjg%2B5/WQmFRgNbHcP%2Bydcg%3D»/lib/customisation.nix:427:7:
          426|     // {
          427|       drvPath =
             |       ^
          428|         assert condition;

       … while calling the 'derivationStrict' builtin
         at «nix-internal»/derivation-internal.nix:37:12:
           36|
           37|   strict = derivationStrict drvAttrs;
             |            ^
           38|

       … while evaluating the option `nodes.machine1.networking.interfaces':

       … while evaluating definitions from `/nix/store/csk881ggvmifg4qf1cal0r1ffflbmlhp-source/nixos/modules/hardware/facter/networking':

       … while evaluating the option `nodes.machine1.hardware.facter.enable':

       … while evaluating the option `nodes.machine1.hardware.facter.report':

       … while evaluating the option `nodes.machine1.hardware.facter.reportPath':

       … while evaluating definitions from `/nix/store/j7g24pc3fm3h212288bvz19vq0jlja50-source/nixosModules/clanCore/nixos-facter.nix':

       (stack trace truncated; use '--show-trace' to show the full, detailed trace)

       error: build of '/nix/store/w7lsmv9zb3ng21k9akkmgq342l47ylf2-merged-test-dir-monitoring.drv^out' failed: error: gave up after 9 reschedules
failed eval checks.x86_64-linux.mycelium —
error: … while evaluating the attribute 'drvPath' at «https://releases.nixos.org/nixos/26.05/nixos-26.05.11045.774debe7a0d1/nixexprs.tar.xz?narH …
error:
       … while evaluating the attribute 'drvPath'
         at «https://releases.nixos.org/nixos/26.05/nixos-26.05.11045.774debe7a0d1/nixexprs.tar.xz?narHash=sha256-S5MjznoY0gbQbcANPLz5RYjg%2B5/WQmFRgNbHcP%2Bydcg%3D»/lib/customisation.nix:427:7:
          426|     // {
          427|       drvPath =
             |       ^
          428|         assert condition;

       … while calling the 'derivationStrict' builtin
         at «nix-internal»/derivation-internal.nix:37:12:
           36|
           37|   strict = derivationStrict drvAttrs;
             |            ^
           38|

       … while evaluating the option `driverConfiguration.vlans':

       … while evaluating definitions from `/nix/store/csk881ggvmifg4qf1cal0r1ffflbmlhp-source/nixos/lib/testing/driver-configuration.nix':

       … while evaluating the option `nodes.server.networking.interfaces':

       … while evaluating definitions from `/nix/store/csk881ggvmifg4qf1cal0r1ffflbmlhp-source/nixos/modules/hardware/facter/networking':

       … while evaluating the option `nodes.server.hardware.facter.enable':

       … while evaluating the option `nodes.server.hardware.facter.report':

       … while evaluating the option `nodes.server.hardware.facter.reportPath':

       … while evaluating definitions from `/nix/store/j7g24pc3fm3h212288bvz19vq0jlja50-source/nixosModules/clanCore/nixos-facter.nix':

       (stack trace truncated; use '--show-trace' to show the full, detailed trace)

       error: build of '/nix/store/wrfb0i91rk06qpfq4p27lyskcqjlvfl6-merged-test-dir-mycelium.drv^out' failed: error: gave up after 9 reschedules
failed eval checks.x86_64-linux.ncps —
error: … while evaluating the attribute 'drvPath' at «https://releases.nixos.org/nixos/26.05/nixos-26.05.11045.774debe7a0d1/nixexprs.tar.xz?narH …
error:
       … while evaluating the attribute 'drvPath'
         at «https://releases.nixos.org/nixos/26.05/nixos-26.05.11045.774debe7a0d1/nixexprs.tar.xz?narHash=sha256-S5MjznoY0gbQbcANPLz5RYjg%2B5/WQmFRgNbHcP%2Bydcg%3D»/lib/customisation.nix:427:7:
          426|     // {
          427|       drvPath =
             |       ^
          428|         assert condition;

       … while calling the 'derivationStrict' builtin
         at «nix-internal»/derivation-internal.nix:37:12:
           36|
           37|   strict = derivationStrict drvAttrs;
             |            ^
           38|

       … while evaluating the option `nodes.alice.networking.interfaces':

       … while evaluating definitions from `/nix/store/csk881ggvmifg4qf1cal0r1ffflbmlhp-source/nixos/modules/hardware/facter/networking':

       … while evaluating the option `nodes.alice.hardware.facter.enable':

       … while evaluating the option `nodes.alice.hardware.facter.report':

       … while evaluating the option `nodes.alice.hardware.facter.reportPath':

       … while evaluating definitions from `/nix/store/j7g24pc3fm3h212288bvz19vq0jlja50-source/nixosModules/clanCore/nixos-facter.nix':

       (stack trace truncated; use '--show-trace' to show the full, detailed trace)

       error: build of '/nix/store/0b9va4azqjj9ka1fylgah8qwbq7xx0l5-merged-test-dir-ncps.drv^out' failed: error: gave up after 9 reschedules
failed eval checks.x86_64-linux.nixos-test-password-store-mounts —
error: … while evaluating the attribute 'drvPath' at «https://releases.nixos.org/nixos/26.05/nixos-26.05.11045.774debe7a0d1/nixexprs.tar.xz?narH …
error:
       … while evaluating the attribute 'drvPath'
         at «https://releases.nixos.org/nixos/26.05/nixos-26.05.11045.774debe7a0d1/nixexprs.tar.xz?narHash=sha256-S5MjznoY0gbQbcANPLz5RYjg%2B5/WQmFRgNbHcP%2Bydcg%3D»/lib/customisation.nix:427:7:
          426|     // {
          427|       drvPath =
             |       ^
          428|         assert condition;

       … while calling the 'derivationStrict' builtin
         at «nix-internal»/derivation-internal.nix:37:12:
           36|
           37|   strict = derivationStrict drvAttrs;
             |            ^
           38|

       … while evaluating the option `driverConfiguration.vlans':

       … while evaluating definitions from `/nix/store/csk881ggvmifg4qf1cal0r1ffflbmlhp-source/nixos/lib/testing/driver-configuration.nix':

       … while evaluating the option `nodes.machine.networking.interfaces':

       … while evaluating definitions from `/nix/store/csk881ggvmifg4qf1cal0r1ffflbmlhp-source/nixos/modules/hardware/facter/networking':

       … while evaluating the option `nodes.machine.hardware.facter.enable':

       … while evaluating the option `nodes.machine.hardware.facter.report':

       … while evaluating the option `nodes.machine.hardware.facter.reportPath':

       … while evaluating definitions from `/nix/store/j7g24pc3fm3h212288bvz19vq0jlja50-source/nixosModules/clanCore/nixos-facter.nix':

       (stack trace truncated; use '--show-trace' to show the full, detailed trace)

       error: build of '/nix/store/f3zzvddf2jfahb56201p48pfrxvn9qkr-merged-test-dir-nixos-test-password-store-mounts.drv^out' failed: error: gave up after 9 reschedules
failed eval checks.x86_64-linux.p2p-ssh-iroh —
error: … while evaluating the attribute 'drvPath' at «https://releases.nixos.org/nixos/26.05/nixos-26.05.11045.774debe7a0d1/nixexprs.tar.xz?narH …
error:
       … while evaluating the attribute 'drvPath'
         at «https://releases.nixos.org/nixos/26.05/nixos-26.05.11045.774debe7a0d1/nixexprs.tar.xz?narHash=sha256-S5MjznoY0gbQbcANPLz5RYjg%2B5/WQmFRgNbHcP%2Bydcg%3D»/lib/customisation.nix:427:7:
          426|     // {
          427|       drvPath =
             |       ^
          428|         assert condition;

       … while calling the 'derivationStrict' builtin
         at «nix-internal»/derivation-internal.nix:37:12:
           36|
           37|   strict = derivationStrict drvAttrs;
             |            ^
           38|

       … while evaluating the option `nodes.client.networking.interfaces':

       … while evaluating definitions from `/nix/store/csk881ggvmifg4qf1cal0r1ffflbmlhp-source/nixos/modules/hardware/facter/networking':

       … while evaluating the option `nodes.client.hardware.facter.enable':

       … while evaluating the option `nodes.client.hardware.facter.report':

       … while evaluating the option `nodes.client.hardware.facter.reportPath':

       … while evaluating definitions from `/nix/store/j7g24pc3fm3h212288bvz19vq0jlja50-source/nixosModules/clanCore/nixos-facter.nix':

       (stack trace truncated; use '--show-trace' to show the full, detailed trace)

       error: build of '/nix/store/66ndbbglvmibsd07r7ajj48sdckr2kcz-merged-test-dir-clan-test-p2p-ssh-iroh.drv^out' failed: error: gave up after 9 reschedules
failed eval checks.x86_64-linux.pki —
error: … while evaluating the attribute 'drvPath' at «https://releases.nixos.org/nixos/26.05/nixos-26.05.11045.774debe7a0d1/nixexprs.tar.xz?narH …
error:
       … while evaluating the attribute 'drvPath'
         at «https://releases.nixos.org/nixos/26.05/nixos-26.05.11045.774debe7a0d1/nixexprs.tar.xz?narHash=sha256-S5MjznoY0gbQbcANPLz5RYjg%2B5/WQmFRgNbHcP%2Bydcg%3D»/lib/customisation.nix:427:7:
          426|     // {
          427|       drvPath =
             |       ^
          428|         assert condition;

       … while calling the 'derivationStrict' builtin
         at «nix-internal»/derivation-internal.nix:37:12:
           36|
           37|   strict = derivationStrict drvAttrs;
             |            ^
           38|

       … while evaluating the option `driverConfiguration.vlans':

       … while evaluating definitions from `/nix/store/csk881ggvmifg4qf1cal0r1ffflbmlhp-source/nixos/lib/testing/driver-configuration.nix':

       … while evaluating the option `nodes.caddy.networking.interfaces':

       … while evaluating definitions from `/nix/store/csk881ggvmifg4qf1cal0r1ffflbmlhp-source/nixos/modules/hardware/facter/networking':

       … while evaluating the option `nodes.caddy.hardware.facter.enable':

       … while evaluating the option `nodes.caddy.hardware.facter.report':

       … while evaluating the option `nodes.caddy.hardware.facter.reportPath':

       … while evaluating definitions from `/nix/store/j7g24pc3fm3h212288bvz19vq0jlja50-source/nixosModules/clanCore/nixos-facter.nix':

       (stack trace truncated; use '--show-trace' to show the full, detailed trace)

       error: build of '/nix/store/jifhxdzffi03r9ax3ri3nqdg8rcg62ax-merged-test-dir-pki.drv^out' failed: error: gave up after 9 reschedules
failed eval checks.x86_64-linux.service-dummy-test —
error: … while evaluating the attribute 'drvPath' at «https://releases.nixos.org/nixos/26.05/nixos-26.05.11045.774debe7a0d1/nixexprs.tar.xz?narH …
error:
       … while evaluating the attribute 'drvPath'
         at «https://releases.nixos.org/nixos/26.05/nixos-26.05.11045.774debe7a0d1/nixexprs.tar.xz?narHash=sha256-S5MjznoY0gbQbcANPLz5RYjg%2B5/WQmFRgNbHcP%2Bydcg%3D»/lib/customisation.nix:427:7:
          426|     // {
          427|       drvPath =
             |       ^
          428|         assert condition;

       … while calling the 'derivationStrict' builtin
         at «nix-internal»/derivation-internal.nix:37:12:
           36|
           37|   strict = derivationStrict drvAttrs;
             |            ^
           38|

       … while evaluating the option `nodes.admin1.networking.interfaces':

       … while evaluating definitions from `/nix/store/csk881ggvmifg4qf1cal0r1ffflbmlhp-source/nixos/modules/hardware/facter/networking':

       … while evaluating the option `nodes.admin1.hardware.facter.enable':

       … while evaluating the option `nodes.admin1.hardware.facter.report':

       … while evaluating the option `nodes.admin1.hardware.facter.reportPath':

       … while evaluating definitions from `/nix/store/j7g24pc3fm3h212288bvz19vq0jlja50-source/nixosModules/clanCore/nixos-facter.nix':

       (stack trace truncated; use '--show-trace' to show the full, detailed trace)

       error: build of '/nix/store/93r99wqlyhxzhj15ga3hbs1inkv5rq1w-merged-test-dir-service-dummy-test.drv^out' failed: error: gave up after 9 reschedules
failed eval checks.x86_64-linux.service-dummy-test-from-flake —
error: … while evaluating the attribute 'drvPath' at «https://releases.nixos.org/nixos/26.05/nixos-26.05.11045.774debe7a0d1/nixexprs.tar.xz?narH …
error:
       … while evaluating the attribute 'drvPath'
         at «https://releases.nixos.org/nixos/26.05/nixos-26.05.11045.774debe7a0d1/nixexprs.tar.xz?narHash=sha256-S5MjznoY0gbQbcANPLz5RYjg%2B5/WQmFRgNbHcP%2Bydcg%3D»/lib/customisation.nix:427:7:
          426|     // {
          427|       drvPath =
             |       ^
          428|         assert condition;

       … while calling the 'derivationStrict' builtin
         at «nix-internal»/derivation-internal.nix:37:12:
           36|
           37|   strict = derivationStrict drvAttrs;
             |            ^
           38|

       … while evaluating the option `nodes.admin1.networking.interfaces':

       … while evaluating definitions from `/nix/store/csk881ggvmifg4qf1cal0r1ffflbmlhp-source/nixos/modules/hardware/facter/networking':

       … while evaluating the option `nodes.admin1.hardware.facter.enable':

       … while evaluating the option `nodes.admin1.hardware.facter.report':

       … while evaluating the option `nodes.admin1.hardware.facter.reportPath':

       … while evaluating definitions from `/nix/store/j7g24pc3fm3h212288bvz19vq0jlja50-source/nixosModules/clanCore/nixos-facter.nix':

       (stack trace truncated; use '--show-trace' to show the full, detailed trace)

       error: build of '/nix/store/qsfzrf8p2qb5lhr0nf2j11s5gyi38qbl-merged-test-dir-service-dummy-test-from-flake.drv^out' failed: error: gave up after 9 reschedules
failed eval checks.x86_64-linux.syncthing-service —
error: … while evaluating the attribute 'drvPath' at «https://releases.nixos.org/nixos/26.05/nixos-26.05.11045.774debe7a0d1/nixexprs.tar.xz?narH …
error:
       … while evaluating the attribute 'drvPath'
         at «https://releases.nixos.org/nixos/26.05/nixos-26.05.11045.774debe7a0d1/nixexprs.tar.xz?narHash=sha256-S5MjznoY0gbQbcANPLz5RYjg%2B5/WQmFRgNbHcP%2Bydcg%3D»/lib/customisation.nix:427:7:
          426|     // {
          427|       drvPath =
             |       ^
          428|         assert condition;

       … while calling the 'derivationStrict' builtin
         at «nix-internal»/derivation-internal.nix:37:12:
           36|
           37|   strict = derivationStrict drvAttrs;
             |            ^
           38|

       … while evaluating the option `nodes.machine1.networking.interfaces':

       … while evaluating definitions from `/nix/store/csk881ggvmifg4qf1cal0r1ffflbmlhp-source/nixos/modules/hardware/facter/networking':

       … while evaluating the option `nodes.machine1.hardware.facter.enable':

       … while evaluating the option `nodes.machine1.hardware.facter.report':

       … while evaluating the option `nodes.machine1.hardware.facter.reportPath':

       … while evaluating definitions from `/nix/store/j7g24pc3fm3h212288bvz19vq0jlja50-source/nixosModules/clanCore/nixos-facter.nix':

       (stack trace truncated; use '--show-trace' to show the full, detailed trace)

       error: build of '/nix/store/8ixbnwzwsadhimss7kqf9qm86dgjzchh-merged-test-dir-syncthing-service.drv^out' failed: error: gave up after 9 reschedules
failed eval checks.x86_64-linux.users —
error: … while evaluating the attribute 'drvPath' at «https://releases.nixos.org/nixos/26.05/nixos-26.05.11045.774debe7a0d1/nixexprs.tar.xz?narH …
error:
       … while evaluating the attribute 'drvPath'
         at «https://releases.nixos.org/nixos/26.05/nixos-26.05.11045.774debe7a0d1/nixexprs.tar.xz?narHash=sha256-S5MjznoY0gbQbcANPLz5RYjg%2B5/WQmFRgNbHcP%2Bydcg%3D»/lib/customisation.nix:427:7:
          426|     // {
          427|       drvPath =
             |       ^
          428|         assert condition;

       … while calling the 'derivationStrict' builtin
         at «nix-internal»/derivation-internal.nix:37:12:
           36|
           37|   strict = derivationStrict drvAttrs;
             |            ^
           38|

       … while evaluating the option `nodes.server.networking.interfaces':

       … while evaluating definitions from `/nix/store/csk881ggvmifg4qf1cal0r1ffflbmlhp-source/nixos/modules/hardware/facter/networking':

       … while evaluating the option `nodes.server.hardware.facter.enable':

       … while evaluating the option `nodes.server.hardware.facter.report':

       … while evaluating the option `nodes.server.hardware.facter.reportPath':

       … while evaluating definitions from `/nix/store/j7g24pc3fm3h212288bvz19vq0jlja50-source/nixosModules/clanCore/nixos-facter.nix':

       (stack trace truncated; use '--show-trace' to show the full, detailed trace)

       error: build of '/nix/store/rx39mmxfmdxw2hp0hy63igdj7q0j0mqw-merged-test-dir-users.drv^out' failed: error: gave up after 9 reschedules
failed eval checks.x86_64-linux.wireguard —
error: … while evaluating the attribute 'drvPath' at «https://releases.nixos.org/nixos/26.05/nixos-26.05.11045.774debe7a0d1/nixexprs.tar.xz?narH …
error:
       … while evaluating the attribute 'drvPath'
         at «https://releases.nixos.org/nixos/26.05/nixos-26.05.11045.774debe7a0d1/nixexprs.tar.xz?narHash=sha256-S5MjznoY0gbQbcANPLz5RYjg%2B5/WQmFRgNbHcP%2Bydcg%3D»/lib/customisation.nix:427:7:
          426|     // {
          427|       drvPath =
             |       ^
          428|         assert condition;

       … while calling the 'derivationStrict' builtin
         at «nix-internal»/derivation-internal.nix:37:12:
           36|
           37|   strict = derivationStrict drvAttrs;
             |            ^
           38|

       … while evaluating the option `nodes.controller1.networking.interfaces':

       … while evaluating definitions from `/nix/store/csk881ggvmifg4qf1cal0r1ffflbmlhp-source/nixos/modules/hardware/facter/networking':

       … while evaluating the option `nodes.controller1.hardware.facter.enable':

       … while evaluating the option `nodes.controller1.hardware.facter.report':

       … while evaluating the option `nodes.controller1.hardware.facter.reportPath':

       … while evaluating definitions from `/nix/store/j7g24pc3fm3h212288bvz19vq0jlja50-source/nixosModules/clanCore/nixos-facter.nix':

       (stack trace truncated; use '--show-trace' to show the full, detailed trace)

       error: build of '/nix/store/k99w3l2gf1wlzjh8lihbaw1rh078jaka-merged-test-dir-wireguard.drv^out' failed: error: gave up after 9 reschedules
failed eval checks.x86_64-linux.zerotier —
error: … while evaluating the attribute 'drvPath' at «https://releases.nixos.org/nixos/26.05/nixos-26.05.11045.774debe7a0d1/nixexprs.tar.xz?narH …
error:
       … while evaluating the attribute 'drvPath'
         at «https://releases.nixos.org/nixos/26.05/nixos-26.05.11045.774debe7a0d1/nixexprs.tar.xz?narHash=sha256-S5MjznoY0gbQbcANPLz5RYjg%2B5/WQmFRgNbHcP%2Bydcg%3D»/lib/customisation.nix:427:7:
          426|     // {
          427|       drvPath =
             |       ^
          428|         assert condition;

       … while calling the 'derivationStrict' builtin
         at «nix-internal»/derivation-internal.nix:37:12:
           36|
           37|   strict = derivationStrict drvAttrs;
             |            ^
           38|

       … while evaluating the option `driverConfiguration.vlans':

       … while evaluating definitions from `/nix/store/csk881ggvmifg4qf1cal0r1ffflbmlhp-source/nixos/lib/testing/driver-configuration.nix':

       … while evaluating the option `nodes.controller.networking.interfaces':

       … while evaluating definitions from `/nix/store/csk881ggvmifg4qf1cal0r1ffflbmlhp-source/nixos/modules/hardware/facter/networking':

       … while evaluating the option `nodes.controller.hardware.facter.enable':

       … while evaluating the option `nodes.controller.hardware.facter.report':

       … while evaluating the option `nodes.controller.hardware.facter.reportPath':

       … while evaluating definitions from `/nix/store/j7g24pc3fm3h212288bvz19vq0jlja50-source/nixosModules/clanCore/nixos-facter.nix':

       (stack trace truncated; use '--show-trace' to show the full, detailed trace)

       error: build of '/nix/store/plrafijfzclzss9dl00yfdm906l5p3xx-merged-test-dir-zerotier.drv^out' failed: error: gave up after 9 reschedules
failed eval checks.x86_64-linux.zerotier-multi-instance —
error: … while evaluating the attribute 'drvPath' at «https://releases.nixos.org/nixos/26.05/nixos-26.05.11045.774debe7a0d1/nixexprs.tar.xz?narH …
error:
       … while evaluating the attribute 'drvPath'
         at «https://releases.nixos.org/nixos/26.05/nixos-26.05.11045.774debe7a0d1/nixexprs.tar.xz?narHash=sha256-S5MjznoY0gbQbcANPLz5RYjg%2B5/WQmFRgNbHcP%2Bydcg%3D»/lib/customisation.nix:427:7:
          426|     // {
          427|       drvPath =
             |       ^
          428|         assert condition;

       … while calling the 'derivationStrict' builtin
         at «nix-internal»/derivation-internal.nix:37:12:
           36|
           37|   strict = derivationStrict drvAttrs;
             |            ^
           38|

       … while evaluating the option `driverConfiguration.vlans':

       … while evaluating definitions from `/nix/store/csk881ggvmifg4qf1cal0r1ffflbmlhp-source/nixos/lib/testing/driver-configuration.nix':

       … while evaluating the option `nodes.alpha.networking.interfaces':

       … while evaluating definitions from `/nix/store/csk881ggvmifg4qf1cal0r1ffflbmlhp-source/nixos/modules/hardware/facter/networking':

       … while evaluating the option `nodes.alpha.hardware.facter.enable':

       … while evaluating the option `nodes.alpha.hardware.facter.report':

       … while evaluating the option `nodes.alpha.hardware.facter.reportPath':

       … while evaluating definitions from `/nix/store/j7g24pc3fm3h212288bvz19vq0jlja50-source/nixosModules/clanCore/nixos-facter.nix':

       (stack trace truncated; use '--show-trace' to show the full, detailed trace)

       error: build of '/nix/store/gb0pvdh3p89c6fjyqzfav5y3w7dlns4m-merged-test-dir-zerotier-multi-instance.drv^out' failed: error: gave up after 9 reschedules
8 succeeded
succeeded attributes
status attribute duration
loading…
105 already built
skipped attributes
status attribute duration
loading…