nixbot

builds

clan/clan-core build #933 failed

branch 26.05 · PR #8207 · commit a6430deba2 · · took 9m 40s · eval 3m 2s

eval warnings 50 kinds · 260 occurrences
  • error …-merged-test-dir-borgbackup.drv: gi-build-x86-02: gi-build-x86-02: input not substitutable: error: path '/nix/store/…-test-vars-generated' is required, but there is no substituter that can build it, asking the scheduler again ×10
  • error …-merged-test-dir-certificates.drv: gi-build-x86-02: gi-build-x86-02: input not substitutable: error: path '/nix/store/…-test-vars-generated' is required, but there is no substituter that can build it, asking the scheduler again ×9
  • error ×41
  • error build of '/nix/store/…-merged-test-dir-certificates.drv^out' failed: error: gave up after 9 reschedules ×1
  • error …-merged-test-dir-borgbackup.drv: error: gRPC BuildDerivation on 'nix-store.geninf.io:50051' failed: build-x86-01: missing: /nix/store/…-merged-test-dir-borgbackup.drv ×1
  • error build of '/nix/store/…-merged-test-dir-borgbackup.drv^out' failed: error: error: gRPC BuildDerivation on 'nix-store.geninf.io:50051' failed: build-x86-01: missing: /nix/store/…-merged-test-dir-borgbackup.drv ×1
  • error …-merged-test-dir-data-mesher.drv: gi-build-x86-02: gi-build-x86-02: input not substitutable: error: path '/nix/store/…-test-vars-generated' is required, but there is no substituter that can build it, asking the scheduler again ×9
  • error …-merged-test-dir-data-mesher.drv: error: gRPC BuildDerivation on 'nix-store.geninf.io:50051' failed: build-x86-01: missing: /nix/store/…-merged-test-dir-data-mesher.drv ×2
  • error build of '/nix/store/…-merged-test-dir-data-mesher.drv^out' failed: error: error: gRPC BuildDerivation on 'nix-store.geninf.io:50051' failed: build-x86-01: missing: /nix/store/…-merged-test-dir-data-mesher.drv ×2
  • error …-merged-test-dir-dm-dns.drv: gi-build-x86-02: gi-build-x86-02: input not substitutable: error: path '/nix/store/…-test-vars-generated' is required, but there is no substituter that can build it, asking the scheduler again ×1
  • error …-merged-test-dir-dm-dns.drv: error: gRPC BuildDerivation on 'nix-store.geninf.io:50051' failed: build-x86-01: missing: /nix/store/…-merged-test-dir-dm-dns.drv ×2
  • error build of '/nix/store/…-merged-test-dir-dm-dns.drv^out' failed: error: error: gRPC BuildDerivation on 'nix-store.geninf.io:50051' failed: build-x86-01: missing: /nix/store/…-merged-test-dir-dm-dns.drv ×2
  • error …-merged-test-dir-matrix-synapse.drv: gi-build-x86-02: gi-build-x86-02: input not substitutable: error: path '/nix/store/…-test-vars-generated' is required, but there is no substituter that can build it, asking the scheduler again ×1
  • error nix-store.geninf.io:50051: local nix-daemon connection lost: error: Nix daemon disconnected unexpectedly (maybe it crashed?), retrying ×43
  • error …-merged-test-dir-mycelium.drv: gi-build-x86-02: gi-build-x86-02: input not substitutable: error: path '/nix/store/…-test-vars-generated' is required, but there is no substituter that can build it, asking the scheduler again ×8
  • error …-merged-test-dir-matrix-synapse.drv: error: gRPC BuildDerivation on 'nix-store.geninf.io:50051' failed: build-x86-01: missing: /nix/store/…-merged-test-dir-matrix-synapse.drv ×2
  • error build of '/nix/store/…-merged-test-dir-matrix-synapse.drv^out' failed: error: error: gRPC BuildDerivation on 'nix-store.geninf.io:50051' failed: build-x86-01: missing: /nix/store/…-merged-test-dir-matrix-synapse.drv ×2
  • error …-merged-test-dir-ncps.drv: error: gRPC BuildDerivation on 'nix-store.geninf.io:50051' failed: build-x86-01: missing: /nix/store/…-merged-test-dir-ncps.drv ×2
  • error build of '/nix/store/…-merged-test-dir-ncps.drv^out' failed: error: error: gRPC BuildDerivation on 'nix-store.geninf.io:50051' failed: build-x86-01: missing: /nix/store/…-merged-test-dir-ncps.drv ×2
  • error …-merged-test-dir-mycelium.drv: error: gRPC BuildDerivation on 'nix-store.geninf.io:50051' failed: build-x86-01: missing: /nix/store/…-merged-test-dir-mycelium.drv ×2
  • error build of '/nix/store/…-merged-test-dir-mycelium.drv^out' failed: error: error: gRPC BuildDerivation on 'nix-store.geninf.io:50051' failed: build-x86-01: missing: /nix/store/…-merged-test-dir-mycelium.drv ×2
  • error …-merged-test-dir-nixos-test-password-store-mounts.drv: gi-build-x86-02: gi-build-x86-02: input not substitutable: error: path '/nix/store/…-test-vars-generated' is required, but there is no substituter that can build it, asking the scheduler again ×6
  • error …-merged-test-dir-nixos-test-password-store-mounts.drv: build-x86-01: build-x86-01: input not substitutable: error: path '/nix/store/…-test-vars-generated' is required, but there is no substituter that can build it, asking the scheduler again ×12
  • error …-merged-test-dir-service-machine-id.drv: build-x86-01: build-x86-01: input not substitutable: error: path '/nix/store/…-test-vars-generated' is required, but there is no substituter that can build it, asking the scheduler again ×12
  • error build of '/nix/store/…-merged-test-dir-nixos-test-password-store-mounts.drv^out' failed: error: gave up after 9 reschedules ×2
  • error …-merged-test-dir-service-machine-id.drv: gi-build-x86-02: gi-build-x86-02: input not substitutable: error: path '/nix/store/…-test-vars-generated' is required, but there is no substituter that can build it, asking the scheduler again ×6
  • error build of '/nix/store/…-merged-test-dir-service-machine-id.drv^out' failed: error: gave up after 9 reschedules ×2
  • error …-merged-test-dir-garage.drv: error: gRPC BuildDerivation on 'nix-store.geninf.io:50051' failed: build-x86-01: missing: /nix/store/…-merged-test-dir-garage.drv ×2
  • error build of '/nix/store/…-merged-test-dir-garage.drv^out' failed: error: error: gRPC BuildDerivation on 'nix-store.geninf.io:50051' failed: build-x86-01: missing: /nix/store/…-merged-test-dir-garage.drv ×2
  • error …-merged-test-dir-clan-test-p2p-ssh-iroh.drv: gi-build-x86-02: gi-build-x86-02: input not substitutable: error: path '/nix/store/…-test-vars-generated' is required, but there is no substituter that can build it, asking the scheduler again ×1
  • error …-merged-test-dir-clan-test-p2p-ssh-iroh.drv: error: gRPC BuildDerivation on 'nix-store.geninf.io:50051' failed: build-x86-01: missing: /nix/store/…-merged-test-dir-clan-test-p2p-ssh-iroh.drv ×2
  • error build of '/nix/store/…-merged-test-dir-clan-test-p2p-ssh-iroh.drv^out' failed: error: error: gRPC BuildDerivation on 'nix-store.geninf.io:50051' failed: build-x86-01: missing: /nix/store/…-merged-test-dir-clan-test-p2p-ssh-iroh.drv ×2
  • error …-merged-test-dir-service-dummy-test-from-flake.drv: gi-build-x86-02: gi-build-x86-02: input not substitutable: error: path '/nix/store/…-test-vars-generated' is required, but there is no substituter that can build it, asking the scheduler again ×1
  • error …-merged-test-dir-pki.drv: gi-build-x86-02: gi-build-x86-02: input not substitutable: error: path '/nix/store/…-test-vars-generated' is required, but there is no substituter that can build it, asking the scheduler again ×4
  • error …-merged-test-dir-service-dummy-test-from-flake.drv: error: gRPC BuildDerivation on 'nix-store.geninf.io:50051' failed: build-x86-01: missing: /nix/store/…-merged-test-dir-service-dummy-test-from-flake.drv ×2
  • error build of '/nix/store/…-merged-test-dir-service-dummy-test-from-flake.drv^out' failed: error: error: gRPC BuildDerivation on 'nix-store.geninf.io:50051' failed: build-x86-01: missing: /nix/store/…-merged-test-dir-service-dummy-test-from-flake.drv ×2
  • error …-merged-test-dir-service-dummy-test.drv: gi-build-x86-02: gi-build-x86-02: input not substitutable: error: path '/nix/store/…-test-vars-generated' is required, but there is no substituter that can build it, asking the scheduler again ×9
  • error build of '/nix/store/…-merged-test-dir-service-dummy-test.drv^out' failed: error: gave up after 9 reschedules ×1
  • error …-merged-test-dir-wireguard.drv: gi-build-x86-02: gi-build-x86-02: input not substitutable: error: path '/nix/store/…-test-vars-generated' is required, but there is no substituter that can build it, asking the scheduler again ×9
  • error build of '/nix/store/…-merged-test-dir-wireguard.drv^out' failed: error: gave up after 9 reschedules ×1
  • error …-merged-test-dir-zerotier.drv: gi-build-x86-02: gi-build-x86-02: input not substitutable: error: path '/nix/store/…-test-vars-generated' is required, but there is no substituter that can build it, asking the scheduler again ×9
  • error …-merged-test-dir-pki.drv: error: gRPC BuildDerivation on 'nix-store.geninf.io:50051' failed: build-x86-01: missing: /nix/store/…-merged-test-dir-pki.drv ×2
  • error build of '/nix/store/…-merged-test-dir-pki.drv^out' failed: error: error: gRPC BuildDerivation on 'nix-store.geninf.io:50051' failed: build-x86-01: missing: /nix/store/…-merged-test-dir-pki.drv ×2
  • error …-merged-test-dir-users.drv: gi-build-x86-02: gi-build-x86-02: input not substitutable: error: path '/nix/store/…-test-vars-generated' is required, but there is no substituter that can build it, asking the scheduler again ×9
  • error build of '/nix/store/…-merged-test-dir-zerotier.drv^out' failed: error: gave up after 9 reschedules ×1
  • error …-merged-test-dir-zerotier-multi-instance.drv: error: gRPC BuildDerivation on 'nix-store.geninf.io:50051' failed: build-x86-01: missing: /nix/store/…-merged-test-dir-zerotier-multi-instance.drv ×1
  • error build of '/nix/store/…-merged-test-dir-zerotier-multi-instance.drv^out' failed: error: error: gRPC BuildDerivation on 'nix-store.geninf.io:50051' failed: build-x86-01: missing: /nix/store/…-merged-test-dir-zerotier-multi-instance.drv ×1
  • error build of '/nix/store/…-merged-test-dir-users.drv^out' failed: error: gave up after 9 reschedules ×1
  • error …-merged-test-dir-monitoring.drv: gi-build-x86-02: gi-build-x86-02: input not substitutable: error: path '/nix/store/…-test-vars-generated' is required, but there is no substituter that can build it, asking the scheduler again ×10
  • error build of '/nix/store/…-merged-test-dir-borgbackup.drv^out' failed: error: gave up after 9 reschedules ×1

63 failed
failed attributes
status attribute duration
failed checks.aarch64-darwin.all-packages 2m 5s
setup: warning: ignoring the client-specified setting 'store', because it is a restricted setting and you are not a trusted user warning: 3iykfm8wnfjygsinvgv7p9 …
setup:
warning: ignoring the client-specified setting 'store', because it is a restricted setting and you are not a trusted user
warning: 3iykfm8wnfjygsinvgv7p9j1708q5w4d-clan-cli-source.drv: no connected, non-draining worker for system 'aarch64-darwin' offers features {}, the workers offer {}, waiting up to 120s for a worker
warning: n6jjpdkmhlf7jbyvalrmxhzyyny4c1gi-clan-core-flake.drv: no connected, non-draining worker for system 'aarch64-darwin' offers features {}, the workers offer {}, waiting up to 120s for a worker
warning: vylwk8pnffbpmyfv2z3fg89qyhajk7as-clan-cli-source.drv: no connected, non-draining worker for system 'aarch64-darwin' offers features {}, the workers offer {}, waiting up to 120s for a worker
3iykfm8wnfjygsinvgv7p9j1708q5w4d-clan-cli-source.drv: no connected, non-draining worker for system 'aarch64-darwin' offers features {}, the workers offer {}
n6jjpdkmhlf7jbyvalrmxhzyyny4c1gi-clan-core-flake.drv: no connected, non-draining worker for system 'aarch64-darwin' offers features {}, the workers offer {}
vylwk8pnffbpmyfv2z3fg89qyhajk7as-clan-cli-source.drv: no connected, non-draining worker for system 'aarch64-darwin' offers features {}, the workers offer {}
error: dependency 'n6jjpdkmhlf7jbyvalrmxhzyyny4c1gi-clan-core-flake.drv' failed
failed checks.aarch64-darwin.clan-app-pytest 2m 1s
setup: don't know how to build these paths: /nix/store/9238sbw1x2j9im6s7cac5k4bllidkml3-clan-app-pytest.drv warning: ignoring the client-specified setting 'st …
setup:
don't know how to build these paths:
  /nix/store/9238sbw1x2j9im6s7cac5k4bllidkml3-clan-app-pytest.drv
warning: ignoring the client-specified setting 'store', because it is a restricted setting and you are not a trusted user
warning: 3iykfm8wnfjygsinvgv7p9j1708q5w4d-clan-cli-source.drv: no connected, non-draining worker for system 'aarch64-darwin' offers features {}, the workers offer {}, waiting up to 120s for a worker
3iykfm8wnfjygsinvgv7p9j1708q5w4d-clan-cli-source.drv: no connected, non-draining worker for system 'aarch64-darwin' offers features {}, the workers offer {}
error: dependency 'nzs6yifma4bb99cj5s00gbs409xb6pha-python3-3.13.15-env.drv' failed
failed checks.aarch64-darwin.clan-pytest-with-core 2m 7s
setup: /nix/store/5ds9fysxln35sqh4krqw9imr4m5lnr1q-zlib-ng-2.3.3 /nix/store/mxajghyzvi968fzv2vcwq368mxi92niw-zstd-1.5.7 warning: ignoring the client-specifi …
setup:
  /nix/store/5ds9fysxln35sqh4krqw9imr4m5lnr1q-zlib-ng-2.3.3
  /nix/store/mxajghyzvi968fzv2vcwq368mxi92niw-zstd-1.5.7
warning: ignoring the client-specified setting 'store', because it is a restricted setting and you are not a trusted user
warning: 806l1klfg3jv2x0wisz3jl335y03irms-clan-core-flake.drv: no connected, non-draining worker for system 'aarch64-darwin' offers features {}, the workers offer {}, waiting up to 120s for a worker
warning: vpjabc40ad7s68sx57xhl92gm09s03lg-clan-cli-source.drv: no connected, non-draining worker for system 'aarch64-darwin' offers features {}, the workers offer {}, waiting up to 120s for a worker
806l1klfg3jv2x0wisz3jl335y03irms-clan-core-flake.drv: no connected, non-draining worker for system 'aarch64-darwin' offers features {}, the workers offer {}
vpjabc40ad7s68sx57xhl92gm09s03lg-clan-cli-source.drv: no connected, non-draining worker for system 'aarch64-darwin' offers features {}, the workers offer {}
error: dependency 'vpjabc40ad7s68sx57xhl92gm09s03lg-clan-cli-source.drv' failed
failed checks.aarch64-darwin.clan-pytest-without-core 2m 4s
setup: /nix/store/476zsjqic4kbjk43p27m165b5flfqr8l-zlib-1.3.2 /nix/store/600wx4h47gwbfm2j59v33wj0xy3ni6qz-zlib-1.3.2-static /nix/store/5ds9fysxln35sqh4krq …
setup:
  /nix/store/476zsjqic4kbjk43p27m165b5flfqr8l-zlib-1.3.2
  /nix/store/600wx4h47gwbfm2j59v33wj0xy3ni6qz-zlib-1.3.2-static
  /nix/store/5ds9fysxln35sqh4krqw9imr4m5lnr1q-zlib-ng-2.3.3
  /nix/store/mxajghyzvi968fzv2vcwq368mxi92niw-zstd-1.5.7
warning: ignoring the client-specified setting 'store', because it is a restricted setting and you are not a trusted user
warning: vpjabc40ad7s68sx57xhl92gm09s03lg-clan-cli-source.drv: no connected, non-draining worker for system 'aarch64-darwin' offers features {}, the workers offer {}, waiting up to 120s for a worker
vpjabc40ad7s68sx57xhl92gm09s03lg-clan-cli-source.drv: no connected, non-draining worker for system 'aarch64-darwin' offers features {}, the workers offer {}
error: dependency 'vpjabc40ad7s68sx57xhl92gm09s03lg-clan-cli-source.drv' failed
failed checks.aarch64-darwin.devshell 2m 4s
setup: don't know how to build these paths: /nix/store/72inplca86yrh9rfszwkxj7ld8f24s4h-check-devshell-not-depends-on-clan-cli.drv warning: ignoring the clien …
setup:
don't know how to build these paths:
  /nix/store/72inplca86yrh9rfszwkxj7ld8f24s4h-check-devshell-not-depends-on-clan-cli.drv
warning: ignoring the client-specified setting 'store', because it is a restricted setting and you are not a trusted user
warning: 3iykfm8wnfjygsinvgv7p9j1708q5w4d-clan-cli-source.drv: no connected, non-draining worker for system 'aarch64-darwin' offers features {}, the workers offer {}, waiting up to 120s for a worker
3iykfm8wnfjygsinvgv7p9j1708q5w4d-clan-cli-source.drv: no connected, non-draining worker for system 'aarch64-darwin' offers features {}, the workers offer {}
error: dependency '95qfanc8fjgfvc99xavp07632hvfzgcc-clan-cli.drv' failed
failed checks.aarch64-darwin.devShell-clan-app 2m 12s
setup: /nix/store/mxajghyzvi968fzv2vcwq368mxi92niw-zstd-1.5.7 /nix/store/sj5gmvy8rr4r60sdfic9w426addgjpq3-zstd-1.5.7-bin /nix/store/jjlwnz5xzkxgql1v0dbbj6 …
setup:
  /nix/store/mxajghyzvi968fzv2vcwq368mxi92niw-zstd-1.5.7
  /nix/store/sj5gmvy8rr4r60sdfic9w426addgjpq3-zstd-1.5.7-bin
  /nix/store/jjlwnz5xzkxgql1v0dbbj611j6b4m469-zstd-1.5.7-dev
  /nix/store/2im2w9bb1h2gdm1g6j1x9hhjkqmrvs11-zxing-cpp-2.3.0
warning: ignoring the client-specified setting 'store', because it is a restricted setting and you are not a trusted user
warning: 3iykfm8wnfjygsinvgv7p9j1708q5w4d-clan-cli-source.drv: no connected, non-draining worker for system 'aarch64-darwin' offers features {}, the workers offer {}, waiting up to 120s for a worker
3iykfm8wnfjygsinvgv7p9j1708q5w4d-clan-cli-source.drv: no connected, non-draining worker for system 'aarch64-darwin' offers features {}, the workers offer {}
error: dependency 'hb3iw2y9q5ddybfj82aigprgyqgr2z3m-python3-3.13.15-env.drv' failed
failed checks.aarch64-darwin.devShell-clan-site 2m 1s
setup: don't know how to build these paths: /nix/store/0m0pfmdqrkn17s5sdg09jhx8jfm9zhi2-nix-shell.drv warning: ignoring the client-specified setting 'store', …
setup:
don't know how to build these paths:
  /nix/store/0m0pfmdqrkn17s5sdg09jhx8jfm9zhi2-nix-shell.drv
warning: ignoring the client-specified setting 'store', because it is a restricted setting and you are not a trusted user
warning: 3iykfm8wnfjygsinvgv7p9j1708q5w4d-clan-cli-source.drv: no connected, non-draining worker for system 'aarch64-darwin' offers features {}, the workers offer {}, waiting up to 120s for a worker
3iykfm8wnfjygsinvgv7p9j1708q5w4d-clan-cli-source.drv: no connected, non-draining worker for system 'aarch64-darwin' offers features {}, the workers offer {}
error: dependency 'gpl64f96iiza3rp7ic8wqls9xcjrc2fw-generated-docs.drv' failed
failed checks.aarch64-darwin.eval-tests 2m 1s
setup: hds592jycd8g1l1f7jjg9w35vr5s9dj4-evalCheck-eval-tests-hello-world.drv: no connected, non-draining worker for system 'aarch64-darwin' offers features {}, …
setup:
hds592jycd8g1l1f7jjg9w35vr5s9dj4-evalCheck-eval-tests-hello-world.drv: no connected, non-draining worker for system 'aarch64-darwin' offers features {}, the workers offer {}
mcsi9hdcq7nqk8ydavdsq04kr50shpj0-evalCheck-eval-tests-zerotier.drv: no connected, non-draining worker for system 'aarch64-darwin' offers features {}, the workers offer {}
s8mdnqvibjlyyvdjba9pvj8mfdrx7ac2-evalCheck-eval-module-clan-vars.drv: no connected, non-draining worker for system 'aarch64-darwin' offers features {}, the workers offer {}
v5x4lbp1rxdmpsr1709phvr33rfpwl9f-evalCheck-eval-lib-build-clan.drv: no connected, non-draining worker for system 'aarch64-darwin' offers features {}, the workers offer {}
x8114j5l597aw31bn3yjv01z8m7xva38-evalCheck-lib-jsonschema-unit-tests.drv: no connected, non-draining worker for system 'aarch64-darwin' offers features {}, the workers offer {}
xhp2lw7vpc90f0a1w66namfw584yhck5-evalCheck-eval-tests-syncthing.drv: no connected, non-draining worker for system 'aarch64-darwin' offers features {}, the workers offer {}
z45q0va84h8bhs3v57c2a8axisimax2v-evalCheck-eval-lib-relativeDir.drv: no connected, non-draining worker for system 'aarch64-darwin' offers features {}, the workers offer {}
error: dependency '4wkqdz817mmh95psin3jsqcrhrrraqks-evalCheck-eval-generators-to-sops.drv' failed
failed checks.aarch64-darwin.treefmt 2m 2s
setup: /nix/store/5ds9fysxln35sqh4krqw9imr4m5lnr1q-zlib-ng-2.3.3 /nix/store/mxajghyzvi968fzv2vcwq368mxi92niw-zstd-1.5.7 /nix/store/sj5gmvy8rr4r60sdfic9w42 …
setup:
  /nix/store/5ds9fysxln35sqh4krqw9imr4m5lnr1q-zlib-ng-2.3.3
  /nix/store/mxajghyzvi968fzv2vcwq368mxi92niw-zstd-1.5.7
  /nix/store/sj5gmvy8rr4r60sdfic9w426addgjpq3-zstd-1.5.7-bin
  /nix/store/jjlwnz5xzkxgql1v0dbbj611j6b4m469-zstd-1.5.7-dev
warning: ignoring the client-specified setting 'store', because it is a restricted setting and you are not a trusted user
warning: bk4alzd4l4zxkndgq8jgpszh1q23n7vh-treefmt-check.drv: no connected, non-draining worker for system 'aarch64-darwin' offers features {}, the workers offer {}, waiting up to 120s for a worker
bk4alzd4l4zxkndgq8jgpszh1q23n7vh-treefmt-check.drv: no connected, non-draining worker for system 'aarch64-darwin' offers features {}, the workers offer {}
error: no connected, non-draining worker for system 'aarch64-darwin' offers features {}, the workers offer {}
failed checks.aarch64-linux.all-packages 46s
setup: 9bg12jc3agpd83fkw4jp07basc9zilx9-clan-cli.drv: build01: build01: input not substitutable: error: path '/nix/store/qhy9dfxfqapakppa3yjja1zkzn8p31sa-python …
setup:
9bg12jc3agpd83fkw4jp07basc9zilx9-clan-cli.drv: build01: build01: input not substitutable: error: path '/nix/store/qhy9dfxfqapakppa3yjja1zkzn8p31sa-python3-3.13.15-env' is required, but there is no substituter that can build it, asking the scheduler again
aq2mcjrhy3ckkx9532q2pyvnzgv589m3-clan-cli.drv: build01: build01: input not substitutable: error: path '/nix/store/qhy9dfxfqapakppa3yjja1zkzn8p31sa-python3-3.13.15-env' is required, but there is no substituter that can build it, asking the scheduler again
9bg12jc3agpd83fkw4jp07basc9zilx9-clan-cli.drv: build01: the build this call attached to did not finish, retry, asking the scheduler again
aq2mcjrhy3ckkx9532q2pyvnzgv589m3-clan-cli.drv: build01: build01: input not substitutable: error: path '/nix/store/qhy9dfxfqapakppa3yjja1zkzn8p31sa-python3-3.13.15-env' is required, but there is no substituter that can build it, asking the scheduler again
9bg12jc3agpd83fkw4jp07basc9zilx9-clan-cli.drv: build01: the build this call attached to did not finish, retry, asking the scheduler again
aq2mcjrhy3ckkx9532q2pyvnzgv589m3-clan-cli.drv: build01: build01: input not substitutable: error: path '/nix/store/qhy9dfxfqapakppa3yjja1zkzn8p31sa-python3-3.13.15-env' is required, but there is no substituter that can build it, asking the scheduler again
9bg12jc3agpd83fkw4jp07basc9zilx9-clan-cli.drv: build01: build01: input not substitutable: error: path '/nix/store/qhy9dfxfqapakppa3yjja1zkzn8p31sa-python3-3.13.15-env' is required, but there is no substituter that can build it, asking the scheduler again
error: dependency 'aq2mcjrhy3ckkx9532q2pyvnzgv589m3-clan-cli.drv' failed
failed eval checks.aarch64-linux.borgbackup —
error: … while evaluating the attribute 'drvPath' at «https://releases.nixos.org/nixos/26.05/nixos-26.05.11045.774debe7a0d1/nixexprs.tar.xz?narH …
error:
       … while evaluating the attribute 'drvPath'
         at «https://releases.nixos.org/nixos/26.05/nixos-26.05.11045.774debe7a0d1/nixexprs.tar.xz?narHash=sha256-S5MjznoY0gbQbcANPLz5RYjg%2B5/WQmFRgNbHcP%2Bydcg%3D»/lib/customisation.nix:427:7:
          426|     // {
          427|       drvPath =
             |       ^
          428|         assert condition;

       … while calling the 'derivationStrict' builtin
         at «nix-internal»/derivation-internal.nix:37:12:
           36|
           37|   strict = derivationStrict drvAttrs;
             |            ^
           38|

       … while evaluating the option `nodes.clientone.networking.interfaces':

       … while evaluating definitions from `/nix/store/csk881ggvmifg4qf1cal0r1ffflbmlhp-source/nixos/modules/hardware/facter/networking':

       … while evaluating the option `nodes.clientone.hardware.facter.enable':

       … while evaluating the option `nodes.clientone.hardware.facter.report':

       … while evaluating the option `nodes.clientone.hardware.facter.reportPath':

       … while evaluating definitions from `/nix/store/jm2474ca2cbmwz6000ap53xbaa56qifj-source/nixosModules/clanCore/nixos-facter.nix':

       (stack trace truncated; use '--show-trace' to show the full, detailed trace)

       error: build of '/nix/store/c20nf5ixxlkl98byh90mdyscphw2i96v-merged-test-dir-borgbackup.drv^out' failed: error: error: gRPC BuildDerivation on 'nix-store.geninf.io:50051' failed: build-x86-01: missing: /nix/store/c20nf5ixxlkl98byh90mdyscphw2i96v-merged-test-dir-borgbackup.drv
failed eval checks.aarch64-linux.certificates —
error: … while evaluating the attribute 'drvPath' at «https://releases.nixos.org/nixos/26.05/nixos-26.05.11045.774debe7a0d1/nixexprs.tar.xz?narH …
error:
       … while evaluating the attribute 'drvPath'
         at «https://releases.nixos.org/nixos/26.05/nixos-26.05.11045.774debe7a0d1/nixexprs.tar.xz?narHash=sha256-S5MjznoY0gbQbcANPLz5RYjg%2B5/WQmFRgNbHcP%2Bydcg%3D»/lib/customisation.nix:427:7:
          426|     // {
          427|       drvPath =
             |       ^
          428|         assert condition;

       … while calling the 'derivationStrict' builtin
         at «nix-internal»/derivation-internal.nix:37:12:
           36|
           37|   strict = derivationStrict drvAttrs;
             |            ^
           38|

       … while evaluating the option `nodes.ca.networking.interfaces':

       … while evaluating definitions from `/nix/store/csk881ggvmifg4qf1cal0r1ffflbmlhp-source/nixos/modules/hardware/facter/networking':

       … while evaluating the option `nodes.ca.hardware.facter.enable':

       … while evaluating the option `nodes.ca.hardware.facter.report':

       … while evaluating the option `nodes.ca.hardware.facter.reportPath':

       … while evaluating definitions from `/nix/store/jm2474ca2cbmwz6000ap53xbaa56qifj-source/nixosModules/clanCore/nixos-facter.nix':

       (stack trace truncated; use '--show-trace' to show the full, detailed trace)

       error: build of '/nix/store/2sfs7lp26wpjls0kgvikwkqadn400rph-merged-test-dir-certificates.drv^out' failed: error: gave up after 9 reschedules
failed checks.aarch64-linux.clan-app-pytest 40s
setup: 9bg12jc3agpd83fkw4jp07basc9zilx9-clan-cli.drv: build01: the build this call attached to did not finish, retry, asking the scheduler again 9bg12jc3agpd83f …
setup:
9bg12jc3agpd83fkw4jp07basc9zilx9-clan-cli.drv: build01: the build this call attached to did not finish, retry, asking the scheduler again
9bg12jc3agpd83fkw4jp07basc9zilx9-clan-cli.drv: build01: the build this call attached to did not finish, retry, asking the scheduler again
9bg12jc3agpd83fkw4jp07basc9zilx9-clan-cli.drv: build01: build01: input not substitutable: error: path '/nix/store/qhy9dfxfqapakppa3yjja1zkzn8p31sa-python3-3.13.15-env' is required, but there is no substituter that can build it, asking the scheduler again
9bg12jc3agpd83fkw4jp07basc9zilx9-clan-cli.drv: build01: the build this call attached to did not finish, retry, asking the scheduler again
9bg12jc3agpd83fkw4jp07basc9zilx9-clan-cli.drv: build01: the build this call attached to did not finish, retry, asking the scheduler again
9bg12jc3agpd83fkw4jp07basc9zilx9-clan-cli.drv: build01: the build this call attached to did not finish, retry, asking the scheduler again
9bg12jc3agpd83fkw4jp07basc9zilx9-clan-cli.drv: build01: build01: input not substitutable: error: path '/nix/store/qhy9dfxfqapakppa3yjja1zkzn8p31sa-python3-3.13.15-env' is required, but there is no substituter that can build it, asking the scheduler again
error: dependency 'ws5vp8nnqdpn4qxcljyl1g83lbynz7wi-python3-3.13.15-env.drv' failed
failed checks.aarch64-linux.clan-pytest-with-core 49s
setup: /nix/store/vldmg1y5yxvvkd2bnd1xamy1bdc2js3y-zlib-1.3.2-static /nix/store/6fhxdm9f25c7h86nadfy8qim4h9hq04d-zlib-ng-2.3.3 /nix/store/i8f26lwk8i93hmiy …
setup:
  /nix/store/vldmg1y5yxvvkd2bnd1xamy1bdc2js3y-zlib-1.3.2-static
  /nix/store/6fhxdm9f25c7h86nadfy8qim4h9hq04d-zlib-ng-2.3.3
  /nix/store/i8f26lwk8i93hmiyrmsy752m6nwi4pmk-zstd-1.5.7
  /nix/store/j3zlp8gw0674jlwjy1v6g6d08mri7agz-zvbi-0.2.45
  /nix/store/pfns7xmwpx19sr5nyfpigxf22v2xf9h7-zxing-cpp-2.3.0
warning: ignoring the client-specified setting 'store', because it is a restricted setting and you are not a trusted user
4hwj996nl229k1nd7s0rcv3k3zmh4wvp-clan-pytest-with-core.drv: error: gRPC AddMultipleToStore on 'nix-store.geninf.io:50051' failed: error: path '/nix/store/6skwd76b3h16zdxxlzvmsb7jbw2hm6lj-closure-info.drv' is required, but there is no substituter that can build it
error: error: gRPC AddMultipleToStore on 'nix-store.geninf.io:50051' failed: error: path '/nix/store/6skwd76b3h16zdxxlzvmsb7jbw2hm6lj-closure-info.drv' is required, but there is no substituter that can build it
failed checks.aarch64-linux.clan-pytest-without-core 49s
setup: don't know how to build these paths: /nix/store/xp7pjd6ig8az5fdr8xafxvkjrzrha2g9-clan-pytest-without-core.drv warning: ignoring the client-specified se …
setup:
don't know how to build these paths:
  /nix/store/xp7pjd6ig8az5fdr8xafxvkjrzrha2g9-clan-pytest-without-core.drv
warning: ignoring the client-specified setting 'store', because it is a restricted setting and you are not a trusted user
xp7pjd6ig8az5fdr8xafxvkjrzrha2g9-clan-pytest-without-core.drv: error: gRPC AddMultipleToStore on 'nix-store.geninf.io:50051' failed: error: path '/nix/store/1ib56lqznbxil4awa7rfh3slkawciibm-python3-3.13.15-env.drv' is required, but there is no substituter that can build it
error: error: gRPC AddMultipleToStore on 'nix-store.geninf.io:50051' failed: error: path '/nix/store/1ib56lqznbxil4awa7rfh3slkawciibm-python3-3.13.15-env.drv' is required, but there is no substituter that can build it
failed checks.aarch64-linux.clan-site-lint 41s
setup: 9bg12jc3agpd83fkw4jp07basc9zilx9-clan-cli.drv: build01: build01: input not substitutable: error: path '/nix/store/qhy9dfxfqapakppa3yjja1zkzn8p31sa-python …
setup:
9bg12jc3agpd83fkw4jp07basc9zilx9-clan-cli.drv: build01: build01: input not substitutable: error: path '/nix/store/qhy9dfxfqapakppa3yjja1zkzn8p31sa-python3-3.13.15-env' is required, but there is no substituter that can build it, asking the scheduler again
9bg12jc3agpd83fkw4jp07basc9zilx9-clan-cli.drv: build01: build01: input not substitutable: error: path '/nix/store/qhy9dfxfqapakppa3yjja1zkzn8p31sa-python3-3.13.15-env' is required, but there is no substituter that can build it, asking the scheduler again
9bg12jc3agpd83fkw4jp07basc9zilx9-clan-cli.drv: build01: build01: input not substitutable: error: path '/nix/store/qhy9dfxfqapakppa3yjja1zkzn8p31sa-python3-3.13.15-env' is required, but there is no substituter that can build it, asking the scheduler again
9bg12jc3agpd83fkw4jp07basc9zilx9-clan-cli.drv: build01: build01: input not substitutable: error: path '/nix/store/qhy9dfxfqapakppa3yjja1zkzn8p31sa-python3-3.13.15-env' is required, but there is no substituter that can build it, asking the scheduler again
9bg12jc3agpd83fkw4jp07basc9zilx9-clan-cli.drv: build01: build01: input not substitutable: error: path '/nix/store/qhy9dfxfqapakppa3yjja1zkzn8p31sa-python3-3.13.15-env' is required, but there is no substituter that can build it, asking the scheduler again
9bg12jc3agpd83fkw4jp07basc9zilx9-clan-cli.drv: build01: build01: input not substitutable: error: path '/nix/store/qhy9dfxfqapakppa3yjja1zkzn8p31sa-python3-3.13.15-env' is required, but there is no substituter that can build it, asking the scheduler again
9bg12jc3agpd83fkw4jp07basc9zilx9-clan-cli.drv: build01: build01: input not substitutable: error: path '/nix/store/qhy9dfxfqapakppa3yjja1zkzn8p31sa-python3-3.13.15-env' is required, but there is no substituter that can build it, asking the scheduler again
error: dependency '5gapf352hz3cn78h0l2yg8wnal79imwh-generated-docs.drv' failed
failed checks.aarch64-linux.clan-test-iso 44s
setup: aq2mcjrhy3ckkx9532q2pyvnzgv589m3-clan-cli.drv: build01: build01: input not substitutable: error: path '/nix/store/qhy9dfxfqapakppa3yjja1zkzn8p31sa-python …
setup:
aq2mcjrhy3ckkx9532q2pyvnzgv589m3-clan-cli.drv: build01: build01: input not substitutable: error: path '/nix/store/qhy9dfxfqapakppa3yjja1zkzn8p31sa-python3-3.13.15-env' is required, but there is no substituter that can build it, asking the scheduler again
aq2mcjrhy3ckkx9532q2pyvnzgv589m3-clan-cli.drv: build01: build01: input not substitutable: error: path '/nix/store/qhy9dfxfqapakppa3yjja1zkzn8p31sa-python3-3.13.15-env' is required, but there is no substituter that can build it, asking the scheduler again
aq2mcjrhy3ckkx9532q2pyvnzgv589m3-clan-cli.drv: build01: build01: input not substitutable: error: path '/nix/store/qhy9dfxfqapakppa3yjja1zkzn8p31sa-python3-3.13.15-env' is required, but there is no substituter that can build it, asking the scheduler again
aq2mcjrhy3ckkx9532q2pyvnzgv589m3-clan-cli.drv: build01: build01: input not substitutable: error: path '/nix/store/qhy9dfxfqapakppa3yjja1zkzn8p31sa-python3-3.13.15-env' is required, but there is no substituter that can build it, asking the scheduler again
aq2mcjrhy3ckkx9532q2pyvnzgv589m3-clan-cli.drv: build01: build01: input not substitutable: error: path '/nix/store/qhy9dfxfqapakppa3yjja1zkzn8p31sa-python3-3.13.15-env' is required, but there is no substituter that can build it, asking the scheduler again
aq2mcjrhy3ckkx9532q2pyvnzgv589m3-clan-cli.drv: build01: build01: input not substitutable: error: path '/nix/store/qhy9dfxfqapakppa3yjja1zkzn8p31sa-python3-3.13.15-env' is required, but there is no substituter that can build it, asking the scheduler again
jxf135vgzkss499pnlgrpibxr4vv0f1n-closure-info.drv: error: gRPC AddMultipleToStore on 'nix-store.geninf.io:50051' failed: error: some references of path '/nix/store/n2p02gjiqfhl4sy08ay55klv7jbz845l-perl-5.42.0-env.drv' could not be realised
error: dependency 'l9qynn263zmw6qjrzsl8ffdg0vrg9bcq-nixos-test-driver-clan-test-iso.drv' failed
failed eval checks.aarch64-linux.data-mesher —
error: … while evaluating the attribute 'drvPath' at «https://releases.nixos.org/nixos/26.05/nixos-26.05.11045.774debe7a0d1/nixexprs.tar.xz?narH …
error:
       … while evaluating the attribute 'drvPath'
         at «https://releases.nixos.org/nixos/26.05/nixos-26.05.11045.774debe7a0d1/nixexprs.tar.xz?narHash=sha256-S5MjznoY0gbQbcANPLz5RYjg%2B5/WQmFRgNbHcP%2Bydcg%3D»/lib/customisation.nix:427:7:
          426|     // {
          427|       drvPath =
             |       ^
          428|         assert condition;

       … while calling the 'derivationStrict' builtin
         at «nix-internal»/derivation-internal.nix:37:12:
           36|
           37|   strict = derivationStrict drvAttrs;
             |            ^
           38|

       … while evaluating the option `nodes.alpha.networking.interfaces':

       … while evaluating definitions from `/nix/store/csk881ggvmifg4qf1cal0r1ffflbmlhp-source/nixos/modules/hardware/facter/networking':

       … while evaluating the option `nodes.alpha.hardware.facter.enable':

       … while evaluating the option `nodes.alpha.hardware.facter.report':

       … while evaluating the option `nodes.alpha.hardware.facter.reportPath':

       … while evaluating definitions from `/nix/store/jm2474ca2cbmwz6000ap53xbaa56qifj-source/nixosModules/clanCore/nixos-facter.nix':

       (stack trace truncated; use '--show-trace' to show the full, detailed trace)

       error: build of '/nix/store/bisdrchsk95mhvw467p4wq5b2f79msnx-merged-test-dir-data-mesher.drv^out' failed: error: error: gRPC BuildDerivation on 'nix-store.geninf.io:50051' failed: build-x86-01: missing: /nix/store/bisdrchsk95mhvw467p4wq5b2f79msnx-merged-test-dir-data-mesher.drv
failed checks.aarch64-linux.devshell 36s
setup: 9bg12jc3agpd83fkw4jp07basc9zilx9-clan-cli.drv: build01: build01: input not substitutable: error: path '/nix/store/qhy9dfxfqapakppa3yjja1zkzn8p31sa-python …
setup:
9bg12jc3agpd83fkw4jp07basc9zilx9-clan-cli.drv: build01: build01: input not substitutable: error: path '/nix/store/qhy9dfxfqapakppa3yjja1zkzn8p31sa-python3-3.13.15-env' is required, but there is no substituter that can build it, asking the scheduler again
9bg12jc3agpd83fkw4jp07basc9zilx9-clan-cli.drv: build01: build01: input not substitutable: error: path '/nix/store/qhy9dfxfqapakppa3yjja1zkzn8p31sa-python3-3.13.15-env' is required, but there is no substituter that can build it, asking the scheduler again
9bg12jc3agpd83fkw4jp07basc9zilx9-clan-cli.drv: build01: build01: input not substitutable: error: path '/nix/store/qhy9dfxfqapakppa3yjja1zkzn8p31sa-python3-3.13.15-env' is required, but there is no substituter that can build it, asking the scheduler again
9bg12jc3agpd83fkw4jp07basc9zilx9-clan-cli.drv: build01: build01: input not substitutable: error: path '/nix/store/qhy9dfxfqapakppa3yjja1zkzn8p31sa-python3-3.13.15-env' is required, but there is no substituter that can build it, asking the scheduler again
9bg12jc3agpd83fkw4jp07basc9zilx9-clan-cli.drv: build01: build01: input not substitutable: error: path '/nix/store/qhy9dfxfqapakppa3yjja1zkzn8p31sa-python3-3.13.15-env' is required, but there is no substituter that can build it, asking the scheduler again
9bg12jc3agpd83fkw4jp07basc9zilx9-clan-cli.drv: build01: build01: input not substitutable: error: path '/nix/store/qhy9dfxfqapakppa3yjja1zkzn8p31sa-python3-3.13.15-env' is required, but there is no substituter that can build it, asking the scheduler again
9bg12jc3agpd83fkw4jp07basc9zilx9-clan-cli.drv: build01: build01: input not substitutable: error: path '/nix/store/qhy9dfxfqapakppa3yjja1zkzn8p31sa-python3-3.13.15-env' is required, but there is no substituter that can build it, asking the scheduler again
error: dependency '9bg12jc3agpd83fkw4jp07basc9zilx9-clan-cli.drv' failed
failed checks.aarch64-linux.devShell-clan-app 37s
setup: 9bg12jc3agpd83fkw4jp07basc9zilx9-clan-cli.drv: build01: build01: input not substitutable: error: path '/nix/store/qhy9dfxfqapakppa3yjja1zkzn8p31sa-python …
setup:
9bg12jc3agpd83fkw4jp07basc9zilx9-clan-cli.drv: build01: build01: input not substitutable: error: path '/nix/store/qhy9dfxfqapakppa3yjja1zkzn8p31sa-python3-3.13.15-env' is required, but there is no substituter that can build it, asking the scheduler again
9bg12jc3agpd83fkw4jp07basc9zilx9-clan-cli.drv: build01: build01: input not substitutable: error: path '/nix/store/qhy9dfxfqapakppa3yjja1zkzn8p31sa-python3-3.13.15-env' is required, but there is no substituter that can build it, asking the scheduler again
9bg12jc3agpd83fkw4jp07basc9zilx9-clan-cli.drv: build01: build01: input not substitutable: error: path '/nix/store/qhy9dfxfqapakppa3yjja1zkzn8p31sa-python3-3.13.15-env' is required, but there is no substituter that can build it, asking the scheduler again
9bg12jc3agpd83fkw4jp07basc9zilx9-clan-cli.drv: build01: build01: input not substitutable: error: path '/nix/store/qhy9dfxfqapakppa3yjja1zkzn8p31sa-python3-3.13.15-env' is required, but there is no substituter that can build it, asking the scheduler again
9bg12jc3agpd83fkw4jp07basc9zilx9-clan-cli.drv: build01: build01: input not substitutable: error: path '/nix/store/qhy9dfxfqapakppa3yjja1zkzn8p31sa-python3-3.13.15-env' is required, but there is no substituter that can build it, asking the scheduler again
9bg12jc3agpd83fkw4jp07basc9zilx9-clan-cli.drv: build01: build01: input not substitutable: error: path '/nix/store/qhy9dfxfqapakppa3yjja1zkzn8p31sa-python3-3.13.15-env' is required, but there is no substituter that can build it, asking the scheduler again
9bg12jc3agpd83fkw4jp07basc9zilx9-clan-cli.drv: build01: build01: input not substitutable: error: path '/nix/store/qhy9dfxfqapakppa3yjja1zkzn8p31sa-python3-3.13.15-env' is required, but there is no substituter that can build it, asking the scheduler again
error: dependency 'mxldn21hyspxkl3yiz4zl1cpaaxihx4i-python3-3.13.15-env.drv' failed
failed checks.aarch64-linux.devShell-clan-site 39s
setup: 9bg12jc3agpd83fkw4jp07basc9zilx9-clan-cli.drv: build01: build01: input not substitutable: error: path '/nix/store/qhy9dfxfqapakppa3yjja1zkzn8p31sa-python …
setup:
9bg12jc3agpd83fkw4jp07basc9zilx9-clan-cli.drv: build01: build01: input not substitutable: error: path '/nix/store/qhy9dfxfqapakppa3yjja1zkzn8p31sa-python3-3.13.15-env' is required, but there is no substituter that can build it, asking the scheduler again
9bg12jc3agpd83fkw4jp07basc9zilx9-clan-cli.drv: build01: build01: input not substitutable: error: path '/nix/store/qhy9dfxfqapakppa3yjja1zkzn8p31sa-python3-3.13.15-env' is required, but there is no substituter that can build it, asking the scheduler again
9bg12jc3agpd83fkw4jp07basc9zilx9-clan-cli.drv: build01: build01: input not substitutable: error: path '/nix/store/qhy9dfxfqapakppa3yjja1zkzn8p31sa-python3-3.13.15-env' is required, but there is no substituter that can build it, asking the scheduler again
9bg12jc3agpd83fkw4jp07basc9zilx9-clan-cli.drv: build01: the build this call attached to did not finish, retry, asking the scheduler again
9bg12jc3agpd83fkw4jp07basc9zilx9-clan-cli.drv: build01: build01: input not substitutable: error: path '/nix/store/qhy9dfxfqapakppa3yjja1zkzn8p31sa-python3-3.13.15-env' is required, but there is no substituter that can build it, asking the scheduler again
9bg12jc3agpd83fkw4jp07basc9zilx9-clan-cli.drv: build01: build01: input not substitutable: error: path '/nix/store/qhy9dfxfqapakppa3yjja1zkzn8p31sa-python3-3.13.15-env' is required, but there is no substituter that can build it, asking the scheduler again
9bg12jc3agpd83fkw4jp07basc9zilx9-clan-cli.drv: build01: the build this call attached to did not finish, retry, asking the scheduler again
error: dependency '5gapf352hz3cn78h0l2yg8wnal79imwh-generated-docs.drv' failed
failed checks.aarch64-linux.devShell-docs 46s
setup: 9bg12jc3agpd83fkw4jp07basc9zilx9-clan-cli.drv: build01: the build this call attached to did not finish, retry, asking the scheduler again 9bg12jc3agpd83f …
setup:
9bg12jc3agpd83fkw4jp07basc9zilx9-clan-cli.drv: build01: the build this call attached to did not finish, retry, asking the scheduler again
9bg12jc3agpd83fkw4jp07basc9zilx9-clan-cli.drv: build01: the build this call attached to did not finish, retry, asking the scheduler again
9bg12jc3agpd83fkw4jp07basc9zilx9-clan-cli.drv: build01: build01: input not substitutable: error: path '/nix/store/qhy9dfxfqapakppa3yjja1zkzn8p31sa-python3-3.13.15-env' is required, but there is no substituter that can build it, asking the scheduler again
9bg12jc3agpd83fkw4jp07basc9zilx9-clan-cli.drv: build01: the build this call attached to did not finish, retry, asking the scheduler again
9bg12jc3agpd83fkw4jp07basc9zilx9-clan-cli.drv: build01: build01: input not substitutable: error: path '/nix/store/qhy9dfxfqapakppa3yjja1zkzn8p31sa-python3-3.13.15-env' is required, but there is no substituter that can build it, asking the scheduler again
9bg12jc3agpd83fkw4jp07basc9zilx9-clan-cli.drv: build01: build01: input not substitutable: error: path '/nix/store/qhy9dfxfqapakppa3yjja1zkzn8p31sa-python3-3.13.15-env' is required, but there is no substituter that can build it, asking the scheduler again
9bg12jc3agpd83fkw4jp07basc9zilx9-clan-cli.drv: build01: the build this call attached to did not finish, retry, asking the scheduler again
error: dependency '5gapf352hz3cn78h0l2yg8wnal79imwh-generated-docs.drv' failed
failed eval checks.aarch64-linux.dm-dns —
error: … while evaluating the attribute 'drvPath' at «https://releases.nixos.org/nixos/26.05/nixos-26.05.11045.774debe7a0d1/nixexprs.tar.xz?narH …
error:
       … while evaluating the attribute 'drvPath'
         at «https://releases.nixos.org/nixos/26.05/nixos-26.05.11045.774debe7a0d1/nixexprs.tar.xz?narHash=sha256-S5MjznoY0gbQbcANPLz5RYjg%2B5/WQmFRgNbHcP%2Bydcg%3D»/lib/customisation.nix:427:7:
          426|     // {
          427|       drvPath =
             |       ^
          428|         assert condition;

       … while calling the 'derivationStrict' builtin
         at «nix-internal»/derivation-internal.nix:37:12:
           36|
           37|   strict = derivationStrict drvAttrs;
             |            ^
           38|

       … while evaluating the option `nodes.client.networking.interfaces':

       … while evaluating definitions from `/nix/store/csk881ggvmifg4qf1cal0r1ffflbmlhp-source/nixos/modules/hardware/facter/networking':

       … while evaluating the option `nodes.client.hardware.facter.enable':

       … while evaluating the option `nodes.client.hardware.facter.report':

       … while evaluating the option `nodes.client.hardware.facter.reportPath':

       … while evaluating definitions from `/nix/store/jm2474ca2cbmwz6000ap53xbaa56qifj-source/nixosModules/clanCore/nixos-facter.nix':

       (stack trace truncated; use '--show-trace' to show the full, detailed trace)

       error: build of '/nix/store/yln3f9jkdz1nwbsd4mb869zl8hfcnvyl-merged-test-dir-dm-dns.drv^out' failed: error: error: gRPC BuildDerivation on 'nix-store.geninf.io:50051' failed: build-x86-01: missing: /nix/store/yln3f9jkdz1nwbsd4mb869zl8hfcnvyl-merged-test-dir-dm-dns.drv
failed checks.aarch64-linux.eval-tests 16s
setup: vasz74rhl68m4dwylq58ld4mi5cyj6d9-evalCheck-eval-lib-distributedServices.drv: error: gRPC AddMultipleToStore on 'nix-store.geninf.io:50051' failed: error: …
setup:
vasz74rhl68m4dwylq58ld4mi5cyj6d9-evalCheck-eval-lib-distributedServices.drv: error: gRPC AddMultipleToStore on 'nix-store.geninf.io:50051' failed: error: some references of path '/nix/store/m1zliyrmawgmkdvw46626rlgv64vqfd9-nix-unit-2.34.2.drv' could not be realised
y7cffj7d3j35ii2zkvk92kb4l9nlwr6p-evalCheck-eval-tests-zerotier.drv: error: gRPC AddMultipleToStore on 'nix-store.geninf.io:50051' failed: error: some references of path '/nix/store/m1zliyrmawgmkdvw46626rlgv64vqfd9-nix-unit-2.34.2.drv' could not be realised
ks9ha2gvaaynczpl40sr2ms3q7yw2dh9-evalCheck-eval-module-clan-vars.drv: error: gRPC AddMultipleToStore on 'nix-store.geninf.io:50051' failed: error: some references of path '/nix/store/m1zliyrmawgmkdvw46626rlgv64vqfd9-nix-unit-2.34.2.drv' could not be realised
595m3i1zjgjjxd7kdang6lm0zjf2kb2g-evalCheck-eval-lib-values.drv: error: gRPC AddMultipleToStore on 'nix-store.geninf.io:50051' failed: error: some references of path '/nix/store/m1zliyrmawgmkdvw46626rlgv64vqfd9-nix-unit-2.34.2.drv' could not be realised
aldxrmqfa60pa23hnqa53l22klhrym9b-evalCheck-eval-vars-backends.drv: error: gRPC AddMultipleToStore on 'nix-store.geninf.io:50051' failed: error: some references of path '/nix/store/m1zliyrmawgmkdvw46626rlgv64vqfd9-nix-unit-2.34.2.drv' could not be realised
kc1zddbi7bpf1nvhw66rba1sdx55n9qb-evalCheck-eval-tests-installer.drv: error: gRPC AddMultipleToStore on 'nix-store.geninf.io:50051' failed: error: some references of path '/nix/store/m1zliyrmawgmkdvw46626rlgv64vqfd9-nix-unit-2.34.2.drv' could not be realised
98mmbjj29qigz4zr34512bymysl1nzpn-evalCheck-eval-lib-resolve-module.drv: error: gRPC AddMultipleToStore on 'nix-store.geninf.io:50051' failed: error: some references of path '/nix/store/m1zliyrmawgmkdvw46626rlgv64vqfd9-nix-unit-2.34.2.drv' could not be realised
error: dependency '0ayv5m68ms3mc5bcjg6d1px4ln71iaas-evalCheck-eval-lib-relativeDir.drv' failed
failed eval checks.aarch64-linux.garage —
error: … while evaluating the attribute 'drvPath' at «https://releases.nixos.org/nixos/26.05/nixos-26.05.11045.774debe7a0d1/nixexprs.tar.xz?narH …
error:
       … while evaluating the attribute 'drvPath'
         at «https://releases.nixos.org/nixos/26.05/nixos-26.05.11045.774debe7a0d1/nixexprs.tar.xz?narHash=sha256-S5MjznoY0gbQbcANPLz5RYjg%2B5/WQmFRgNbHcP%2Bydcg%3D»/lib/customisation.nix:427:7:
          426|     // {
          427|       drvPath =
             |       ^
          428|         assert condition;

       … while calling the 'derivationStrict' builtin
         at «nix-internal»/derivation-internal.nix:37:12:
           36|
           37|   strict = derivationStrict drvAttrs;
             |            ^
           38|

       … while evaluating the option `nodes.server.networking.interfaces':

       … while evaluating definitions from `/nix/store/csk881ggvmifg4qf1cal0r1ffflbmlhp-source/nixos/modules/hardware/facter/networking':

       … while evaluating the option `nodes.server.hardware.facter.enable':

       … while evaluating the option `nodes.server.hardware.facter.report':

       … while evaluating the option `nodes.server.hardware.facter.reportPath':

       … while evaluating definitions from `/nix/store/jm2474ca2cbmwz6000ap53xbaa56qifj-source/nixosModules/clanCore/nixos-facter.nix':

       (stack trace truncated; use '--show-trace' to show the full, detailed trace)

       error: build of '/nix/store/m5bznfa9ljfbjad6mr813wqn4ncj0h1c-merged-test-dir-garage.drv^out' failed: error: error: gRPC BuildDerivation on 'nix-store.geninf.io:50051' failed: build-x86-01: missing: /nix/store/m5bznfa9ljfbjad6mr813wqn4ncj0h1c-merged-test-dir-garage.drv
failed eval checks.aarch64-linux.machine-id —
error: … while evaluating the attribute 'drvPath' at «https://releases.nixos.org/nixos/26.05/nixos-26.05.11045.774debe7a0d1/nixexprs.tar.xz?narH …
error:
       … while evaluating the attribute 'drvPath'
         at «https://releases.nixos.org/nixos/26.05/nixos-26.05.11045.774debe7a0d1/nixexprs.tar.xz?narHash=sha256-S5MjznoY0gbQbcANPLz5RYjg%2B5/WQmFRgNbHcP%2Bydcg%3D»/lib/customisation.nix:427:7:
          426|     // {
          427|       drvPath =
             |       ^
          428|         assert condition;

       … while calling the 'derivationStrict' builtin
         at «nix-internal»/derivation-internal.nix:37:12:
           36|
           37|   strict = derivationStrict drvAttrs;
             |            ^
           38|

       … while evaluating the option `nodes.server.networking.interfaces':

       … while evaluating definitions from `/nix/store/csk881ggvmifg4qf1cal0r1ffflbmlhp-source/nixos/modules/hardware/facter/networking':

       … while evaluating the option `nodes.server.hardware.facter.enable':

       … while evaluating the option `nodes.server.hardware.facter.report':

       … while evaluating the option `nodes.server.hardware.facter.reportPath':

       … while evaluating definitions from `/nix/store/jm2474ca2cbmwz6000ap53xbaa56qifj-source/nixosModules/clanCore/nixos-facter.nix':

       (stack trace truncated; use '--show-trace' to show the full, detailed trace)

       error: build of '/nix/store/1aw9g733adh7hh3dcxcs1bmkzhb8izr1-merged-test-dir-service-machine-id.drv^out' failed: error: gave up after 9 reschedules
failed eval checks.aarch64-linux.matrix-synapse —
error: … while evaluating the attribute 'drvPath' at «https://releases.nixos.org/nixos/26.05/nixos-26.05.11045.774debe7a0d1/nixexprs.tar.xz?narH …
error:
       … while evaluating the attribute 'drvPath'
         at «https://releases.nixos.org/nixos/26.05/nixos-26.05.11045.774debe7a0d1/nixexprs.tar.xz?narHash=sha256-S5MjznoY0gbQbcANPLz5RYjg%2B5/WQmFRgNbHcP%2Bydcg%3D»/lib/customisation.nix:427:7:
          426|     // {
          427|       drvPath =
             |       ^
          428|         assert condition;

       … while calling the 'derivationStrict' builtin
         at «nix-internal»/derivation-internal.nix:37:12:
           36|
           37|   strict = derivationStrict drvAttrs;
             |            ^
           38|

       … while evaluating the option `nodes.machine.networking.interfaces':

       … while evaluating definitions from `/nix/store/csk881ggvmifg4qf1cal0r1ffflbmlhp-source/nixos/modules/hardware/facter/networking':

       … while evaluating the option `nodes.machine.hardware.facter.enable':

       … while evaluating the option `nodes.machine.hardware.facter.report':

       … while evaluating the option `nodes.machine.hardware.facter.reportPath':

       … while evaluating definitions from `/nix/store/jm2474ca2cbmwz6000ap53xbaa56qifj-source/nixosModules/clanCore/nixos-facter.nix':

       (stack trace truncated; use '--show-trace' to show the full, detailed trace)

       error: build of '/nix/store/1k4q4h7b0264nnw73rgmiyag11gv3b9k-merged-test-dir-matrix-synapse.drv^out' failed: error: error: gRPC BuildDerivation on 'nix-store.geninf.io:50051' failed: build-x86-01: missing: /nix/store/1k4q4h7b0264nnw73rgmiyag11gv3b9k-merged-test-dir-matrix-synapse.drv
failed eval checks.aarch64-linux.monitoring —
error: … while evaluating the attribute 'drvPath' at «https://releases.nixos.org/nixos/26.05/nixos-26.05.11045.774debe7a0d1/nixexprs.tar.xz?narH …
error:
       … while evaluating the attribute 'drvPath'
         at «https://releases.nixos.org/nixos/26.05/nixos-26.05.11045.774debe7a0d1/nixexprs.tar.xz?narHash=sha256-S5MjznoY0gbQbcANPLz5RYjg%2B5/WQmFRgNbHcP%2Bydcg%3D»/lib/customisation.nix:427:7:
          426|     // {
          427|       drvPath =
             |       ^
          428|         assert condition;

       … while calling the 'derivationStrict' builtin
         at «nix-internal»/derivation-internal.nix:37:12:
           36|
           37|   strict = derivationStrict drvAttrs;
             |            ^
           38|

       … while evaluating the option `nodes.machine1.networking.interfaces':

       … while evaluating definitions from `/nix/store/csk881ggvmifg4qf1cal0r1ffflbmlhp-source/nixos/modules/hardware/facter/networking':

       … while evaluating the option `nodes.machine1.hardware.facter.enable':

       … while evaluating the option `nodes.machine1.hardware.facter.report':

       … while evaluating the option `nodes.machine1.hardware.facter.reportPath':

       … while evaluating definitions from `/nix/store/jm2474ca2cbmwz6000ap53xbaa56qifj-source/nixosModules/clanCore/nixos-facter.nix':

       (stack trace truncated; use '--show-trace' to show the full, detailed trace)

       error: build of '/nix/store/w7lsmv9zb3ng21k9akkmgq342l47ylf2-merged-test-dir-monitoring.drv^out' failed: error: gave up after 9 reschedules
failed eval checks.aarch64-linux.mycelium —
error: … while evaluating the attribute 'drvPath' at «https://releases.nixos.org/nixos/26.05/nixos-26.05.11045.774debe7a0d1/nixexprs.tar.xz?narH …
error:
       … while evaluating the attribute 'drvPath'
         at «https://releases.nixos.org/nixos/26.05/nixos-26.05.11045.774debe7a0d1/nixexprs.tar.xz?narHash=sha256-S5MjznoY0gbQbcANPLz5RYjg%2B5/WQmFRgNbHcP%2Bydcg%3D»/lib/customisation.nix:427:7:
          426|     // {
          427|       drvPath =
             |       ^
          428|         assert condition;

       … while calling the 'derivationStrict' builtin
         at «nix-internal»/derivation-internal.nix:37:12:
           36|
           37|   strict = derivationStrict drvAttrs;
             |            ^
           38|

       … while evaluating the option `driverConfiguration.vlans':

       … while evaluating definitions from `/nix/store/csk881ggvmifg4qf1cal0r1ffflbmlhp-source/nixos/lib/testing/driver-configuration.nix':

       … while evaluating the option `nodes.server.networking.interfaces':

       … while evaluating definitions from `/nix/store/csk881ggvmifg4qf1cal0r1ffflbmlhp-source/nixos/modules/hardware/facter/networking':

       … while evaluating the option `nodes.server.hardware.facter.enable':

       … while evaluating the option `nodes.server.hardware.facter.report':

       … while evaluating the option `nodes.server.hardware.facter.reportPath':

       … while evaluating definitions from `/nix/store/jm2474ca2cbmwz6000ap53xbaa56qifj-source/nixosModules/clanCore/nixos-facter.nix':

       (stack trace truncated; use '--show-trace' to show the full, detailed trace)

       error: build of '/nix/store/wrfb0i91rk06qpfq4p27lyskcqjlvfl6-merged-test-dir-mycelium.drv^out' failed: error: error: gRPC BuildDerivation on 'nix-store.geninf.io:50051' failed: build-x86-01: missing: /nix/store/wrfb0i91rk06qpfq4p27lyskcqjlvfl6-merged-test-dir-mycelium.drv
failed eval checks.aarch64-linux.ncps —
error: … while evaluating the attribute 'drvPath' at «https://releases.nixos.org/nixos/26.05/nixos-26.05.11045.774debe7a0d1/nixexprs.tar.xz?narH …
error:
       … while evaluating the attribute 'drvPath'
         at «https://releases.nixos.org/nixos/26.05/nixos-26.05.11045.774debe7a0d1/nixexprs.tar.xz?narHash=sha256-S5MjznoY0gbQbcANPLz5RYjg%2B5/WQmFRgNbHcP%2Bydcg%3D»/lib/customisation.nix:427:7:
          426|     // {
          427|       drvPath =
             |       ^
          428|         assert condition;

       … while calling the 'derivationStrict' builtin
         at «nix-internal»/derivation-internal.nix:37:12:
           36|
           37|   strict = derivationStrict drvAttrs;
             |            ^
           38|

       … while evaluating the option `nodes.alice.networking.interfaces':

       … while evaluating definitions from `/nix/store/csk881ggvmifg4qf1cal0r1ffflbmlhp-source/nixos/modules/hardware/facter/networking':

       … while evaluating the option `nodes.alice.hardware.facter.enable':

       … while evaluating the option `nodes.alice.hardware.facter.report':

       … while evaluating the option `nodes.alice.hardware.facter.reportPath':

       … while evaluating definitions from `/nix/store/jm2474ca2cbmwz6000ap53xbaa56qifj-source/nixosModules/clanCore/nixos-facter.nix':

       (stack trace truncated; use '--show-trace' to show the full, detailed trace)

       error: build of '/nix/store/0b9va4azqjj9ka1fylgah8qwbq7xx0l5-merged-test-dir-ncps.drv^out' failed: error: error: gRPC BuildDerivation on 'nix-store.geninf.io:50051' failed: build-x86-01: missing: /nix/store/0b9va4azqjj9ka1fylgah8qwbq7xx0l5-merged-test-dir-ncps.drv
failed checks.aarch64-linux.nixos-systemd-abstraction 48s
setup: aq2mcjrhy3ckkx9532q2pyvnzgv589m3-clan-cli.drv: build01: build01: input not substitutable: error: path '/nix/store/qhy9dfxfqapakppa3yjja1zkzn8p31sa-python …
setup:
aq2mcjrhy3ckkx9532q2pyvnzgv589m3-clan-cli.drv: build01: build01: input not substitutable: error: path '/nix/store/qhy9dfxfqapakppa3yjja1zkzn8p31sa-python3-3.13.15-env' is required, but there is no substituter that can build it, asking the scheduler again
aq2mcjrhy3ckkx9532q2pyvnzgv589m3-clan-cli.drv: build01: build01: input not substitutable: error: path '/nix/store/qhy9dfxfqapakppa3yjja1zkzn8p31sa-python3-3.13.15-env' is required, but there is no substituter that can build it, asking the scheduler again
aq2mcjrhy3ckkx9532q2pyvnzgv589m3-clan-cli.drv: build01: build01: input not substitutable: error: path '/nix/store/qhy9dfxfqapakppa3yjja1zkzn8p31sa-python3-3.13.15-env' is required, but there is no substituter that can build it, asking the scheduler again
aq2mcjrhy3ckkx9532q2pyvnzgv589m3-clan-cli.drv: build01: build01: input not substitutable: error: path '/nix/store/qhy9dfxfqapakppa3yjja1zkzn8p31sa-python3-3.13.15-env' is required, but there is no substituter that can build it, asking the scheduler again
aq2mcjrhy3ckkx9532q2pyvnzgv589m3-clan-cli.drv: build01: build01: input not substitutable: error: path '/nix/store/qhy9dfxfqapakppa3yjja1zkzn8p31sa-python3-3.13.15-env' is required, but there is no substituter that can build it, asking the scheduler again
aq2mcjrhy3ckkx9532q2pyvnzgv589m3-clan-cli.drv: build01: build01: input not substitutable: error: path '/nix/store/qhy9dfxfqapakppa3yjja1zkzn8p31sa-python3-3.13.15-env' is required, but there is no substituter that can build it, asking the scheduler again
aq2mcjrhy3ckkx9532q2pyvnzgv589m3-clan-cli.drv: build01: build01: input not substitutable: error: path '/nix/store/qhy9dfxfqapakppa3yjja1zkzn8p31sa-python3-3.13.15-env' is required, but there is no substituter that can build it, asking the scheduler again
error: dependency 'whsy39g91p7r4v2ljh12sikxf8ny1dyb-nixos-test-driver-systemd-abstraction.drv' failed
failed eval checks.aarch64-linux.nixos-test-password-store-mounts —
error: … while evaluating the attribute 'drvPath' at «https://releases.nixos.org/nixos/26.05/nixos-26.05.11045.774debe7a0d1/nixexprs.tar.xz?narH …
error:
       … while evaluating the attribute 'drvPath'
         at «https://releases.nixos.org/nixos/26.05/nixos-26.05.11045.774debe7a0d1/nixexprs.tar.xz?narHash=sha256-S5MjznoY0gbQbcANPLz5RYjg%2B5/WQmFRgNbHcP%2Bydcg%3D»/lib/customisation.nix:427:7:
          426|     // {
          427|       drvPath =
             |       ^
          428|         assert condition;

       … while calling the 'derivationStrict' builtin
         at «nix-internal»/derivation-internal.nix:37:12:
           36|
           37|   strict = derivationStrict drvAttrs;
             |            ^
           38|

       … while evaluating the option `driverConfiguration.vlans':

       … while evaluating definitions from `/nix/store/csk881ggvmifg4qf1cal0r1ffflbmlhp-source/nixos/lib/testing/driver-configuration.nix':

       … while evaluating the option `nodes.machine.networking.interfaces':

       … while evaluating definitions from `/nix/store/csk881ggvmifg4qf1cal0r1ffflbmlhp-source/nixos/modules/hardware/facter/networking':

       … while evaluating the option `nodes.machine.hardware.facter.enable':

       … while evaluating the option `nodes.machine.hardware.facter.report':

       … while evaluating the option `nodes.machine.hardware.facter.reportPath':

       … while evaluating definitions from `/nix/store/jm2474ca2cbmwz6000ap53xbaa56qifj-source/nixosModules/clanCore/nixos-facter.nix':

       (stack trace truncated; use '--show-trace' to show the full, detailed trace)

       error: build of '/nix/store/f3zzvddf2jfahb56201p48pfrxvn9qkr-merged-test-dir-nixos-test-password-store-mounts.drv^out' failed: error: gave up after 9 reschedules
failed eval checks.aarch64-linux.p2p-ssh-iroh —
error: … while evaluating the attribute 'drvPath' at «https://releases.nixos.org/nixos/26.05/nixos-26.05.11045.774debe7a0d1/nixexprs.tar.xz?narH …
error:
       … while evaluating the attribute 'drvPath'
         at «https://releases.nixos.org/nixos/26.05/nixos-26.05.11045.774debe7a0d1/nixexprs.tar.xz?narHash=sha256-S5MjznoY0gbQbcANPLz5RYjg%2B5/WQmFRgNbHcP%2Bydcg%3D»/lib/customisation.nix:427:7:
          426|     // {
          427|       drvPath =
             |       ^
          428|         assert condition;

       … while calling the 'derivationStrict' builtin
         at «nix-internal»/derivation-internal.nix:37:12:
           36|
           37|   strict = derivationStrict drvAttrs;
             |            ^
           38|

       … while evaluating the option `nodes.client.networking.interfaces':

       … while evaluating definitions from `/nix/store/csk881ggvmifg4qf1cal0r1ffflbmlhp-source/nixos/modules/hardware/facter/networking':

       … while evaluating the option `nodes.client.hardware.facter.enable':

       … while evaluating the option `nodes.client.hardware.facter.report':

       … while evaluating the option `nodes.client.hardware.facter.reportPath':

       … while evaluating definitions from `/nix/store/jm2474ca2cbmwz6000ap53xbaa56qifj-source/nixosModules/clanCore/nixos-facter.nix':

       (stack trace truncated; use '--show-trace' to show the full, detailed trace)

       error: build of '/nix/store/66ndbbglvmibsd07r7ajj48sdckr2kcz-merged-test-dir-clan-test-p2p-ssh-iroh.drv^out' failed: error: error: gRPC BuildDerivation on 'nix-store.geninf.io:50051' failed: build-x86-01: missing: /nix/store/66ndbbglvmibsd07r7ajj48sdckr2kcz-merged-test-dir-clan-test-p2p-ssh-iroh.drv
failed eval checks.aarch64-linux.pki —
error: … while evaluating the attribute 'drvPath' at «https://releases.nixos.org/nixos/26.05/nixos-26.05.11045.774debe7a0d1/nixexprs.tar.xz?narH …
error:
       … while evaluating the attribute 'drvPath'
         at «https://releases.nixos.org/nixos/26.05/nixos-26.05.11045.774debe7a0d1/nixexprs.tar.xz?narHash=sha256-S5MjznoY0gbQbcANPLz5RYjg%2B5/WQmFRgNbHcP%2Bydcg%3D»/lib/customisation.nix:427:7:
          426|     // {
          427|       drvPath =
             |       ^
          428|         assert condition;

       … while calling the 'derivationStrict' builtin
         at «nix-internal»/derivation-internal.nix:37:12:
           36|
           37|   strict = derivationStrict drvAttrs;
             |            ^
           38|

       … while evaluating the option `driverConfiguration.vlans':

       … while evaluating definitions from `/nix/store/csk881ggvmifg4qf1cal0r1ffflbmlhp-source/nixos/lib/testing/driver-configuration.nix':

       … while evaluating the option `nodes.caddy.networking.interfaces':

       … while evaluating definitions from `/nix/store/csk881ggvmifg4qf1cal0r1ffflbmlhp-source/nixos/modules/hardware/facter/networking':

       … while evaluating the option `nodes.caddy.hardware.facter.enable':

       … while evaluating the option `nodes.caddy.hardware.facter.report':

       … while evaluating the option `nodes.caddy.hardware.facter.reportPath':

       … while evaluating definitions from `/nix/store/jm2474ca2cbmwz6000ap53xbaa56qifj-source/nixosModules/clanCore/nixos-facter.nix':

       (stack trace truncated; use '--show-trace' to show the full, detailed trace)

       error: build of '/nix/store/jifhxdzffi03r9ax3ri3nqdg8rcg62ax-merged-test-dir-pki.drv^out' failed: error: error: gRPC BuildDerivation on 'nix-store.geninf.io:50051' failed: build-x86-01: missing: /nix/store/jifhxdzffi03r9ax3ri3nqdg8rcg62ax-merged-test-dir-pki.drv
failed eval checks.aarch64-linux.service-dummy-test —
error: … while evaluating the attribute 'drvPath' at «https://releases.nixos.org/nixos/26.05/nixos-26.05.11045.774debe7a0d1/nixexprs.tar.xz?narH …
error:
       … while evaluating the attribute 'drvPath'
         at «https://releases.nixos.org/nixos/26.05/nixos-26.05.11045.774debe7a0d1/nixexprs.tar.xz?narHash=sha256-S5MjznoY0gbQbcANPLz5RYjg%2B5/WQmFRgNbHcP%2Bydcg%3D»/lib/customisation.nix:427:7:
          426|     // {
          427|       drvPath =
             |       ^
          428|         assert condition;

       … while calling the 'derivationStrict' builtin
         at «nix-internal»/derivation-internal.nix:37:12:
           36|
           37|   strict = derivationStrict drvAttrs;
             |            ^
           38|

       … while evaluating the option `nodes.admin1.networking.interfaces':

       … while evaluating definitions from `/nix/store/csk881ggvmifg4qf1cal0r1ffflbmlhp-source/nixos/modules/hardware/facter/networking':

       … while evaluating the option `nodes.admin1.hardware.facter.enable':

       … while evaluating the option `nodes.admin1.hardware.facter.report':

       … while evaluating the option `nodes.admin1.hardware.facter.reportPath':

       … while evaluating definitions from `/nix/store/jm2474ca2cbmwz6000ap53xbaa56qifj-source/nixosModules/clanCore/nixos-facter.nix':

       (stack trace truncated; use '--show-trace' to show the full, detailed trace)

       error: build of '/nix/store/93r99wqlyhxzhj15ga3hbs1inkv5rq1w-merged-test-dir-service-dummy-test.drv^out' failed: error: gave up after 9 reschedules
failed eval checks.aarch64-linux.service-dummy-test-from-flake —
error: … while evaluating the attribute 'drvPath' at «https://releases.nixos.org/nixos/26.05/nixos-26.05.11045.774debe7a0d1/nixexprs.tar.xz?narH …
error:
       … while evaluating the attribute 'drvPath'
         at «https://releases.nixos.org/nixos/26.05/nixos-26.05.11045.774debe7a0d1/nixexprs.tar.xz?narHash=sha256-S5MjznoY0gbQbcANPLz5RYjg%2B5/WQmFRgNbHcP%2Bydcg%3D»/lib/customisation.nix:427:7:
          426|     // {
          427|       drvPath =
             |       ^
          428|         assert condition;

       … while calling the 'derivationStrict' builtin
         at «nix-internal»/derivation-internal.nix:37:12:
           36|
           37|   strict = derivationStrict drvAttrs;
             |            ^
           38|

       … while evaluating the option `nodes.admin1.networking.interfaces':

       … while evaluating definitions from `/nix/store/csk881ggvmifg4qf1cal0r1ffflbmlhp-source/nixos/modules/hardware/facter/networking':

       … while evaluating the option `nodes.admin1.hardware.facter.enable':

       … while evaluating the option `nodes.admin1.hardware.facter.report':

       … while evaluating the option `nodes.admin1.hardware.facter.reportPath':

       … while evaluating definitions from `/nix/store/jm2474ca2cbmwz6000ap53xbaa56qifj-source/nixosModules/clanCore/nixos-facter.nix':

       (stack trace truncated; use '--show-trace' to show the full, detailed trace)

       error: build of '/nix/store/qsfzrf8p2qb5lhr0nf2j11s5gyi38qbl-merged-test-dir-service-dummy-test-from-flake.drv^out' failed: error: error: gRPC BuildDerivation on 'nix-store.geninf.io:50051' failed: build-x86-01: missing: /nix/store/qsfzrf8p2qb5lhr0nf2j11s5gyi38qbl-merged-test-dir-service-dummy-test-from-flake.drv
failed eval checks.aarch64-linux.syncthing-service —
error: … while evaluating the attribute 'drvPath' at «https://releases.nixos.org/nixos/26.05/nixos-26.05.11045.774debe7a0d1/nixexprs.tar.xz?narH …
error:
       … while evaluating the attribute 'drvPath'
         at «https://releases.nixos.org/nixos/26.05/nixos-26.05.11045.774debe7a0d1/nixexprs.tar.xz?narHash=sha256-S5MjznoY0gbQbcANPLz5RYjg%2B5/WQmFRgNbHcP%2Bydcg%3D»/lib/customisation.nix:427:7:
          426|     // {
          427|       drvPath =
             |       ^
          428|         assert condition;

       … while calling the 'derivationStrict' builtin
         at «nix-internal»/derivation-internal.nix:37:12:
           36|
           37|   strict = derivationStrict drvAttrs;
             |            ^
           38|

       … while evaluating the option `nodes.machine1.networking.interfaces':

       … while evaluating definitions from `/nix/store/csk881ggvmifg4qf1cal0r1ffflbmlhp-source/nixos/modules/hardware/facter/networking':

       … while evaluating the option `nodes.machine1.hardware.facter.enable':

       … while evaluating the option `nodes.machine1.hardware.facter.report':

       … while evaluating the option `nodes.machine1.hardware.facter.reportPath':

       … while evaluating definitions from `/nix/store/jm2474ca2cbmwz6000ap53xbaa56qifj-source/nixosModules/clanCore/nixos-facter.nix':

       (stack trace truncated; use '--show-trace' to show the full, detailed trace)

       error: build of '/nix/store/8ixbnwzwsadhimss7kqf9qm86dgjzchh-merged-test-dir-syncthing-service.drv^out' failed: error: gave up after 9 reschedules
failed checks.aarch64-linux.treefmt 19s
setup: 0ys60iyy5cddxwr4hmq619qqwav8fdvn-treefmt-check.drv: build01: build01: input not substitutable: error: some references of path '/nix/store/nq7qhm9f18ilkx5 …
setup:
0ys60iyy5cddxwr4hmq619qqwav8fdvn-treefmt-check.drv: build01: build01: input not substitutable: error: some references of path '/nix/store/nq7qhm9f18ilkx5ffi48gs0sfyxzcgs2-treefmt' could not be realised, asking the scheduler again
0ys60iyy5cddxwr4hmq619qqwav8fdvn-treefmt-check.drv: build01: build01: input not substitutable: error: some references of path '/nix/store/nq7qhm9f18ilkx5ffi48gs0sfyxzcgs2-treefmt' could not be realised, asking the scheduler again
0ys60iyy5cddxwr4hmq619qqwav8fdvn-treefmt-check.drv: build01: build01: input not substitutable: error: some references of path '/nix/store/nq7qhm9f18ilkx5ffi48gs0sfyxzcgs2-treefmt' could not be realised, asking the scheduler again
0ys60iyy5cddxwr4hmq619qqwav8fdvn-treefmt-check.drv: build01: build01: input not substitutable: error: some references of path '/nix/store/nq7qhm9f18ilkx5ffi48gs0sfyxzcgs2-treefmt' could not be realised, asking the scheduler again
0ys60iyy5cddxwr4hmq619qqwav8fdvn-treefmt-check.drv: build01: build01: input not substitutable: error: some references of path '/nix/store/nq7qhm9f18ilkx5ffi48gs0sfyxzcgs2-treefmt' could not be realised, asking the scheduler again
0ys60iyy5cddxwr4hmq619qqwav8fdvn-treefmt-check.drv: build01: build01: input not substitutable: error: some references of path '/nix/store/nq7qhm9f18ilkx5ffi48gs0sfyxzcgs2-treefmt' could not be realised, asking the scheduler again
0ys60iyy5cddxwr4hmq619qqwav8fdvn-treefmt-check.drv: build01: build01: input not substitutable: error: some references of path '/nix/store/nq7qhm9f18ilkx5ffi48gs0sfyxzcgs2-treefmt' could not be realised, asking the scheduler again
error: gave up after 9 reschedules
failed eval checks.aarch64-linux.users —
error: … while evaluating the attribute 'drvPath' at «https://releases.nixos.org/nixos/26.05/nixos-26.05.11045.774debe7a0d1/nixexprs.tar.xz?narH …
error:
       … while evaluating the attribute 'drvPath'
         at «https://releases.nixos.org/nixos/26.05/nixos-26.05.11045.774debe7a0d1/nixexprs.tar.xz?narHash=sha256-S5MjznoY0gbQbcANPLz5RYjg%2B5/WQmFRgNbHcP%2Bydcg%3D»/lib/customisation.nix:427:7:
          426|     // {
          427|       drvPath =
             |       ^
          428|         assert condition;

       … while calling the 'derivationStrict' builtin
         at «nix-internal»/derivation-internal.nix:37:12:
           36|
           37|   strict = derivationStrict drvAttrs;
             |            ^
           38|

       … while evaluating the option `nodes.server.networking.interfaces':

       … while evaluating definitions from `/nix/store/csk881ggvmifg4qf1cal0r1ffflbmlhp-source/nixos/modules/hardware/facter/networking':

       … while evaluating the option `nodes.server.hardware.facter.enable':

       … while evaluating the option `nodes.server.hardware.facter.report':

       … while evaluating the option `nodes.server.hardware.facter.reportPath':

       … while evaluating definitions from `/nix/store/jm2474ca2cbmwz6000ap53xbaa56qifj-source/nixosModules/clanCore/nixos-facter.nix':

       (stack trace truncated; use '--show-trace' to show the full, detailed trace)

       error: build of '/nix/store/rx39mmxfmdxw2hp0hy63igdj7q0j0mqw-merged-test-dir-users.drv^out' failed: error: gave up after 9 reschedules
failed eval checks.aarch64-linux.wireguard —
error: … while evaluating the attribute 'drvPath' at «https://releases.nixos.org/nixos/26.05/nixos-26.05.11045.774debe7a0d1/nixexprs.tar.xz?narH …
error:
       … while evaluating the attribute 'drvPath'
         at «https://releases.nixos.org/nixos/26.05/nixos-26.05.11045.774debe7a0d1/nixexprs.tar.xz?narHash=sha256-S5MjznoY0gbQbcANPLz5RYjg%2B5/WQmFRgNbHcP%2Bydcg%3D»/lib/customisation.nix:427:7:
          426|     // {
          427|       drvPath =
             |       ^
          428|         assert condition;

       … while calling the 'derivationStrict' builtin
         at «nix-internal»/derivation-internal.nix:37:12:
           36|
           37|   strict = derivationStrict drvAttrs;
             |            ^
           38|

       … while evaluating the option `nodes.controller1.networking.interfaces':

       … while evaluating definitions from `/nix/store/csk881ggvmifg4qf1cal0r1ffflbmlhp-source/nixos/modules/hardware/facter/networking':

       … while evaluating the option `nodes.controller1.hardware.facter.enable':

       … while evaluating the option `nodes.controller1.hardware.facter.report':

       … while evaluating the option `nodes.controller1.hardware.facter.reportPath':

       … while evaluating definitions from `/nix/store/jm2474ca2cbmwz6000ap53xbaa56qifj-source/nixosModules/clanCore/nixos-facter.nix':

       (stack trace truncated; use '--show-trace' to show the full, detailed trace)

       error: build of '/nix/store/k99w3l2gf1wlzjh8lihbaw1rh078jaka-merged-test-dir-wireguard.drv^out' failed: error: gave up after 9 reschedules
failed eval checks.aarch64-linux.zerotier —
error: … while evaluating the attribute 'drvPath' at «https://releases.nixos.org/nixos/26.05/nixos-26.05.11045.774debe7a0d1/nixexprs.tar.xz?narH …
error:
       … while evaluating the attribute 'drvPath'
         at «https://releases.nixos.org/nixos/26.05/nixos-26.05.11045.774debe7a0d1/nixexprs.tar.xz?narHash=sha256-S5MjznoY0gbQbcANPLz5RYjg%2B5/WQmFRgNbHcP%2Bydcg%3D»/lib/customisation.nix:427:7:
          426|     // {
          427|       drvPath =
             |       ^
          428|         assert condition;

       … while calling the 'derivationStrict' builtin
         at «nix-internal»/derivation-internal.nix:37:12:
           36|
           37|   strict = derivationStrict drvAttrs;
             |            ^
           38|

       … while evaluating the option `driverConfiguration.vlans':

       … while evaluating definitions from `/nix/store/csk881ggvmifg4qf1cal0r1ffflbmlhp-source/nixos/lib/testing/driver-configuration.nix':

       … while evaluating the option `nodes.controller.networking.interfaces':

       … while evaluating definitions from `/nix/store/csk881ggvmifg4qf1cal0r1ffflbmlhp-source/nixos/modules/hardware/facter/networking':

       … while evaluating the option `nodes.controller.hardware.facter.enable':

       … while evaluating the option `nodes.controller.hardware.facter.report':

       … while evaluating the option `nodes.controller.hardware.facter.reportPath':

       … while evaluating definitions from `/nix/store/jm2474ca2cbmwz6000ap53xbaa56qifj-source/nixosModules/clanCore/nixos-facter.nix':

       (stack trace truncated; use '--show-trace' to show the full, detailed trace)

       error: build of '/nix/store/plrafijfzclzss9dl00yfdm906l5p3xx-merged-test-dir-zerotier.drv^out' failed: error: gave up after 9 reschedules
failed eval checks.aarch64-linux.zerotier-multi-instance —
error: … while evaluating the attribute 'drvPath' at «https://releases.nixos.org/nixos/26.05/nixos-26.05.11045.774debe7a0d1/nixexprs.tar.xz?narH …
error:
       … while evaluating the attribute 'drvPath'
         at «https://releases.nixos.org/nixos/26.05/nixos-26.05.11045.774debe7a0d1/nixexprs.tar.xz?narHash=sha256-S5MjznoY0gbQbcANPLz5RYjg%2B5/WQmFRgNbHcP%2Bydcg%3D»/lib/customisation.nix:427:7:
          426|     // {
          427|       drvPath =
             |       ^
          428|         assert condition;

       … while calling the 'derivationStrict' builtin
         at «nix-internal»/derivation-internal.nix:37:12:
           36|
           37|   strict = derivationStrict drvAttrs;
             |            ^
           38|

       … while evaluating the option `driverConfiguration.vlans':

       … while evaluating definitions from `/nix/store/csk881ggvmifg4qf1cal0r1ffflbmlhp-source/nixos/lib/testing/driver-configuration.nix':

       … while evaluating the option `nodes.alpha.networking.interfaces':

       … while evaluating definitions from `/nix/store/csk881ggvmifg4qf1cal0r1ffflbmlhp-source/nixos/modules/hardware/facter/networking':

       … while evaluating the option `nodes.alpha.hardware.facter.enable':

       … while evaluating the option `nodes.alpha.hardware.facter.report':

       … while evaluating the option `nodes.alpha.hardware.facter.reportPath':

       … while evaluating definitions from `/nix/store/jm2474ca2cbmwz6000ap53xbaa56qifj-source/nixosModules/clanCore/nixos-facter.nix':

       (stack trace truncated; use '--show-trace' to show the full, detailed trace)

       error: build of '/nix/store/gb0pvdh3p89c6fjyqzfav5y3w7dlns4m-merged-test-dir-zerotier-multi-instance.drv^out' failed: error: error: gRPC BuildDerivation on 'nix-store.geninf.io:50051' failed: build-x86-01: missing: /nix/store/gb0pvdh3p89c6fjyqzfav5y3w7dlns4m-merged-test-dir-zerotier-multi-instance.drv
failed eval checks.x86_64-linux.borgbackup —
error: … while evaluating the attribute 'drvPath' at «https://releases.nixos.org/nixos/26.05/nixos-26.05.11045.774debe7a0d1/nixexprs.tar.xz?narH …
error:
       … while evaluating the attribute 'drvPath'
         at «https://releases.nixos.org/nixos/26.05/nixos-26.05.11045.774debe7a0d1/nixexprs.tar.xz?narHash=sha256-S5MjznoY0gbQbcANPLz5RYjg%2B5/WQmFRgNbHcP%2Bydcg%3D»/lib/customisation.nix:427:7:
          426|     // {
          427|       drvPath =
             |       ^
          428|         assert condition;

       … while calling the 'derivationStrict' builtin
         at «nix-internal»/derivation-internal.nix:37:12:
           36|
           37|   strict = derivationStrict drvAttrs;
             |            ^
           38|

       … while evaluating the option `nodes.clientone.networking.interfaces':

       … while evaluating definitions from `/nix/store/csk881ggvmifg4qf1cal0r1ffflbmlhp-source/nixos/modules/hardware/facter/networking':

       … while evaluating the option `nodes.clientone.hardware.facter.enable':

       … while evaluating the option `nodes.clientone.hardware.facter.report':

       … while evaluating the option `nodes.clientone.hardware.facter.reportPath':

       … while evaluating definitions from `/nix/store/jm2474ca2cbmwz6000ap53xbaa56qifj-source/nixosModules/clanCore/nixos-facter.nix':

       (stack trace truncated; use '--show-trace' to show the full, detailed trace)

       error: build of '/nix/store/c20nf5ixxlkl98byh90mdyscphw2i96v-merged-test-dir-borgbackup.drv^out' failed: error: gave up after 9 reschedules
failed eval checks.x86_64-linux.certificates —
error: … while evaluating the attribute 'drvPath' at «https://releases.nixos.org/nixos/26.05/nixos-26.05.11045.774debe7a0d1/nixexprs.tar.xz?narH …
error:
       … while evaluating the attribute 'drvPath'
         at «https://releases.nixos.org/nixos/26.05/nixos-26.05.11045.774debe7a0d1/nixexprs.tar.xz?narHash=sha256-S5MjznoY0gbQbcANPLz5RYjg%2B5/WQmFRgNbHcP%2Bydcg%3D»/lib/customisation.nix:427:7:
          426|     // {
          427|       drvPath =
             |       ^
          428|         assert condition;

       … while calling the 'derivationStrict' builtin
         at «nix-internal»/derivation-internal.nix:37:12:
           36|
           37|   strict = derivationStrict drvAttrs;
             |            ^
           38|

       … while evaluating the option `nodes.ca.networking.interfaces':

       … while evaluating definitions from `/nix/store/csk881ggvmifg4qf1cal0r1ffflbmlhp-source/nixos/modules/hardware/facter/networking':

       … while evaluating the option `nodes.ca.hardware.facter.enable':

       … while evaluating the option `nodes.ca.hardware.facter.report':

       … while evaluating the option `nodes.ca.hardware.facter.reportPath':

       … while evaluating definitions from `/nix/store/jm2474ca2cbmwz6000ap53xbaa56qifj-source/nixosModules/clanCore/nixos-facter.nix':

       (stack trace truncated; use '--show-trace' to show the full, detailed trace)

       error: build of '/nix/store/2sfs7lp26wpjls0kgvikwkqadn400rph-merged-test-dir-certificates.drv^out' failed: error: error: gRPC BuildDerivation on 'nix-store.geninf.io:50051' failed: build-x86-01: missing: /nix/store/2sfs7lp26wpjls0kgvikwkqadn400rph-merged-test-dir-certificates.drv
failed eval checks.x86_64-linux.clan-test-update —
error: … while evaluating the attribute 'drvPath' at «https://releases.nixos.org/nixos/26.05/nixos-26.05.11045.774debe7a0d1/nixexprs.tar.xz?narH …
error:
       … while evaluating the attribute 'drvPath'
         at «https://releases.nixos.org/nixos/26.05/nixos-26.05.11045.774debe7a0d1/nixexprs.tar.xz?narHash=sha256-S5MjznoY0gbQbcANPLz5RYjg%2B5/WQmFRgNbHcP%2Bydcg%3D»/lib/customisation.nix:427:7:
          426|     // {
          427|       drvPath =
             |       ^
          428|         assert condition;

       … while calling the 'derivationStrict' builtin
         at «nix-internal»/derivation-internal.nix:37:12:
           36|
           37|   strict = derivationStrict drvAttrs;
             |            ^
           38|

       … while evaluating the option `nodes.test-update-machine.networking.interfaces':

       … while evaluating definitions from `/nix/store/csk881ggvmifg4qf1cal0r1ffflbmlhp-source/nixos/modules/hardware/facter/networking':

       … while evaluating the option `nodes.test-update-machine.hardware.facter.enable':

       … while evaluating the option `nodes.test-update-machine.hardware.facter.report':

       … while evaluating the option `nodes.test-update-machine.hardware.facter.reportPath':

       … while evaluating definitions from `/nix/store/jm2474ca2cbmwz6000ap53xbaa56qifj-source/nixosModules/clanCore/nixos-facter.nix':

       (stack trace truncated; use '--show-trace' to show the full, detailed trace)

       error: build of '/nix/store/3ny5bysiwfn40mfsp9682fq77wi4dvpl-merged-test-dir-clan-test-update.drv^out' failed: error: gave up after 9 reschedules
failed eval checks.x86_64-linux.data-mesher —
error: … while evaluating the attribute 'drvPath' at «https://releases.nixos.org/nixos/26.05/nixos-26.05.11045.774debe7a0d1/nixexprs.tar.xz?narH …
error:
       … while evaluating the attribute 'drvPath'
         at «https://releases.nixos.org/nixos/26.05/nixos-26.05.11045.774debe7a0d1/nixexprs.tar.xz?narHash=sha256-S5MjznoY0gbQbcANPLz5RYjg%2B5/WQmFRgNbHcP%2Bydcg%3D»/lib/customisation.nix:427:7:
          426|     // {
          427|       drvPath =
             |       ^
          428|         assert condition;

       … while calling the 'derivationStrict' builtin
         at «nix-internal»/derivation-internal.nix:37:12:
           36|
           37|   strict = derivationStrict drvAttrs;
             |            ^
           38|

       … while evaluating the option `nodes.alpha.networking.interfaces':

       … while evaluating definitions from `/nix/store/csk881ggvmifg4qf1cal0r1ffflbmlhp-source/nixos/modules/hardware/facter/networking':

       … while evaluating the option `nodes.alpha.hardware.facter.enable':

       … while evaluating the option `nodes.alpha.hardware.facter.report':

       … while evaluating the option `nodes.alpha.hardware.facter.reportPath':

       … while evaluating definitions from `/nix/store/jm2474ca2cbmwz6000ap53xbaa56qifj-source/nixosModules/clanCore/nixos-facter.nix':

       (stack trace truncated; use '--show-trace' to show the full, detailed trace)

       error: build of '/nix/store/bisdrchsk95mhvw467p4wq5b2f79msnx-merged-test-dir-data-mesher.drv^out' failed: error: error: gRPC BuildDerivation on 'nix-store.geninf.io:50051' failed: build-x86-01: missing: /nix/store/bisdrchsk95mhvw467p4wq5b2f79msnx-merged-test-dir-data-mesher.drv
failed eval checks.x86_64-linux.dm-dns —
error: … while evaluating the attribute 'drvPath' at «https://releases.nixos.org/nixos/26.05/nixos-26.05.11045.774debe7a0d1/nixexprs.tar.xz?narH …
error:
       … while evaluating the attribute 'drvPath'
         at «https://releases.nixos.org/nixos/26.05/nixos-26.05.11045.774debe7a0d1/nixexprs.tar.xz?narHash=sha256-S5MjznoY0gbQbcANPLz5RYjg%2B5/WQmFRgNbHcP%2Bydcg%3D»/lib/customisation.nix:427:7:
          426|     // {
          427|       drvPath =
             |       ^
          428|         assert condition;

       … while calling the 'derivationStrict' builtin
         at «nix-internal»/derivation-internal.nix:37:12:
           36|
           37|   strict = derivationStrict drvAttrs;
             |            ^
           38|

       … while evaluating the option `nodes.client.networking.interfaces':

       … while evaluating definitions from `/nix/store/csk881ggvmifg4qf1cal0r1ffflbmlhp-source/nixos/modules/hardware/facter/networking':

       … while evaluating the option `nodes.client.hardware.facter.enable':

       … while evaluating the option `nodes.client.hardware.facter.report':

       … while evaluating the option `nodes.client.hardware.facter.reportPath':

       … while evaluating definitions from `/nix/store/jm2474ca2cbmwz6000ap53xbaa56qifj-source/nixosModules/clanCore/nixos-facter.nix':

       (stack trace truncated; use '--show-trace' to show the full, detailed trace)

       error: build of '/nix/store/yln3f9jkdz1nwbsd4mb869zl8hfcnvyl-merged-test-dir-dm-dns.drv^out' failed: error: error: gRPC BuildDerivation on 'nix-store.geninf.io:50051' failed: build-x86-01: missing: /nix/store/yln3f9jkdz1nwbsd4mb869zl8hfcnvyl-merged-test-dir-dm-dns.drv
failed eval checks.x86_64-linux.garage —
error: … while evaluating the attribute 'drvPath' at «https://releases.nixos.org/nixos/26.05/nixos-26.05.11045.774debe7a0d1/nixexprs.tar.xz?narH …
error:
       … while evaluating the attribute 'drvPath'
         at «https://releases.nixos.org/nixos/26.05/nixos-26.05.11045.774debe7a0d1/nixexprs.tar.xz?narHash=sha256-S5MjznoY0gbQbcANPLz5RYjg%2B5/WQmFRgNbHcP%2Bydcg%3D»/lib/customisation.nix:427:7:
          426|     // {
          427|       drvPath =
             |       ^
          428|         assert condition;

       … while calling the 'derivationStrict' builtin
         at «nix-internal»/derivation-internal.nix:37:12:
           36|
           37|   strict = derivationStrict drvAttrs;
             |            ^
           38|

       … while evaluating the option `nodes.server.networking.interfaces':

       … while evaluating definitions from `/nix/store/csk881ggvmifg4qf1cal0r1ffflbmlhp-source/nixos/modules/hardware/facter/networking':

       … while evaluating the option `nodes.server.hardware.facter.enable':

       … while evaluating the option `nodes.server.hardware.facter.report':

       … while evaluating the option `nodes.server.hardware.facter.reportPath':

       … while evaluating definitions from `/nix/store/jm2474ca2cbmwz6000ap53xbaa56qifj-source/nixosModules/clanCore/nixos-facter.nix':

       (stack trace truncated; use '--show-trace' to show the full, detailed trace)

       error: build of '/nix/store/m5bznfa9ljfbjad6mr813wqn4ncj0h1c-merged-test-dir-garage.drv^out' failed: error: error: gRPC BuildDerivation on 'nix-store.geninf.io:50051' failed: build-x86-01: missing: /nix/store/m5bznfa9ljfbjad6mr813wqn4ncj0h1c-merged-test-dir-garage.drv
failed eval checks.x86_64-linux.machine-id —
error: … while evaluating the attribute 'drvPath' at «https://releases.nixos.org/nixos/26.05/nixos-26.05.11045.774debe7a0d1/nixexprs.tar.xz?narH …
error:
       … while evaluating the attribute 'drvPath'
         at «https://releases.nixos.org/nixos/26.05/nixos-26.05.11045.774debe7a0d1/nixexprs.tar.xz?narHash=sha256-S5MjznoY0gbQbcANPLz5RYjg%2B5/WQmFRgNbHcP%2Bydcg%3D»/lib/customisation.nix:427:7:
          426|     // {
          427|       drvPath =
             |       ^
          428|         assert condition;

       … while calling the 'derivationStrict' builtin
         at «nix-internal»/derivation-internal.nix:37:12:
           36|
           37|   strict = derivationStrict drvAttrs;
             |            ^
           38|

       … while evaluating the option `nodes.server.networking.interfaces':

       … while evaluating definitions from `/nix/store/csk881ggvmifg4qf1cal0r1ffflbmlhp-source/nixos/modules/hardware/facter/networking':

       … while evaluating the option `nodes.server.hardware.facter.enable':

       … while evaluating the option `nodes.server.hardware.facter.report':

       … while evaluating the option `nodes.server.hardware.facter.reportPath':

       … while evaluating definitions from `/nix/store/jm2474ca2cbmwz6000ap53xbaa56qifj-source/nixosModules/clanCore/nixos-facter.nix':

       (stack trace truncated; use '--show-trace' to show the full, detailed trace)

       error: build of '/nix/store/1aw9g733adh7hh3dcxcs1bmkzhb8izr1-merged-test-dir-service-machine-id.drv^out' failed: error: gave up after 9 reschedules
failed eval checks.x86_64-linux.matrix-synapse —
error: … while evaluating the attribute 'drvPath' at «https://releases.nixos.org/nixos/26.05/nixos-26.05.11045.774debe7a0d1/nixexprs.tar.xz?narH …
error:
       … while evaluating the attribute 'drvPath'
         at «https://releases.nixos.org/nixos/26.05/nixos-26.05.11045.774debe7a0d1/nixexprs.tar.xz?narHash=sha256-S5MjznoY0gbQbcANPLz5RYjg%2B5/WQmFRgNbHcP%2Bydcg%3D»/lib/customisation.nix:427:7:
          426|     // {
          427|       drvPath =
             |       ^
          428|         assert condition;

       … while calling the 'derivationStrict' builtin
         at «nix-internal»/derivation-internal.nix:37:12:
           36|
           37|   strict = derivationStrict drvAttrs;
             |            ^
           38|

       … while evaluating the option `nodes.machine.networking.interfaces':

       … while evaluating definitions from `/nix/store/csk881ggvmifg4qf1cal0r1ffflbmlhp-source/nixos/modules/hardware/facter/networking':

       … while evaluating the option `nodes.machine.hardware.facter.enable':

       … while evaluating the option `nodes.machine.hardware.facter.report':

       … while evaluating the option `nodes.machine.hardware.facter.reportPath':

       … while evaluating definitions from `/nix/store/jm2474ca2cbmwz6000ap53xbaa56qifj-source/nixosModules/clanCore/nixos-facter.nix':

       (stack trace truncated; use '--show-trace' to show the full, detailed trace)

       error: build of '/nix/store/1k4q4h7b0264nnw73rgmiyag11gv3b9k-merged-test-dir-matrix-synapse.drv^out' failed: error: error: gRPC BuildDerivation on 'nix-store.geninf.io:50051' failed: build-x86-01: missing: /nix/store/1k4q4h7b0264nnw73rgmiyag11gv3b9k-merged-test-dir-matrix-synapse.drv
failed eval checks.x86_64-linux.monitoring —
error: … while evaluating the attribute 'drvPath' at «https://releases.nixos.org/nixos/26.05/nixos-26.05.11045.774debe7a0d1/nixexprs.tar.xz?narH …
error:
       … while evaluating the attribute 'drvPath'
         at «https://releases.nixos.org/nixos/26.05/nixos-26.05.11045.774debe7a0d1/nixexprs.tar.xz?narHash=sha256-S5MjznoY0gbQbcANPLz5RYjg%2B5/WQmFRgNbHcP%2Bydcg%3D»/lib/customisation.nix:427:7:
          426|     // {
          427|       drvPath =
             |       ^
          428|         assert condition;

       … while calling the 'derivationStrict' builtin
         at «nix-internal»/derivation-internal.nix:37:12:
           36|
           37|   strict = derivationStrict drvAttrs;
             |            ^
           38|

       … while evaluating the option `nodes.machine1.networking.interfaces':

       … while evaluating definitions from `/nix/store/csk881ggvmifg4qf1cal0r1ffflbmlhp-source/nixos/modules/hardware/facter/networking':

       … while evaluating the option `nodes.machine1.hardware.facter.enable':

       … while evaluating the option `nodes.machine1.hardware.facter.report':

       … while evaluating the option `nodes.machine1.hardware.facter.reportPath':

       … while evaluating definitions from `/nix/store/jm2474ca2cbmwz6000ap53xbaa56qifj-source/nixosModules/clanCore/nixos-facter.nix':

       (stack trace truncated; use '--show-trace' to show the full, detailed trace)

       error: build of '/nix/store/w7lsmv9zb3ng21k9akkmgq342l47ylf2-merged-test-dir-monitoring.drv^out' failed: error: error: gRPC BuildDerivation on 'nix-store.geninf.io:50051' failed: build-x86-01: missing: /nix/store/w7lsmv9zb3ng21k9akkmgq342l47ylf2-merged-test-dir-monitoring.drv
failed eval checks.x86_64-linux.mycelium —
error: … while evaluating the attribute 'drvPath' at «https://releases.nixos.org/nixos/26.05/nixos-26.05.11045.774debe7a0d1/nixexprs.tar.xz?narH …
error:
       … while evaluating the attribute 'drvPath'
         at «https://releases.nixos.org/nixos/26.05/nixos-26.05.11045.774debe7a0d1/nixexprs.tar.xz?narHash=sha256-S5MjznoY0gbQbcANPLz5RYjg%2B5/WQmFRgNbHcP%2Bydcg%3D»/lib/customisation.nix:427:7:
          426|     // {
          427|       drvPath =
             |       ^
          428|         assert condition;

       … while calling the 'derivationStrict' builtin
         at «nix-internal»/derivation-internal.nix:37:12:
           36|
           37|   strict = derivationStrict drvAttrs;
             |            ^
           38|

       … while evaluating the option `driverConfiguration.vlans':

       … while evaluating definitions from `/nix/store/csk881ggvmifg4qf1cal0r1ffflbmlhp-source/nixos/lib/testing/driver-configuration.nix':

       … while evaluating the option `nodes.server.networking.interfaces':

       … while evaluating definitions from `/nix/store/csk881ggvmifg4qf1cal0r1ffflbmlhp-source/nixos/modules/hardware/facter/networking':

       … while evaluating the option `nodes.server.hardware.facter.enable':

       … while evaluating the option `nodes.server.hardware.facter.report':

       … while evaluating the option `nodes.server.hardware.facter.reportPath':

       … while evaluating definitions from `/nix/store/jm2474ca2cbmwz6000ap53xbaa56qifj-source/nixosModules/clanCore/nixos-facter.nix':

       (stack trace truncated; use '--show-trace' to show the full, detailed trace)

       error: build of '/nix/store/wrfb0i91rk06qpfq4p27lyskcqjlvfl6-merged-test-dir-mycelium.drv^out' failed: error: error: gRPC BuildDerivation on 'nix-store.geninf.io:50051' failed: build-x86-01: missing: /nix/store/wrfb0i91rk06qpfq4p27lyskcqjlvfl6-merged-test-dir-mycelium.drv
failed eval checks.x86_64-linux.ncps —
error: … while evaluating the attribute 'drvPath' at «https://releases.nixos.org/nixos/26.05/nixos-26.05.11045.774debe7a0d1/nixexprs.tar.xz?narH …
error:
       … while evaluating the attribute 'drvPath'
         at «https://releases.nixos.org/nixos/26.05/nixos-26.05.11045.774debe7a0d1/nixexprs.tar.xz?narHash=sha256-S5MjznoY0gbQbcANPLz5RYjg%2B5/WQmFRgNbHcP%2Bydcg%3D»/lib/customisation.nix:427:7:
          426|     // {
          427|       drvPath =
             |       ^
          428|         assert condition;

       … while calling the 'derivationStrict' builtin
         at «nix-internal»/derivation-internal.nix:37:12:
           36|
           37|   strict = derivationStrict drvAttrs;
             |            ^
           38|

       … while evaluating the option `nodes.alice.networking.interfaces':

       … while evaluating definitions from `/nix/store/csk881ggvmifg4qf1cal0r1ffflbmlhp-source/nixos/modules/hardware/facter/networking':

       … while evaluating the option `nodes.alice.hardware.facter.enable':

       … while evaluating the option `nodes.alice.hardware.facter.report':

       … while evaluating the option `nodes.alice.hardware.facter.reportPath':

       … while evaluating definitions from `/nix/store/jm2474ca2cbmwz6000ap53xbaa56qifj-source/nixosModules/clanCore/nixos-facter.nix':

       (stack trace truncated; use '--show-trace' to show the full, detailed trace)

       error: build of '/nix/store/0b9va4azqjj9ka1fylgah8qwbq7xx0l5-merged-test-dir-ncps.drv^out' failed: error: error: gRPC BuildDerivation on 'nix-store.geninf.io:50051' failed: build-x86-01: missing: /nix/store/0b9va4azqjj9ka1fylgah8qwbq7xx0l5-merged-test-dir-ncps.drv
failed eval checks.x86_64-linux.nixos-test-password-store-mounts —
error: … while evaluating the attribute 'drvPath' at «https://releases.nixos.org/nixos/26.05/nixos-26.05.11045.774debe7a0d1/nixexprs.tar.xz?narH …
error:
       … while evaluating the attribute 'drvPath'
         at «https://releases.nixos.org/nixos/26.05/nixos-26.05.11045.774debe7a0d1/nixexprs.tar.xz?narHash=sha256-S5MjznoY0gbQbcANPLz5RYjg%2B5/WQmFRgNbHcP%2Bydcg%3D»/lib/customisation.nix:427:7:
          426|     // {
          427|       drvPath =
             |       ^
          428|         assert condition;

       … while calling the 'derivationStrict' builtin
         at «nix-internal»/derivation-internal.nix:37:12:
           36|
           37|   strict = derivationStrict drvAttrs;
             |            ^
           38|

       … while evaluating the option `driverConfiguration.vlans':

       … while evaluating definitions from `/nix/store/csk881ggvmifg4qf1cal0r1ffflbmlhp-source/nixos/lib/testing/driver-configuration.nix':

       … while evaluating the option `nodes.machine.networking.interfaces':

       … while evaluating definitions from `/nix/store/csk881ggvmifg4qf1cal0r1ffflbmlhp-source/nixos/modules/hardware/facter/networking':

       … while evaluating the option `nodes.machine.hardware.facter.enable':

       … while evaluating the option `nodes.machine.hardware.facter.report':

       … while evaluating the option `nodes.machine.hardware.facter.reportPath':

       … while evaluating definitions from `/nix/store/jm2474ca2cbmwz6000ap53xbaa56qifj-source/nixosModules/clanCore/nixos-facter.nix':

       (stack trace truncated; use '--show-trace' to show the full, detailed trace)

       error: build of '/nix/store/f3zzvddf2jfahb56201p48pfrxvn9qkr-merged-test-dir-nixos-test-password-store-mounts.drv^out' failed: error: gave up after 9 reschedules
failed eval checks.x86_64-linux.p2p-ssh-iroh —
error: … while evaluating the attribute 'drvPath' at «https://releases.nixos.org/nixos/26.05/nixos-26.05.11045.774debe7a0d1/nixexprs.tar.xz?narH …
error:
       … while evaluating the attribute 'drvPath'
         at «https://releases.nixos.org/nixos/26.05/nixos-26.05.11045.774debe7a0d1/nixexprs.tar.xz?narHash=sha256-S5MjznoY0gbQbcANPLz5RYjg%2B5/WQmFRgNbHcP%2Bydcg%3D»/lib/customisation.nix:427:7:
          426|     // {
          427|       drvPath =
             |       ^
          428|         assert condition;

       … while calling the 'derivationStrict' builtin
         at «nix-internal»/derivation-internal.nix:37:12:
           36|
           37|   strict = derivationStrict drvAttrs;
             |            ^
           38|

       … while evaluating the option `nodes.client.networking.interfaces':

       … while evaluating definitions from `/nix/store/csk881ggvmifg4qf1cal0r1ffflbmlhp-source/nixos/modules/hardware/facter/networking':

       … while evaluating the option `nodes.client.hardware.facter.enable':

       … while evaluating the option `nodes.client.hardware.facter.report':

       … while evaluating the option `nodes.client.hardware.facter.reportPath':

       … while evaluating definitions from `/nix/store/jm2474ca2cbmwz6000ap53xbaa56qifj-source/nixosModules/clanCore/nixos-facter.nix':

       (stack trace truncated; use '--show-trace' to show the full, detailed trace)

       error: build of '/nix/store/66ndbbglvmibsd07r7ajj48sdckr2kcz-merged-test-dir-clan-test-p2p-ssh-iroh.drv^out' failed: error: error: gRPC BuildDerivation on 'nix-store.geninf.io:50051' failed: build-x86-01: missing: /nix/store/66ndbbglvmibsd07r7ajj48sdckr2kcz-merged-test-dir-clan-test-p2p-ssh-iroh.drv
failed eval checks.x86_64-linux.pki —
error: … while evaluating the attribute 'drvPath' at «https://releases.nixos.org/nixos/26.05/nixos-26.05.11045.774debe7a0d1/nixexprs.tar.xz?narH …
error:
       … while evaluating the attribute 'drvPath'
         at «https://releases.nixos.org/nixos/26.05/nixos-26.05.11045.774debe7a0d1/nixexprs.tar.xz?narHash=sha256-S5MjznoY0gbQbcANPLz5RYjg%2B5/WQmFRgNbHcP%2Bydcg%3D»/lib/customisation.nix:427:7:
          426|     // {
          427|       drvPath =
             |       ^
          428|         assert condition;

       … while calling the 'derivationStrict' builtin
         at «nix-internal»/derivation-internal.nix:37:12:
           36|
           37|   strict = derivationStrict drvAttrs;
             |            ^
           38|

       … while evaluating the option `driverConfiguration.vlans':

       … while evaluating definitions from `/nix/store/csk881ggvmifg4qf1cal0r1ffflbmlhp-source/nixos/lib/testing/driver-configuration.nix':

       … while evaluating the option `nodes.caddy.networking.interfaces':

       … while evaluating definitions from `/nix/store/csk881ggvmifg4qf1cal0r1ffflbmlhp-source/nixos/modules/hardware/facter/networking':

       … while evaluating the option `nodes.caddy.hardware.facter.enable':

       … while evaluating the option `nodes.caddy.hardware.facter.report':

       … while evaluating the option `nodes.caddy.hardware.facter.reportPath':

       … while evaluating definitions from `/nix/store/jm2474ca2cbmwz6000ap53xbaa56qifj-source/nixosModules/clanCore/nixos-facter.nix':

       (stack trace truncated; use '--show-trace' to show the full, detailed trace)

       error: build of '/nix/store/jifhxdzffi03r9ax3ri3nqdg8rcg62ax-merged-test-dir-pki.drv^out' failed: error: error: gRPC BuildDerivation on 'nix-store.geninf.io:50051' failed: build-x86-01: missing: /nix/store/jifhxdzffi03r9ax3ri3nqdg8rcg62ax-merged-test-dir-pki.drv
failed eval checks.x86_64-linux.service-dummy-test —
error: … while evaluating the attribute 'drvPath' at «https://releases.nixos.org/nixos/26.05/nixos-26.05.11045.774debe7a0d1/nixexprs.tar.xz?narH …
error:
       … while evaluating the attribute 'drvPath'
         at «https://releases.nixos.org/nixos/26.05/nixos-26.05.11045.774debe7a0d1/nixexprs.tar.xz?narHash=sha256-S5MjznoY0gbQbcANPLz5RYjg%2B5/WQmFRgNbHcP%2Bydcg%3D»/lib/customisation.nix:427:7:
          426|     // {
          427|       drvPath =
             |       ^
          428|         assert condition;

       … while calling the 'derivationStrict' builtin
         at «nix-internal»/derivation-internal.nix:37:12:
           36|
           37|   strict = derivationStrict drvAttrs;
             |            ^
           38|

       … while evaluating the option `nodes.admin1.networking.interfaces':

       … while evaluating definitions from `/nix/store/csk881ggvmifg4qf1cal0r1ffflbmlhp-source/nixos/modules/hardware/facter/networking':

       … while evaluating the option `nodes.admin1.hardware.facter.enable':

       … while evaluating the option `nodes.admin1.hardware.facter.report':

       … while evaluating the option `nodes.admin1.hardware.facter.reportPath':

       … while evaluating definitions from `/nix/store/jm2474ca2cbmwz6000ap53xbaa56qifj-source/nixosModules/clanCore/nixos-facter.nix':

       (stack trace truncated; use '--show-trace' to show the full, detailed trace)

       error: build of '/nix/store/93r99wqlyhxzhj15ga3hbs1inkv5rq1w-merged-test-dir-service-dummy-test.drv^out' failed: error: error: gRPC BuildDerivation on 'nix-store.geninf.io:50051' failed: build-x86-01: missing: /nix/store/93r99wqlyhxzhj15ga3hbs1inkv5rq1w-merged-test-dir-service-dummy-test.drv
failed eval checks.x86_64-linux.service-dummy-test-from-flake —
error: … while evaluating the attribute 'drvPath' at «https://releases.nixos.org/nixos/26.05/nixos-26.05.11045.774debe7a0d1/nixexprs.tar.xz?narH …
error:
       … while evaluating the attribute 'drvPath'
         at «https://releases.nixos.org/nixos/26.05/nixos-26.05.11045.774debe7a0d1/nixexprs.tar.xz?narHash=sha256-S5MjznoY0gbQbcANPLz5RYjg%2B5/WQmFRgNbHcP%2Bydcg%3D»/lib/customisation.nix:427:7:
          426|     // {
          427|       drvPath =
             |       ^
          428|         assert condition;

       … while calling the 'derivationStrict' builtin
         at «nix-internal»/derivation-internal.nix:37:12:
           36|
           37|   strict = derivationStrict drvAttrs;
             |            ^
           38|

       … while evaluating the option `nodes.admin1.networking.interfaces':

       … while evaluating definitions from `/nix/store/csk881ggvmifg4qf1cal0r1ffflbmlhp-source/nixos/modules/hardware/facter/networking':

       … while evaluating the option `nodes.admin1.hardware.facter.enable':

       … while evaluating the option `nodes.admin1.hardware.facter.report':

       … while evaluating the option `nodes.admin1.hardware.facter.reportPath':

       … while evaluating definitions from `/nix/store/jm2474ca2cbmwz6000ap53xbaa56qifj-source/nixosModules/clanCore/nixos-facter.nix':

       (stack trace truncated; use '--show-trace' to show the full, detailed trace)

       error: build of '/nix/store/qsfzrf8p2qb5lhr0nf2j11s5gyi38qbl-merged-test-dir-service-dummy-test-from-flake.drv^out' failed: error: error: gRPC BuildDerivation on 'nix-store.geninf.io:50051' failed: build-x86-01: missing: /nix/store/qsfzrf8p2qb5lhr0nf2j11s5gyi38qbl-merged-test-dir-service-dummy-test-from-flake.drv
failed eval checks.x86_64-linux.syncthing-service —
error: … while evaluating the attribute 'drvPath' at «https://releases.nixos.org/nixos/26.05/nixos-26.05.11045.774debe7a0d1/nixexprs.tar.xz?narH …
error:
       … while evaluating the attribute 'drvPath'
         at «https://releases.nixos.org/nixos/26.05/nixos-26.05.11045.774debe7a0d1/nixexprs.tar.xz?narHash=sha256-S5MjznoY0gbQbcANPLz5RYjg%2B5/WQmFRgNbHcP%2Bydcg%3D»/lib/customisation.nix:427:7:
          426|     // {
          427|       drvPath =
             |       ^
          428|         assert condition;

       … while calling the 'derivationStrict' builtin
         at «nix-internal»/derivation-internal.nix:37:12:
           36|
           37|   strict = derivationStrict drvAttrs;
             |            ^
           38|

       … while evaluating the option `nodes.machine1.networking.interfaces':

       … while evaluating definitions from `/nix/store/csk881ggvmifg4qf1cal0r1ffflbmlhp-source/nixos/modules/hardware/facter/networking':

       … while evaluating the option `nodes.machine1.hardware.facter.enable':

       … while evaluating the option `nodes.machine1.hardware.facter.report':

       … while evaluating the option `nodes.machine1.hardware.facter.reportPath':

       … while evaluating definitions from `/nix/store/jm2474ca2cbmwz6000ap53xbaa56qifj-source/nixosModules/clanCore/nixos-facter.nix':

       (stack trace truncated; use '--show-trace' to show the full, detailed trace)

       error: build of '/nix/store/8ixbnwzwsadhimss7kqf9qm86dgjzchh-merged-test-dir-syncthing-service.drv^out' failed: error: error: gRPC BuildDerivation on 'nix-store.geninf.io:50051' failed: build-x86-01: missing: /nix/store/8ixbnwzwsadhimss7kqf9qm86dgjzchh-merged-test-dir-syncthing-service.drv
failed eval checks.x86_64-linux.users —
error: … while evaluating the attribute 'drvPath' at «https://releases.nixos.org/nixos/26.05/nixos-26.05.11045.774debe7a0d1/nixexprs.tar.xz?narH …
error:
       … while evaluating the attribute 'drvPath'
         at «https://releases.nixos.org/nixos/26.05/nixos-26.05.11045.774debe7a0d1/nixexprs.tar.xz?narHash=sha256-S5MjznoY0gbQbcANPLz5RYjg%2B5/WQmFRgNbHcP%2Bydcg%3D»/lib/customisation.nix:427:7:
          426|     // {
          427|       drvPath =
             |       ^
          428|         assert condition;

       … while calling the 'derivationStrict' builtin
         at «nix-internal»/derivation-internal.nix:37:12:
           36|
           37|   strict = derivationStrict drvAttrs;
             |            ^
           38|

       … while evaluating the option `nodes.server.networking.interfaces':

       … while evaluating definitions from `/nix/store/csk881ggvmifg4qf1cal0r1ffflbmlhp-source/nixos/modules/hardware/facter/networking':

       … while evaluating the option `nodes.server.hardware.facter.enable':

       … while evaluating the option `nodes.server.hardware.facter.report':

       … while evaluating the option `nodes.server.hardware.facter.reportPath':

       … while evaluating definitions from `/nix/store/jm2474ca2cbmwz6000ap53xbaa56qifj-source/nixosModules/clanCore/nixos-facter.nix':

       (stack trace truncated; use '--show-trace' to show the full, detailed trace)

       error: build of '/nix/store/rx39mmxfmdxw2hp0hy63igdj7q0j0mqw-merged-test-dir-users.drv^out' failed: error: error: gRPC BuildDerivation on 'nix-store.geninf.io:50051' failed: build-x86-01: missing: /nix/store/rx39mmxfmdxw2hp0hy63igdj7q0j0mqw-merged-test-dir-users.drv
failed eval checks.x86_64-linux.wireguard —
error: … while evaluating the attribute 'drvPath' at «https://releases.nixos.org/nixos/26.05/nixos-26.05.11045.774debe7a0d1/nixexprs.tar.xz?narH …
error:
       … while evaluating the attribute 'drvPath'
         at «https://releases.nixos.org/nixos/26.05/nixos-26.05.11045.774debe7a0d1/nixexprs.tar.xz?narHash=sha256-S5MjznoY0gbQbcANPLz5RYjg%2B5/WQmFRgNbHcP%2Bydcg%3D»/lib/customisation.nix:427:7:
          426|     // {
          427|       drvPath =
             |       ^
          428|         assert condition;

       … while calling the 'derivationStrict' builtin
         at «nix-internal»/derivation-internal.nix:37:12:
           36|
           37|   strict = derivationStrict drvAttrs;
             |            ^
           38|

       … while evaluating the option `nodes.controller1.networking.interfaces':

       … while evaluating definitions from `/nix/store/csk881ggvmifg4qf1cal0r1ffflbmlhp-source/nixos/modules/hardware/facter/networking':

       … while evaluating the option `nodes.controller1.hardware.facter.enable':

       … while evaluating the option `nodes.controller1.hardware.facter.report':

       … while evaluating the option `nodes.controller1.hardware.facter.reportPath':

       … while evaluating definitions from `/nix/store/jm2474ca2cbmwz6000ap53xbaa56qifj-source/nixosModules/clanCore/nixos-facter.nix':

       (stack trace truncated; use '--show-trace' to show the full, detailed trace)

       error: build of '/nix/store/k99w3l2gf1wlzjh8lihbaw1rh078jaka-merged-test-dir-wireguard.drv^out' failed: error: error: gRPC BuildDerivation on 'nix-store.geninf.io:50051' failed: build-x86-01: missing: /nix/store/k99w3l2gf1wlzjh8lihbaw1rh078jaka-merged-test-dir-wireguard.drv
failed eval checks.x86_64-linux.zerotier —
error: … while evaluating the attribute 'drvPath' at «https://releases.nixos.org/nixos/26.05/nixos-26.05.11045.774debe7a0d1/nixexprs.tar.xz?narH …
error:
       … while evaluating the attribute 'drvPath'
         at «https://releases.nixos.org/nixos/26.05/nixos-26.05.11045.774debe7a0d1/nixexprs.tar.xz?narHash=sha256-S5MjznoY0gbQbcANPLz5RYjg%2B5/WQmFRgNbHcP%2Bydcg%3D»/lib/customisation.nix:427:7:
          426|     // {
          427|       drvPath =
             |       ^
          428|         assert condition;

       … while calling the 'derivationStrict' builtin
         at «nix-internal»/derivation-internal.nix:37:12:
           36|
           37|   strict = derivationStrict drvAttrs;
             |            ^
           38|

       … while evaluating the option `driverConfiguration.vlans':

       … while evaluating definitions from `/nix/store/csk881ggvmifg4qf1cal0r1ffflbmlhp-source/nixos/lib/testing/driver-configuration.nix':

       … while evaluating the option `nodes.controller.networking.interfaces':

       … while evaluating definitions from `/nix/store/csk881ggvmifg4qf1cal0r1ffflbmlhp-source/nixos/modules/hardware/facter/networking':

       … while evaluating the option `nodes.controller.hardware.facter.enable':

       … while evaluating the option `nodes.controller.hardware.facter.report':

       … while evaluating the option `nodes.controller.hardware.facter.reportPath':

       … while evaluating definitions from `/nix/store/jm2474ca2cbmwz6000ap53xbaa56qifj-source/nixosModules/clanCore/nixos-facter.nix':

       (stack trace truncated; use '--show-trace' to show the full, detailed trace)

       error: build of '/nix/store/plrafijfzclzss9dl00yfdm906l5p3xx-merged-test-dir-zerotier.drv^out' failed: error: error: gRPC BuildDerivation on 'nix-store.geninf.io:50051' failed: build-x86-01: missing: /nix/store/plrafijfzclzss9dl00yfdm906l5p3xx-merged-test-dir-zerotier.drv
failed eval checks.x86_64-linux.zerotier-multi-instance —
error: … while evaluating the attribute 'drvPath' at «https://releases.nixos.org/nixos/26.05/nixos-26.05.11045.774debe7a0d1/nixexprs.tar.xz?narH …
error:
       … while evaluating the attribute 'drvPath'
         at «https://releases.nixos.org/nixos/26.05/nixos-26.05.11045.774debe7a0d1/nixexprs.tar.xz?narHash=sha256-S5MjznoY0gbQbcANPLz5RYjg%2B5/WQmFRgNbHcP%2Bydcg%3D»/lib/customisation.nix:427:7:
          426|     // {
          427|       drvPath =
             |       ^
          428|         assert condition;

       … while calling the 'derivationStrict' builtin
         at «nix-internal»/derivation-internal.nix:37:12:
           36|
           37|   strict = derivationStrict drvAttrs;
             |            ^
           38|

       … while evaluating the option `driverConfiguration.vlans':

       … while evaluating definitions from `/nix/store/csk881ggvmifg4qf1cal0r1ffflbmlhp-source/nixos/lib/testing/driver-configuration.nix':

       … while evaluating the option `nodes.alpha.networking.interfaces':

       … while evaluating definitions from `/nix/store/csk881ggvmifg4qf1cal0r1ffflbmlhp-source/nixos/modules/hardware/facter/networking':

       … while evaluating the option `nodes.alpha.hardware.facter.enable':

       … while evaluating the option `nodes.alpha.hardware.facter.report':

       … while evaluating the option `nodes.alpha.hardware.facter.reportPath':

       … while evaluating definitions from `/nix/store/jm2474ca2cbmwz6000ap53xbaa56qifj-source/nixosModules/clanCore/nixos-facter.nix':

       (stack trace truncated; use '--show-trace' to show the full, detailed trace)

       error: build of '/nix/store/gb0pvdh3p89c6fjyqzfav5y3w7dlns4m-merged-test-dir-zerotier-multi-instance.drv^out' failed: error: gave up after 9 reschedules
20 succeeded
succeeded attributes
status attribute duration
loading…
82 already built
skipped attributes
status attribute duration
loading…