nixbot

builds

clan/clan-core build #944 failed

branch 26.05 · PR #8177 · commit eb6d5b3152 · · took 13m 56s · eval 5m 31s

eval warnings 38 kinds · 210 occurrences
  • error …-merged-test-dir-data-mesher.drv: gi-build-x86-02: gi-build-x86-02: input not substitutable: error: path '/nix/store/…-test-vars-generated' is required, but there is no substituter that can build it, asking the scheduler again ×17
  • error …-merged-test-dir-borgbackup.drv: gi-build-x86-02: gi-build-x86-02: input not substitutable: error: path '/nix/store/…-test-vars-generated' is required, but there is no substituter that can build it, asking the scheduler again ×14
  • error …-merged-test-dir-certificates.drv: error: gRPC AddMultipleToStore on 'nix-store.geninf.io:50051' failed: error: path '/nix/store/…-generator-step-intermediate-key.drv' is required, but there is no substituter that can build it ×2
  • error ×31
  • error build of '/nix/store/…-merged-test-dir-certificates.drv^out' failed: error: error: gRPC AddMultipleToStore on 'nix-store.geninf.io:50051' failed: error: path '/nix/store/…-generator-step-intermediate-key.drv' is required, but there is no substituter that can build it ×2
  • error build of '/nix/store/…-merged-test-dir-data-mesher.drv^out' failed: error: gave up after 9 reschedules ×2
  • error …-merged-test-dir-borgbackup.drv: build-x86-01: build-x86-01: input not substitutable: error: path '/nix/store/…-test-vars-generated' is required, but there is no substituter that can build it, asking the scheduler again ×4
  • error Refusing to evaluate package 'pnpm-10.34.0' in /nix/store/…-source/pkgs/development/tools/pnpm/generic.nix:170 because it is marked as insecure ×10
  • error build of '/nix/store/…-merged-test-dir-borgbackup.drv^out' failed: error: gave up after 9 reschedules ×2
  • error …-merged-test-dir-kde.drv: gi-build-x86-02: gi-build-x86-02: input not substitutable: error: path '/nix/store/…-test-vars-generated' is required, but there is no substituter that can build it, asking the scheduler again ×11
  • error build of '/nix/store/…-merged-test-dir-kde.drv^out' failed: error: gave up after 9 reschedules ×2
  • error …-test-vars-generated.drv: gi-build-x86-02: gi-build-x86-02: input not substitutable: error: path '/nix/store/…-generator-test-secret' is required, but there is no substituter that can build it, asking the scheduler again ×9
  • error build of '/nix/store/…-merged-test-dir-nixos-test-password-store-mounts.drv^out' failed: error: dependency '…-test-vars-generated.drv' failed ×1
  • error …-merged-test-dir-clan-test-p2p-ssh-iroh.drv: gi-build-x86-02: gi-build-x86-02: input not substitutable: error: path '/nix/store/…-test-vars-generated' is required, but there is no substituter that can build it, asking the scheduler again ×7
  • error …-merged-test-dir-clan-test-p2p-ssh-iroh.drv: build-x86-01: build-x86-01: input not substitutable: error: path '/nix/store/…-test-vars-generated' is required, but there is no substituter that can build it, asking the scheduler again ×2
  • error …-merged-test-dir-pki.drv: gi-build-x86-02: gi-build-x86-02: input not substitutable: error: path '/nix/store/…-test-vars-generated' is required, but there is no substituter that can build it, asking the scheduler again ×8
  • error …-merged-test-dir-pki.drv: build-x86-01: build-x86-01: input not substitutable: error: path '/nix/store/…-test-vars-generated' is required, but there is no substituter that can build it, asking the scheduler again ×1
  • error build of '/nix/store/…-merged-test-dir-clan-test-p2p-ssh-iroh.drv^out' failed: error: gave up after 9 reschedules ×1
  • error build of '/nix/store/…-merged-test-dir-pki.drv^out' failed: error: gave up after 9 reschedules ×1
  • error …-merged-test-dir-users.drv: gi-build-x86-02: gi-build-x86-02: input not substitutable: error: path '/nix/store/…-test-vars-generated' is required, but there is no substituter that can build it, asking the scheduler again ×11
  • error …-merged-test-dir-syncthing-service.drv: gi-build-x86-02: gi-build-x86-02: input not substitutable: error: path '/nix/store/…-test-vars-generated' is required, but there is no substituter that can build it, asking the scheduler again ×8
  • error …-merged-test-dir-wifi.drv: build-x86-01: build-x86-01: input not substitutable: error: path '/nix/store/…-test-vars-generated' is required, but there is no substituter that can build it, asking the scheduler again ×10
  • error …-merged-test-dir-wifi.drv: gi-build-x86-02: gi-build-x86-02: input not substitutable: error: path '/nix/store/…-test-vars-generated' is required, but there is no substituter that can build it, asking the scheduler again ×7
  • error …-merged-test-dir-syncthing-service.drv: build-x86-01: build-x86-01: input not substitutable: error: path '/nix/store/…-test-vars-generated' is required, but there is no substituter that can build it, asking the scheduler again ×10
  • error …-merged-test-dir-users.drv: build-x86-01: build-x86-01: input not substitutable: error: path '/nix/store/…-test-vars-generated' is required, but there is no substituter that can build it, asking the scheduler again ×7
  • error …-merged-test-dir-wireguard.drv: gi-build-x86-02: gi-build-x86-02: input not substitutable: error: path '/nix/store/…-test-vars-generated' is required, but there is no substituter that can build it, asking the scheduler again ×9
  • error build of '/nix/store/…-merged-test-dir-syncthing-service.drv^out' failed: error: gave up after 9 reschedules ×2
  • error build of '/nix/store/…-merged-test-dir-users.drv^out' failed: error: gave up after 9 reschedules ×2
  • error build of '/nix/store/…-merged-test-dir-wifi.drv^out' failed: error: gave up after 9 reschedules ×2
  • error build of '/nix/store/…-merged-test-dir-wireguard.drv^out' failed: error: gave up after 9 reschedules ×1
  • error …-merged-test-dir-certificates.drv: gi-build-x86-02: gi-build-x86-02: input not substitutable: error: path '/nix/store/…-test-vars-generated' is required, but there is no substituter that can build it, asking the scheduler again ×1
  • error …-merged-test-dir-data-mesher.drv: build-x86-01: build-x86-01: input not substitutable: error: path '/nix/store/…-test-vars-generated' is required, but there is no substituter that can build it, asking the scheduler again ×1
  • error …-merged-test-dir-kde.drv: build-x86-01: build-x86-01: input not substitutable: error: path '/nix/store/…-test-vars-generated' is required, but there is no substituter that can build it, asking the scheduler again ×7
  • error hash mismatch importing path '/nix/store/…-merged-test-dir-nixos-test-password-store-mounts'; ×1
  • error hash mismatch importing path '/nix/store/…-merged-test-dir-clan-test-p2p-ssh-iroh'; ×1
  • error …-merged-test-dir-wireguard.drv: error: gRPC AddMultipleToStore on 'nix-store.geninf.io:50051' failed: error: path '/nix/store/…-generator-wireguard-network-wg-test-one.drv' is required, but there is no substituter that can build it ×1
  • error build of '/nix/store/…-merged-test-dir-wireguard.drv^out' failed: error: error: gRPC AddMultipleToStore on 'nix-store.geninf.io:50051' failed: error: path '/nix/store/…-generator-wireguard-network-wg-test-one.drv' is required, but there is no substituter that can build it ×1
  • error …-merged-test-dir-wifi.drv: web01: web01: input not substitutable: error: path '/nix/store/…-test-vars-generated' is required, but there is no substituter that can build it, asking the scheduler again ×1

88 failed
failed attributes
status attribute duration
failed eval checks.aarch64-darwin.all-packages —
error: … while calling the 'derivationStrict' builtin at «nix-internal»/derivation-internal.nix:37:12: 36| 37| strict = …
error:
       … while calling the 'derivationStrict' builtin
         at «nix-internal»/derivation-internal.nix:37:12:
           36|
           37|   strict = derivationStrict drvAttrs;
             |            ^
           38|

       … while evaluating derivation 'all-packages'
         whose name attribute is located at «https://releases.nixos.org/nixos/26.05/nixos-26.05.11628.f584496e0120/nixexprs.tar.xz?narHash=sha256-oADz%2BiVvVvE6aADkqywUEdNruts0BdExqgF20/0nd5o%3D»/pkgs/stdenv/generic/make-derivation.nix:647:11

       … while evaluating attribute 'buildCommand' of derivation 'all-packages'
         at «https://releases.nixos.org/nixos/26.05/nixos-26.05.11628.f584496e0120/nixexprs.tar.xz?narHash=sha256-oADz%2BiVvVvE6aADkqywUEdNruts0BdExqgF20/0nd5o%3D»/pkgs/build-support/trivial-builders/default.nix:81:17:
           80|         enableParallelBuilding = true;
           81|         inherit buildCommand name;
             |                 ^
           82|         passAsFile = [ "buildCommand" ] ++ (derivationArgs.passAsFile or [ ]);

       (stack trace truncated; use '--show-trace' to show the full, detailed trace)

       error: Refusing to evaluate package 'pnpm-10.34.0' in /nix/store/g7h1h7cia44ljg4wcrhq3vca5gm5mv9k-source/pkgs/development/tools/pnpm/generic.nix:170 because it is marked as insecure

       Known issues:
        - CVE-2026-55487
        - CVE-2026-55698
        - CVE-2026-55180
        - CVE-2026-55697
        - CVE-2026-59194
        - CVE-2026-59195
        - CVE-2026-59196
        - CVE-2026-82392
        - CVE-2026-82393

       You can install it anyway by allowing this package, using the
       following methods:

       a) To temporarily allow all insecure packages, you can use an environment
          variable for a single invocation of the nix tools:

            $ export NIXPKGS_ALLOW_INSECURE=1

          Note: When using `nix shell`, `nix build`, `nix develop`, etc with a flake,
                then pass `--impure` in order to allow use of environment variables.

       b) for `nixos-rebuild` you can add ‘pnpm-10.34.0’ to
          `nixpkgs.config.permittedInsecurePackages` in the configuration.nix,
          like so:

            {
              nixpkgs.config.permittedInsecurePackages = [
                "pnpm-10.34.0"
              ];
            }

       c) For `nix-env`, `nix-build`, `nix-shell` or any other Nix command you can add
          ‘pnpm-10.34.0’ to `permittedInsecurePackages` in
          ~/.config/nixpkgs/config.nix, like so:

            {
              permittedInsecurePackages = [
                "pnpm-10.34.0"
              ];
            }
failed checks.aarch64-darwin.clan-app-pytest 2m 1s
setup: warning: ignoring the client-specified setting 'store', because it is a restricted setting and you are not a trusted user warning: 2vq97vcpv3x4banc8r1vpz …
setup:
warning: ignoring the client-specified setting 'store', because it is a restricted setting and you are not a trusted user
warning: 2vq97vcpv3x4banc8r1vpzlpf4zzlfky-webview-nightly.drv: no connected, non-draining worker for system 'aarch64-darwin' offers features {}, the workers offer {}, waiting up to 120s for a worker
warning: g6g65ks8f13vw5f670q51ppxgbx6ihwi-clan-runtime.drv: no connected, non-draining worker for system 'aarch64-darwin' offers features {}, the workers offer {}, waiting up to 120s for a worker
warning: q1qgvwm3lcfpsk9zbl566bfa2y5ilwk5-python3-3.13.15-env.drv: no connected, non-draining worker for system 'aarch64-darwin' offers features {}, the workers offer {}, waiting up to 120s for a worker
2vq97vcpv3x4banc8r1vpzlpf4zzlfky-webview-nightly.drv: no connected, non-draining worker for system 'aarch64-darwin' offers features {}, the workers offer {}
g6g65ks8f13vw5f670q51ppxgbx6ihwi-clan-runtime.drv: no connected, non-draining worker for system 'aarch64-darwin' offers features {}, the workers offer {}
q1qgvwm3lcfpsk9zbl566bfa2y5ilwk5-python3-3.13.15-env.drv: no connected, non-draining worker for system 'aarch64-darwin' offers features {}, the workers offer {}
error: dependency '2vq97vcpv3x4banc8r1vpzlpf4zzlfky-webview-nightly.drv' failed
failed checks.aarch64-darwin.clan-app-ui-lint 2m 4s
setup: warning: kzdw7zw5nv08894mwk1v82wk3rbp36y5-unknown.drv: no connected, non-draining worker for system 'aarch64-darwin' offers features {}, the workers offe …
setup:
warning: kzdw7zw5nv08894mwk1v82wk3rbp36y5-unknown.drv: no connected, non-draining worker for system 'aarch64-darwin' offers features {}, the workers offer {}, waiting up to 120s for a worker
warning: p4b96a9l12zifk49k0l49cadqyxfj945-clan-ts-api.drv: no connected, non-draining worker for system 'aarch64-darwin' offers features {}, the workers offer {}, waiting up to 120s for a worker
warning: v7cfvzx59d42d7insb9qfcdbyalw64zx-npm-config-hook.drv: no connected, non-draining worker for system 'aarch64-darwin' offers features {}, the workers offer {}, waiting up to 120s for a worker
3dp020c98sm3y9b9iz9jbifrgfqjrkp1--clan-ui-0.0.1-sources.drv: no connected, non-draining worker for system 'aarch64-darwin' offers features {}, the workers offer {}
kzdw7zw5nv08894mwk1v82wk3rbp36y5-unknown.drv: no connected, non-draining worker for system 'aarch64-darwin' offers features {}, the workers offer {}
p4b96a9l12zifk49k0l49cadqyxfj945-clan-ts-api.drv: no connected, non-draining worker for system 'aarch64-darwin' offers features {}, the workers offer {}
v7cfvzx59d42d7insb9qfcdbyalw64zx-npm-config-hook.drv: no connected, non-draining worker for system 'aarch64-darwin' offers features {}, the workers offer {}
error: dependency 'kzdw7zw5nv08894mwk1v82wk3rbp36y5-unknown.drv' failed
failed checks.aarch64-darwin.clan-app-ui-unit-tests 2m 3s
setup: warning: kzdw7zw5nv08894mwk1v82wk3rbp36y5-unknown.drv: no connected, non-draining worker for system 'aarch64-darwin' offers features {}, the workers offe …
setup:
warning: kzdw7zw5nv08894mwk1v82wk3rbp36y5-unknown.drv: no connected, non-draining worker for system 'aarch64-darwin' offers features {}, the workers offer {}, waiting up to 120s for a worker
warning: p4b96a9l12zifk49k0l49cadqyxfj945-clan-ts-api.drv: no connected, non-draining worker for system 'aarch64-darwin' offers features {}, the workers offer {}, waiting up to 120s for a worker
warning: v7cfvzx59d42d7insb9qfcdbyalw64zx-npm-config-hook.drv: no connected, non-draining worker for system 'aarch64-darwin' offers features {}, the workers offer {}, waiting up to 120s for a worker
3dp020c98sm3y9b9iz9jbifrgfqjrkp1--clan-ui-0.0.1-sources.drv: no connected, non-draining worker for system 'aarch64-darwin' offers features {}, the workers offer {}
kzdw7zw5nv08894mwk1v82wk3rbp36y5-unknown.drv: no connected, non-draining worker for system 'aarch64-darwin' offers features {}, the workers offer {}
p4b96a9l12zifk49k0l49cadqyxfj945-clan-ts-api.drv: no connected, non-draining worker for system 'aarch64-darwin' offers features {}, the workers offer {}
v7cfvzx59d42d7insb9qfcdbyalw64zx-npm-config-hook.drv: no connected, non-draining worker for system 'aarch64-darwin' offers features {}, the workers offer {}
error: dependency '3dp020c98sm3y9b9iz9jbifrgfqjrkp1--clan-ui-0.0.1-sources.drv' failed
failed checks.aarch64-darwin.clan-deps 2m 2s
setup: don't know how to build these paths: /nix/store/rzch3gyc5991ya2gvyazmglkwb47bnjm-clan-deps.drv warning: ignoring the client-specified setting 'store', …
setup:
don't know how to build these paths:
  /nix/store/rzch3gyc5991ya2gvyazmglkwb47bnjm-clan-deps.drv
warning: ignoring the client-specified setting 'store', because it is a restricted setting and you are not a trusted user
warning: rzch3gyc5991ya2gvyazmglkwb47bnjm-clan-deps.drv: no connected, non-draining worker for system 'aarch64-darwin' offers features {}, the workers offer {}, waiting up to 120s for a worker
rzch3gyc5991ya2gvyazmglkwb47bnjm-clan-deps.drv: no connected, non-draining worker for system 'aarch64-darwin' offers features {}, the workers offer {}
error: no connected, non-draining worker for system 'aarch64-darwin' offers features {}, the workers offer {}
failed checks.aarch64-darwin.clan-pytest-with-core 2m 1s
setup: 57ml0mka925di7mb92s385yh8jlijxr3-perl-5.42.3-env.drv: no connected, non-draining worker for system 'aarch64-darwin' offers features {}, the workers offer …
setup:
57ml0mka925di7mb92s385yh8jlijxr3-perl-5.42.3-env.drv: no connected, non-draining worker for system 'aarch64-darwin' offers features {}, the workers offer {}
f1pdnq5408g9rp49nk9k00dix6x3sl77-clan-core-flake.drv: no connected, non-draining worker for system 'aarch64-darwin' offers features {}, the workers offer {}
g6g65ks8f13vw5f670q51ppxgbx6ihwi-clan-runtime.drv: no connected, non-draining worker for system 'aarch64-darwin' offers features {}, the workers offer {}
pav0ikgjyv0ci86riqpsrlpk5mpwqcr6-closure-info.drv: no connected, non-draining worker for system 'aarch64-darwin' offers features {}, the workers offer {}
ra2927r70v9zjjz5z3rxcj7g5dh6mmnk-zerotierone-1.16.0.drv: no connected, non-draining worker for system 'aarch64-darwin' offers features {}, the workers offer {}
xj2xqw5v2f9mmd748nwsigchzv9q9pzr-zerotier-tools-0.1.0.drv: no connected, non-draining worker for system 'aarch64-darwin' offers features {}, the workers offer {}
ym0w3fjav52jbam294jqn8zvbpndrjc9-python3-3.13.15-env.drv: no connected, non-draining worker for system 'aarch64-darwin' offers features {}, the workers offer {}
error: dependency 'f1pdnq5408g9rp49nk9k00dix6x3sl77-clan-core-flake.drv' failed
failed checks.aarch64-darwin.clan-pytest-without-core 2m 1s
setup: warning: ignoring the client-specified setting 'store', because it is a restricted setting and you are not a trusted user warning: g6g65ks8f13vw5f670q51p …
setup:
warning: ignoring the client-specified setting 'store', because it is a restricted setting and you are not a trusted user
warning: g6g65ks8f13vw5f670q51ppxgbx6ihwi-clan-runtime.drv: no connected, non-draining worker for system 'aarch64-darwin' offers features {}, the workers offer {}, waiting up to 120s for a worker
warning: pav0ikgjyv0ci86riqpsrlpk5mpwqcr6-closure-info.drv: no connected, non-draining worker for system 'aarch64-darwin' offers features {}, the workers offer {}, waiting up to 120s for a worker
warning: ym0w3fjav52jbam294jqn8zvbpndrjc9-python3-3.13.15-env.drv: no connected, non-draining worker for system 'aarch64-darwin' offers features {}, the workers offer {}, waiting up to 120s for a worker
g6g65ks8f13vw5f670q51ppxgbx6ihwi-clan-runtime.drv: no connected, non-draining worker for system 'aarch64-darwin' offers features {}, the workers offer {}
pav0ikgjyv0ci86riqpsrlpk5mpwqcr6-closure-info.drv: no connected, non-draining worker for system 'aarch64-darwin' offers features {}, the workers offer {}
ym0w3fjav52jbam294jqn8zvbpndrjc9-python3-3.13.15-env.drv: no connected, non-draining worker for system 'aarch64-darwin' offers features {}, the workers offer {}
error: dependency 'ym0w3fjav52jbam294jqn8zvbpndrjc9-python3-3.13.15-env.drv' failed
failed checks.aarch64-darwin.darwin-test-darwin-machine 2m 4s
setup: qm4r6lgv1ld1pdf52ndlra10gsm97mr8-darwin-rebuild.drv: no connected, non-draining worker for system 'aarch64-darwin' offers features {}, the workers offer …
setup:
qm4r6lgv1ld1pdf52ndlra10gsm97mr8-darwin-rebuild.drv: no connected, non-draining worker for system 'aarch64-darwin' offers features {}, the workers offer {}
qsqb2i82cgnccaiaxvy3kgcw96jax83i-darwin-version.json.drv: no connected, non-draining worker for system 'aarch64-darwin' offers features {}, the workers offer {}
rjrx4i80iwd7xri74wfsfxi8fsal8gbp-set-environment.drv: no connected, non-draining worker for system 'aarch64-darwin' offers features {}, the workers offer {}
shhsdzdwqzfm3v98pjnhai9xr1f1z9pm-options.json.drv: no connected, non-draining worker for system 'aarch64-darwin' offers features {}, the workers offer {}
w4afz2impwxc5cqv08bsa2vh6gr5pl3d-patches.drv: no connected, non-draining worker for system 'aarch64-darwin' offers features {}, the workers offer {}
y5f294bglikn7b7gcnlchbaj9j1qmfjf-etc-099-host-keys.conf.drv: no connected, non-draining worker for system 'aarch64-darwin' offers features {}, the workers offer {}
y6v0x6ql68q9080awrq8ab9mw6l1gavh-launchd.drv: no connected, non-draining worker for system 'aarch64-darwin' offers features {}, the workers offer {}
error: dependency 'ciyfn5np2s8vcsa9x2qmaryzdi21jx3k-darwin-version.json.drv' failed
dependency failed checks.aarch64-darwin.devshell —
failed checks.aarch64-darwin.devShell-clan-app 2m 22s
setup: q1qgvwm3lcfpsk9zbl566bfa2y5ilwk5-python3-3.13.15-env.drv: no connected, non-draining worker for system 'aarch64-darwin' offers features {}, the workers o …
setup:
q1qgvwm3lcfpsk9zbl566bfa2y5ilwk5-python3-3.13.15-env.drv: no connected, non-draining worker for system 'aarch64-darwin' offers features {}, the workers offer {}
qgyz1jxvkphwlgf9kz6bh68r8p8ywgk5-lint-cross-compat.drv: no connected, non-draining worker for system 'aarch64-darwin' offers features {}, the workers offer {}
rx5pxikcvm5z95kx61w8wa6m06zrqb4w-Terms.yml.drv: no connected, non-draining worker for system 'aarch64-darwin' offers features {}, the workers offer {}
v7cfvzx59d42d7insb9qfcdbyalw64zx-npm-config-hook.drv: no connected, non-draining worker for system 'aarch64-darwin' offers features {}, the workers offer {}
xylhsnd1s92qvbm1481d9iddx8l8xing-playwright-browsers.drv: no connected, non-draining worker for system 'aarch64-darwin' offers features {}, the workers offer {}
ydjg695g7gkgpfk0bdyrks5150irm1sm-python3.13-datamodel-code-generator-0.52.1.drv: no connected, non-draining worker for system 'aarch64-darwin' offers features {}, the workers offer {}
zbapc0x7k24x20sq2k0m2zcpdxzlzgnp-sizelint.toml.drv: no connected, non-draining worker for system 'aarch64-darwin' offers features {}, the workers offer {}
error: dependency '2vq97vcpv3x4banc8r1vpzlpf4zzlfky-webview-nightly.drv' failed
failed checks.aarch64-darwin.devShell-clan-cli 2m 4s
setup: 9bm3fnyv1px2rcxyb7bjdfibg5vd3nj3-fmt-nix-codeblocks.drv: no connected, non-draining worker for system 'aarch64-darwin' offers features {}, the workers of …
setup:
9bm3fnyv1px2rcxyb7bjdfibg5vd3nj3-fmt-nix-codeblocks.drv: no connected, non-draining worker for system 'aarch64-darwin' offers features {}, the workers offer {}
bhkky2n1rlsxfqqljlkzw9285vhw14xv-tea-create-pr.drv: no connected, non-draining worker for system 'aarch64-darwin' offers features {}, the workers offer {}
g6g65ks8f13vw5f670q51ppxgbx6ihwi-clan-runtime.drv: no connected, non-draining worker for system 'aarch64-darwin' offers features {}, the workers offer {}
qgyz1jxvkphwlgf9kz6bh68r8p8ywgk5-lint-cross-compat.drv: no connected, non-draining worker for system 'aarch64-darwin' offers features {}, the workers offer {}
rx5pxikcvm5z95kx61w8wa6m06zrqb4w-Terms.yml.drv: no connected, non-draining worker for system 'aarch64-darwin' offers features {}, the workers offer {}
ydjg695g7gkgpfk0bdyrks5150irm1sm-python3.13-datamodel-code-generator-0.52.1.drv: no connected, non-draining worker for system 'aarch64-darwin' offers features {}, the workers offer {}
zbapc0x7k24x20sq2k0m2zcpdxzlzgnp-sizelint.toml.drv: no connected, non-draining worker for system 'aarch64-darwin' offers features {}, the workers offer {}
error: dependency '8z7nmdfqg7alvl7dvfpf350xi7lqksfg-pending-reviews.drv' failed
failed eval checks.aarch64-darwin.devShell-clan-site —
error: … while calling the 'derivationStrict' builtin at «nix-internal»/derivation-internal.nix:37:12: 36| 37| strict = …
error:
       … while calling the 'derivationStrict' builtin
         at «nix-internal»/derivation-internal.nix:37:12:
           36|
           37|   strict = derivationStrict drvAttrs;
             |            ^
           38|

       … while evaluating derivation 'nix-shell'
         whose name attribute is located at «https://releases.nixos.org/nixos/26.05/nixos-26.05.11628.f584496e0120/nixexprs.tar.xz?narHash=sha256-oADz%2BiVvVvE6aADkqywUEdNruts0BdExqgF20/0nd5o%3D»/pkgs/stdenv/generic/make-derivation.nix:647:11

       … while evaluating attribute '__impureHostDeps' of derivation 'nix-shell'
         at «https://releases.nixos.org/nixos/26.05/nixos-26.05.11628.f584496e0120/nixexprs.tar.xz?narHash=sha256-oADz%2BiVvVvE6aADkqywUEdNruts0BdExqgF20/0nd5o%3D»/pkgs/stdenv/generic/make-derivation.nix:816:11:
          815|             unique (computedPropagatedSandboxProfile ++ [ propagatedSandboxProfile ]);
          816|           ${if buildIsDarwin then "__impureHostDeps" else null} =
             |           ^
          817|             let

       (stack trace truncated; use '--show-trace' to show the full, detailed trace)

       error: Refusing to evaluate package 'pnpm-10.34.0' in /nix/store/g7h1h7cia44ljg4wcrhq3vca5gm5mv9k-source/pkgs/development/tools/pnpm/generic.nix:170 because it is marked as insecure

       Known issues:
        - CVE-2026-55487
        - CVE-2026-55698
        - CVE-2026-55180
        - CVE-2026-55697
        - CVE-2026-59194
        - CVE-2026-59195
        - CVE-2026-59196
        - CVE-2026-82392
        - CVE-2026-82393

       You can install it anyway by allowing this package, using the
       following methods:

       a) To temporarily allow all insecure packages, you can use an environment
          variable for a single invocation of the nix tools:

            $ export NIXPKGS_ALLOW_INSECURE=1

          Note: When using `nix shell`, `nix build`, `nix develop`, etc with a flake,
                then pass `--impure` in order to allow use of environment variables.

       b) for `nixos-rebuild` you can add ‘pnpm-10.34.0’ to
          `nixpkgs.config.permittedInsecurePackages` in the configuration.nix,
          like so:

            {
              nixpkgs.config.permittedInsecurePackages = [
                "pnpm-10.34.0"
              ];
            }

       c) For `nix-env`, `nix-build`, `nix-shell` or any other Nix command you can add
          ‘pnpm-10.34.0’ to `permittedInsecurePackages` in
          ~/.config/nixpkgs/config.nix, like so:

            {
              permittedInsecurePackages = [
                "pnpm-10.34.0"
              ];
            }
failed checks.aarch64-darwin.devShell-default 2m 23s
setup: 9bm3fnyv1px2rcxyb7bjdfibg5vd3nj3-fmt-nix-codeblocks.drv: no connected, non-draining worker for system 'aarch64-darwin' offers features {}, the workers of …
setup:
9bm3fnyv1px2rcxyb7bjdfibg5vd3nj3-fmt-nix-codeblocks.drv: no connected, non-draining worker for system 'aarch64-darwin' offers features {}, the workers offer {}
bhkky2n1rlsxfqqljlkzw9285vhw14xv-tea-create-pr.drv: no connected, non-draining worker for system 'aarch64-darwin' offers features {}, the workers offer {}
g6g65ks8f13vw5f670q51ppxgbx6ihwi-clan-runtime.drv: no connected, non-draining worker for system 'aarch64-darwin' offers features {}, the workers offer {}
qgyz1jxvkphwlgf9kz6bh68r8p8ywgk5-lint-cross-compat.drv: no connected, non-draining worker for system 'aarch64-darwin' offers features {}, the workers offer {}
rx5pxikcvm5z95kx61w8wa6m06zrqb4w-Terms.yml.drv: no connected, non-draining worker for system 'aarch64-darwin' offers features {}, the workers offer {}
ydjg695g7gkgpfk0bdyrks5150irm1sm-python3.13-datamodel-code-generator-0.52.1.drv: no connected, non-draining worker for system 'aarch64-darwin' offers features {}, the workers offer {}
zbapc0x7k24x20sq2k0m2zcpdxzlzgnp-sizelint.toml.drv: no connected, non-draining worker for system 'aarch64-darwin' offers features {}, the workers offer {}
error: dependency 'g6g65ks8f13vw5f670q51ppxgbx6ihwi-clan-runtime.drv' failed
failed checks.aarch64-darwin.devShell-inventory-schema 2m 16s
setup: 9bm3fnyv1px2rcxyb7bjdfibg5vd3nj3-fmt-nix-codeblocks.drv: no connected, non-draining worker for system 'aarch64-darwin' offers features {}, the workers of …
setup:
9bm3fnyv1px2rcxyb7bjdfibg5vd3nj3-fmt-nix-codeblocks.drv: no connected, non-draining worker for system 'aarch64-darwin' offers features {}, the workers offer {}
bhkky2n1rlsxfqqljlkzw9285vhw14xv-tea-create-pr.drv: no connected, non-draining worker for system 'aarch64-darwin' offers features {}, the workers offer {}
g6g65ks8f13vw5f670q51ppxgbx6ihwi-clan-runtime.drv: no connected, non-draining worker for system 'aarch64-darwin' offers features {}, the workers offer {}
qgyz1jxvkphwlgf9kz6bh68r8p8ywgk5-lint-cross-compat.drv: no connected, non-draining worker for system 'aarch64-darwin' offers features {}, the workers offer {}
rx5pxikcvm5z95kx61w8wa6m06zrqb4w-Terms.yml.drv: no connected, non-draining worker for system 'aarch64-darwin' offers features {}, the workers offer {}
ydjg695g7gkgpfk0bdyrks5150irm1sm-python3.13-datamodel-code-generator-0.52.1.drv: no connected, non-draining worker for system 'aarch64-darwin' offers features {}, the workers offer {}
zbapc0x7k24x20sq2k0m2zcpdxzlzgnp-sizelint.toml.drv: no connected, non-draining worker for system 'aarch64-darwin' offers features {}, the workers offer {}
error: dependency 'bhkky2n1rlsxfqqljlkzw9285vhw14xv-tea-create-pr.drv' failed
failed checks.aarch64-darwin.eval-tests 2m 4s
setup: gb3y4kfpd9ypxmlvgxsx70bf5lmcil5h-evalCheck-eval-lib-build-clan.drv: no connected, non-draining worker for system 'aarch64-darwin' offers features {}, the …
setup:
gb3y4kfpd9ypxmlvgxsx70bf5lmcil5h-evalCheck-eval-lib-build-clan.drv: no connected, non-draining worker for system 'aarch64-darwin' offers features {}, the workers offer {}
gzwc6nfpkwnlghvbdsv0yz6k1j15cpj7-evalCheck-eval-lib-exports.drv: no connected, non-draining worker for system 'aarch64-darwin' offers features {}, the workers offer {}
hxidcq00raydl5573jm2xyglxkj76z42-evalCheck-eval-tests-hello-world.drv: no connected, non-draining worker for system 'aarch64-darwin' offers features {}, the workers offer {}
iv46jxpxk3zrfldqnhg6r8l8drjy029l-evalCheck-eval-lib-resolve-module.drv: no connected, non-draining worker for system 'aarch64-darwin' offers features {}, the workers offer {}
py4w10ky2j0hfi3pm457vhd807crcch4-evalCheck-eval-lib-relativeDir.drv: no connected, non-draining worker for system 'aarch64-darwin' offers features {}, the workers offer {}
sivcqp663b1xvbraic92va441jw9zjc9-evalCheck-eval-tests-types.drv: no connected, non-draining worker for system 'aarch64-darwin' offers features {}, the workers offer {}
wmd2mdnvihapm0q4ap70drzhd20yrr0p-evalCheck-eval-vars-backends.drv: no connected, non-draining worker for system 'aarch64-darwin' offers features {}, the workers offer {}
error: dependency '0rzr2rf20g2n7m75s393gjdzb1frzdc8-evalCheck-eval-lib-values.drv' failed
failed checks.aarch64-darwin.inventory-classes-up-to-date 2m 4s
setup: don't know how to build these paths: /nix/store/ywi1iw62h9q4lvd9860kvpjki218ri65-inventory-classes-up-to-date.drv warning: ignoring the client-specifie …
setup:
don't know how to build these paths:
  /nix/store/ywi1iw62h9q4lvd9860kvpjki218ri65-inventory-classes-up-to-date.drv
warning: ignoring the client-specified setting 'store', because it is a restricted setting and you are not a trusted user
warning: ydjg695g7gkgpfk0bdyrks5150irm1sm-python3.13-datamodel-code-generator-0.52.1.drv: no connected, non-draining worker for system 'aarch64-darwin' offers features {}, the workers offer {}, waiting up to 120s for a worker
ydjg695g7gkgpfk0bdyrks5150irm1sm-python3.13-datamodel-code-generator-0.52.1.drv: no connected, non-draining worker for system 'aarch64-darwin' offers features {}, the workers offer {}
error: dependency '0ykazazjmyvz80j2bf9zsnzafi7hfvk3-clan-types.drv' failed
failed checks.aarch64-darwin.lib-jsonschema-example-valid 2m 4s
setup: don't know how to build these paths: /nix/store/d9265m4xh8l704k9vwjv1q3hflpwq4jr-lib-jsonschema-example-valid.drv warning: ignoring the client-specifie …
setup:
don't know how to build these paths:
  /nix/store/d9265m4xh8l704k9vwjv1q3hflpwq4jr-lib-jsonschema-example-valid.drv
warning: ignoring the client-specified setting 'store', because it is a restricted setting and you are not a trusted user
warning: d9265m4xh8l704k9vwjv1q3hflpwq4jr-lib-jsonschema-example-valid.drv: no connected, non-draining worker for system 'aarch64-darwin' offers features {}, the workers offer {}, waiting up to 120s for a worker
d9265m4xh8l704k9vwjv1q3hflpwq4jr-lib-jsonschema-example-valid.drv: no connected, non-draining worker for system 'aarch64-darwin' offers features {}, the workers offer {}
error: no connected, non-draining worker for system 'aarch64-darwin' offers features {}, the workers offer {}
failed checks.aarch64-darwin.treefmt 2m 6s
setup: warning: rx5pxikcvm5z95kx61w8wa6m06zrqb4w-Terms.yml.drv: no connected, non-draining worker for system 'aarch64-darwin' offers features {}, the workers of …
setup:
warning: rx5pxikcvm5z95kx61w8wa6m06zrqb4w-Terms.yml.drv: no connected, non-draining worker for system 'aarch64-darwin' offers features {}, the workers offer {}, waiting up to 120s for a worker
warning: zbapc0x7k24x20sq2k0m2zcpdxzlzgnp-sizelint.toml.drv: no connected, non-draining worker for system 'aarch64-darwin' offers features {}, the workers offer {}, waiting up to 120s for a worker
0a2plmf8sq4rii1i3qxdmyiwnfqzfhqy-flake-edit.toml.drv: no connected, non-draining worker for system 'aarch64-darwin' offers features {}, the workers offer {}
9bm3fnyv1px2rcxyb7bjdfibg5vd3nj3-fmt-nix-codeblocks.drv: no connected, non-draining worker for system 'aarch64-darwin' offers features {}, the workers offer {}
qgyz1jxvkphwlgf9kz6bh68r8p8ywgk5-lint-cross-compat.drv: no connected, non-draining worker for system 'aarch64-darwin' offers features {}, the workers offer {}
rx5pxikcvm5z95kx61w8wa6m06zrqb4w-Terms.yml.drv: no connected, non-draining worker for system 'aarch64-darwin' offers features {}, the workers offer {}
zbapc0x7k24x20sq2k0m2zcpdxzlzgnp-sizelint.toml.drv: no connected, non-draining worker for system 'aarch64-darwin' offers features {}, the workers offer {}
error: dependency 'pj4hkazr33izi551si79kdj3q40ypiq3-treefmt.drv' failed
failed checks.aarch64-darwin.zerotier-tools-pytest 2m 2s
setup: don't know how to build these paths: /nix/store/nhf0pgz8v7pi38ggih491zvvxh0a19r3-zerotier-tools-pytest.drv warning: ignoring the client-specified setti …
setup:
don't know how to build these paths:
  /nix/store/nhf0pgz8v7pi38ggih491zvvxh0a19r3-zerotier-tools-pytest.drv
warning: ignoring the client-specified setting 'store', because it is a restricted setting and you are not a trusted user
warning: ghshv97idlargpf015rbsgvdmk4p9chp-python3-3.13.15-env.drv: no connected, non-draining worker for system 'aarch64-darwin' offers features {}, the workers offer {}, waiting up to 120s for a worker
ghshv97idlargpf015rbsgvdmk4p9chp-python3-3.13.15-env.drv: no connected, non-draining worker for system 'aarch64-darwin' offers features {}, the workers offer {}
error: dependency 'ghshv97idlargpf015rbsgvdmk4p9chp-python3-3.13.15-env.drv' failed
failed checks.aarch64-linux.admin 4m 25s
setup: g66fdvinfjr78qvdxgz9b314sw4gszc3-decrypt-age-secrets.drv: build01: build01: input not substitutable: error: path '/nix/store/xqmbsf4zbphr1657ibx6smxqy01k …
setup:
g66fdvinfjr78qvdxgz9b314sw4gszc3-decrypt-age-secrets.drv: build01: build01: input not substitutable: error: path '/nix/store/xqmbsf4zbphr1657ibx6smxqy01k1p69-mount-secret-fs' is required, but there is no substituter that can build it, asking the scheduler again
4x2i00yh66k810ld2vh5px0achvlqyzb-command-not-found.drv: build01: build01: input not substitutable: error: path '/nix/store/5fdmcpd1nqkzidxc440jdix6z98n16gc-perl-5.42.3-env' is required, but there is no substituter that can build it, asking the scheduler again
y8w6xrp7xpgzg6md1hvbfplzhpy26q11-decrypt-age-secrets.drv: build01: build01: input not substitutable: error: path '/nix/store/xqmbsf4zbphr1657ibx6smxqy01k1p69-mount-secret-fs' is required, but there is no substituter that can build it, asking the scheduler again
ahwky2imndrhg86zbs119ldh71fs54x8-X-Restart-Triggers-nix-daemon.drv: build01: build01: input not substitutable: error: path '/nix/store/9d7gg64nc7x6cp7p8baznwr3agibzmfr-nix.conf' is required, but there is no substituter that can build it, asking the scheduler again
4x2i00yh66k810ld2vh5px0achvlqyzb-command-not-found.drv: build01: build01: input not substitutable: error: path '/nix/store/5fdmcpd1nqkzidxc440jdix6z98n16gc-perl-5.42.3-env' is required, but there is no substituter that can build it, asking the scheduler again
y8w6xrp7xpgzg6md1hvbfplzhpy26q11-decrypt-age-secrets.drv: build01: build01: input not substitutable: error: path '/nix/store/xqmbsf4zbphr1657ibx6smxqy01k1p69-mount-secret-fs' is required, but there is no substituter that can build it, asking the scheduler again
ahwky2imndrhg86zbs119ldh71fs54x8-X-Restart-Triggers-nix-daemon.drv: build01: build01: input not substitutable: error: path '/nix/store/9d7gg64nc7x6cp7p8baznwr3agibzmfr-nix.conf' is required, but there is no substituter that can build it, asking the scheduler again
error: dependency 'nvf0p6zs67bqgaf98i603szhg91ryzba-nixos-test-driver-admin.drv' failed
failed eval checks.aarch64-linux.all-packages —
error: … while calling the 'derivationStrict' builtin at «nix-internal»/derivation-internal.nix:37:12: 36| 37| strict = …
error:
       … while calling the 'derivationStrict' builtin
         at «nix-internal»/derivation-internal.nix:37:12:
           36|
           37|   strict = derivationStrict drvAttrs;
             |            ^
           38|

       … while evaluating derivation 'all-packages'
         whose name attribute is located at «https://releases.nixos.org/nixos/26.05/nixos-26.05.11628.f584496e0120/nixexprs.tar.xz?narHash=sha256-oADz%2BiVvVvE6aADkqywUEdNruts0BdExqgF20/0nd5o%3D»/pkgs/stdenv/generic/make-derivation.nix:647:11

       … while evaluating attribute 'buildCommand' of derivation 'all-packages'
         at «https://releases.nixos.org/nixos/26.05/nixos-26.05.11628.f584496e0120/nixexprs.tar.xz?narHash=sha256-oADz%2BiVvVvE6aADkqywUEdNruts0BdExqgF20/0nd5o%3D»/pkgs/build-support/trivial-builders/default.nix:81:17:
           80|         enableParallelBuilding = true;
           81|         inherit buildCommand name;
             |                 ^
           82|         passAsFile = [ "buildCommand" ] ++ (derivationArgs.passAsFile or [ ]);

       (stack trace truncated; use '--show-trace' to show the full, detailed trace)

       error: Refusing to evaluate package 'pnpm-10.34.0' in /nix/store/g7h1h7cia44ljg4wcrhq3vca5gm5mv9k-source/pkgs/development/tools/pnpm/generic.nix:170 because it is marked as insecure

       Known issues:
        - CVE-2026-55487
        - CVE-2026-55698
        - CVE-2026-55180
        - CVE-2026-55697
        - CVE-2026-59194
        - CVE-2026-59195
        - CVE-2026-59196
        - CVE-2026-82392
        - CVE-2026-82393

       You can install it anyway by allowing this package, using the
       following methods:

       a) To temporarily allow all insecure packages, you can use an environment
          variable for a single invocation of the nix tools:

            $ export NIXPKGS_ALLOW_INSECURE=1

          Note: When using `nix shell`, `nix build`, `nix develop`, etc with a flake,
                then pass `--impure` in order to allow use of environment variables.

       b) for `nixos-rebuild` you can add ‘pnpm-10.34.0’ to
          `nixpkgs.config.permittedInsecurePackages` in the configuration.nix,
          like so:

            {
              nixpkgs.config.permittedInsecurePackages = [
                "pnpm-10.34.0"
              ];
            }

       c) For `nix-env`, `nix-build`, `nix-shell` or any other Nix command you can add
          ‘pnpm-10.34.0’ to `permittedInsecurePackages` in
          ~/.config/nixpkgs/config.nix, like so:

            {
              permittedInsecurePackages = [
                "pnpm-10.34.0"
              ];
            }
failed eval checks.aarch64-linux.borgbackup —
error: … while evaluating the attribute 'drvPath' at «https://releases.nixos.org/nixos/26.05/nixos-26.05.11628.f584496e0120/nixexprs.tar.xz?narH …
error:
       … while evaluating the attribute 'drvPath'
         at «https://releases.nixos.org/nixos/26.05/nixos-26.05.11628.f584496e0120/nixexprs.tar.xz?narHash=sha256-oADz%2BiVvVvE6aADkqywUEdNruts0BdExqgF20/0nd5o%3D»/lib/customisation.nix:427:7:
          426|     // {
          427|       drvPath =
             |       ^
          428|         assert condition;

       … while calling the 'derivationStrict' builtin
         at «nix-internal»/derivation-internal.nix:37:12:
           36|
           37|   strict = derivationStrict drvAttrs;
             |            ^
           38|

       … while evaluating the option `nodes.clientone.networking.interfaces':

       … while evaluating definitions from `/nix/store/g7h1h7cia44ljg4wcrhq3vca5gm5mv9k-source/nixos/modules/hardware/facter/networking':

       … while evaluating the option `nodes.clientone.hardware.facter.enable':

       … while evaluating the option `nodes.clientone.hardware.facter.report':

       … while evaluating the option `nodes.clientone.hardware.facter.reportPath':

       … while evaluating definitions from `/nix/store/i66i58drxvil0pcfgvg0b4x92qic5f8z-source/nixosModules/clanCore/nixos-facter.nix':

       (stack trace truncated; use '--show-trace' to show the full, detailed trace)

       error: build of '/nix/store/iymk7adx6w7kdzk12m8yl90s7n15qava-merged-test-dir-borgbackup.drv^out' failed: error: gave up after 9 reschedules
failed eval checks.aarch64-linux.certificates —
error: … while evaluating the attribute 'drvPath' at «https://releases.nixos.org/nixos/26.05/nixos-26.05.11628.f584496e0120/nixexprs.tar.xz?narH …
error:
       … while evaluating the attribute 'drvPath'
         at «https://releases.nixos.org/nixos/26.05/nixos-26.05.11628.f584496e0120/nixexprs.tar.xz?narHash=sha256-oADz%2BiVvVvE6aADkqywUEdNruts0BdExqgF20/0nd5o%3D»/lib/customisation.nix:427:7:
          426|     // {
          427|       drvPath =
             |       ^
          428|         assert condition;

       … while calling the 'derivationStrict' builtin
         at «nix-internal»/derivation-internal.nix:37:12:
           36|
           37|   strict = derivationStrict drvAttrs;
             |            ^
           38|

       … while evaluating the option `nodes.ca.networking.interfaces':

       … while evaluating definitions from `/nix/store/g7h1h7cia44ljg4wcrhq3vca5gm5mv9k-source/nixos/modules/hardware/facter/networking':

       … while evaluating the option `nodes.ca.hardware.facter.enable':

       … while evaluating the option `nodes.ca.hardware.facter.report':

       … while evaluating the option `nodes.ca.hardware.facter.reportPath':

       … while evaluating definitions from `/nix/store/i66i58drxvil0pcfgvg0b4x92qic5f8z-source/nixosModules/clanCore/nixos-facter.nix':

       (stack trace truncated; use '--show-trace' to show the full, detailed trace)

       error: build of '/nix/store/4l0b6fay94iqq24kqzjr0340hb8isk8v-merged-test-dir-certificates.drv^out' failed: error: error: gRPC AddMultipleToStore on 'nix-store.geninf.io:50051' failed: error: path '/nix/store/pz095625cmjmg3l5p9p56psv3adsfs7h-generator-step-intermediate-key.drv' is required, but there is no substituter that can build it
failed eval checks.aarch64-linux.clan-site-lint —
error: … while calling the 'derivationStrict' builtin at «nix-internal»/derivation-internal.nix:37:12: 36| 37| strict = …
error:
       … while calling the 'derivationStrict' builtin
         at «nix-internal»/derivation-internal.nix:37:12:
           36|
           37|   strict = derivationStrict drvAttrs;
             |            ^
           38|

       … while evaluating derivation 'clan-site-lint'
         whose name attribute is located at «https://releases.nixos.org/nixos/26.05/nixos-26.05.11628.f584496e0120/nixexprs.tar.xz?narHash=sha256-oADz%2BiVvVvE6aADkqywUEdNruts0BdExqgF20/0nd5o%3D»/pkgs/stdenv/generic/make-derivation.nix:647:11

       … while evaluating attribute 'nativeBuildInputs' of derivation 'clan-site-lint'
         at «https://releases.nixos.org/nixos/26.05/nixos-26.05.11628.f584496e0120/nixexprs.tar.xz?narHash=sha256-oADz%2BiVvVvE6aADkqywUEdNruts0BdExqgF20/0nd5o%3D»/pkgs/stdenv/generic/make-derivation.nix:715:11:
          714|           depsBuildBuild = buildBuildOutputs;
          715|           nativeBuildInputs = buildHostOutputs;
             |           ^
          716|           depsBuildTarget = buildTargetOutputs;

       (stack trace truncated; use '--show-trace' to show the full, detailed trace)

       error: Refusing to evaluate package 'pnpm-10.34.0' in /nix/store/g7h1h7cia44ljg4wcrhq3vca5gm5mv9k-source/pkgs/development/tools/pnpm/generic.nix:170 because it is marked as insecure

       Known issues:
        - CVE-2026-55487
        - CVE-2026-55698
        - CVE-2026-55180
        - CVE-2026-55697
        - CVE-2026-59194
        - CVE-2026-59195
        - CVE-2026-59196
        - CVE-2026-82392
        - CVE-2026-82393

       You can install it anyway by allowing this package, using the
       following methods:

       a) To temporarily allow all insecure packages, you can use an environment
          variable for a single invocation of the nix tools:

            $ export NIXPKGS_ALLOW_INSECURE=1

          Note: When using `nix shell`, `nix build`, `nix develop`, etc with a flake,
                then pass `--impure` in order to allow use of environment variables.

       b) for `nixos-rebuild` you can add ‘pnpm-10.34.0’ to
          `nixpkgs.config.permittedInsecurePackages` in the configuration.nix,
          like so:

            {
              nixpkgs.config.permittedInsecurePackages = [
                "pnpm-10.34.0"
              ];
            }

       c) For `nix-env`, `nix-build`, `nix-shell` or any other Nix command you can add
          ‘pnpm-10.34.0’ to `permittedInsecurePackages` in
          ~/.config/nixpkgs/config.nix, like so:

            {
              permittedInsecurePackages = [
                "pnpm-10.34.0"
              ];
            }
failed checks.aarch64-linux.clan-test-iso 12m 23s
setup: 4x2i00yh66k810ld2vh5px0achvlqyzb-command-not-found.drv: build01: the build this call attached to did not finish, retry, asking the scheduler again 4x2i00 …
setup:
4x2i00yh66k810ld2vh5px0achvlqyzb-command-not-found.drv: build01: the build this call attached to did not finish, retry, asking the scheduler again
4x2i00yh66k810ld2vh5px0achvlqyzb-command-not-found.drv: build01: the build this call attached to did not finish, retry, asking the scheduler again
4x2i00yh66k810ld2vh5px0achvlqyzb-command-not-found.drv: build01: the build this call attached to did not finish, retry, asking the scheduler again
4x2i00yh66k810ld2vh5px0achvlqyzb-command-not-found.drv: build01: build01: input not substitutable: error: path '/nix/store/5fdmcpd1nqkzidxc440jdix6z98n16gc-perl-5.42.3-env' is required, but there is no substituter that can build it, asking the scheduler again
p0063ghknj5r5cd2xgjkpb2f5wvf5czf-clan-runtime.drv: build01: not scheduled here: p0063ghknj5r5cd2xgjkpb2f5wvf5czf-clan-runtime.drv, asking the scheduler again
p7lkmirxhigg4x7692zx6ncbdmfqbk5w-offline-flake-for-test-clan-test-iso.drv: build01: not scheduled here: p7lkmirxhigg4x7692zx6ncbdmfqbk5w-offline-flake-for-test-clan-test-iso.drv, asking the scheduler again
1yh1ajplkmjyiwqgd5h807w5jd162f6q-etc-nix-registry.json.drv: build01: not scheduled here: 1yh1ajplkmjyiwqgd5h807w5jd162f6q-etc-nix-registry.json.drv, asking the scheduler again
error: dependency 'jkavd5g30p724xnlp7a5q3mixf4jhm7c-nixos-test-driver-clan-test-iso.drv' failed
failed checks.aarch64-linux.darwin-test-darwin-machine 2m 7s
setup: qm4r6lgv1ld1pdf52ndlra10gsm97mr8-darwin-rebuild.drv: no connected, non-draining worker for system 'aarch64-darwin' offers features {}, the workers offer …
setup:
qm4r6lgv1ld1pdf52ndlra10gsm97mr8-darwin-rebuild.drv: no connected, non-draining worker for system 'aarch64-darwin' offers features {}, the workers offer {}
qsqb2i82cgnccaiaxvy3kgcw96jax83i-darwin-version.json.drv: no connected, non-draining worker for system 'aarch64-darwin' offers features {}, the workers offer {}
rjrx4i80iwd7xri74wfsfxi8fsal8gbp-set-environment.drv: no connected, non-draining worker for system 'aarch64-darwin' offers features {}, the workers offer {}
shhsdzdwqzfm3v98pjnhai9xr1f1z9pm-options.json.drv: no connected, non-draining worker for system 'aarch64-darwin' offers features {}, the workers offer {}
w4afz2impwxc5cqv08bsa2vh6gr5pl3d-patches.drv: no connected, non-draining worker for system 'aarch64-darwin' offers features {}, the workers offer {}
y5f294bglikn7b7gcnlchbaj9j1qmfjf-etc-099-host-keys.conf.drv: no connected, non-draining worker for system 'aarch64-darwin' offers features {}, the workers offer {}
y6v0x6ql68q9080awrq8ab9mw6l1gavh-launchd.drv: no connected, non-draining worker for system 'aarch64-darwin' offers features {}, the workers offer {}
error: dependency 'ciyfn5np2s8vcsa9x2qmaryzdi21jx3k-darwin-version.json.drv' failed
failed eval checks.aarch64-linux.data-mesher —
error: … while evaluating the attribute 'drvPath' at «https://releases.nixos.org/nixos/26.05/nixos-26.05.11628.f584496e0120/nixexprs.tar.xz?narH …
error:
       … while evaluating the attribute 'drvPath'
         at «https://releases.nixos.org/nixos/26.05/nixos-26.05.11628.f584496e0120/nixexprs.tar.xz?narHash=sha256-oADz%2BiVvVvE6aADkqywUEdNruts0BdExqgF20/0nd5o%3D»/lib/customisation.nix:427:7:
          426|     // {
          427|       drvPath =
             |       ^
          428|         assert condition;

       … while calling the 'derivationStrict' builtin
         at «nix-internal»/derivation-internal.nix:37:12:
           36|
           37|   strict = derivationStrict drvAttrs;
             |            ^
           38|

       … while evaluating the option `nodes.alpha.networking.interfaces':

       … while evaluating definitions from `/nix/store/g7h1h7cia44ljg4wcrhq3vca5gm5mv9k-source/nixos/modules/hardware/facter/networking':

       … while evaluating the option `nodes.alpha.hardware.facter.enable':

       … while evaluating the option `nodes.alpha.hardware.facter.report':

       … while evaluating the option `nodes.alpha.hardware.facter.reportPath':

       … while evaluating definitions from `/nix/store/i66i58drxvil0pcfgvg0b4x92qic5f8z-source/nixosModules/clanCore/nixos-facter.nix':

       (stack trace truncated; use '--show-trace' to show the full, detailed trace)

       error: build of '/nix/store/lxif27z7q5sh1w5ml9zwwai1q3fm5005-merged-test-dir-data-mesher.drv^out' failed: error: gave up after 9 reschedules
failed eval checks.aarch64-linux.devShell-clan-site —
error: … while calling the 'derivationStrict' builtin at «nix-internal»/derivation-internal.nix:37:12: 36| 37| strict = …
error:
       … while calling the 'derivationStrict' builtin
         at «nix-internal»/derivation-internal.nix:37:12:
           36|
           37|   strict = derivationStrict drvAttrs;
             |            ^
           38|

       … while evaluating derivation 'nix-shell'
         whose name attribute is located at «https://releases.nixos.org/nixos/26.05/nixos-26.05.11628.f584496e0120/nixexprs.tar.xz?narHash=sha256-oADz%2BiVvVvE6aADkqywUEdNruts0BdExqgF20/0nd5o%3D»/pkgs/stdenv/generic/make-derivation.nix:647:11

       … while evaluating attribute 'nativeBuildInputs' of derivation 'nix-shell'
         at «https://releases.nixos.org/nixos/26.05/nixos-26.05.11628.f584496e0120/nixexprs.tar.xz?narHash=sha256-oADz%2BiVvVvE6aADkqywUEdNruts0BdExqgF20/0nd5o%3D»/pkgs/stdenv/generic/make-derivation.nix:715:11:
          714|           depsBuildBuild = buildBuildOutputs;
          715|           nativeBuildInputs = buildHostOutputs;
             |           ^
          716|           depsBuildTarget = buildTargetOutputs;

       (stack trace truncated; use '--show-trace' to show the full, detailed trace)

       error: Refusing to evaluate package 'pnpm-10.34.0' in /nix/store/g7h1h7cia44ljg4wcrhq3vca5gm5mv9k-source/pkgs/development/tools/pnpm/generic.nix:170 because it is marked as insecure

       Known issues:
        - CVE-2026-55487
        - CVE-2026-55698
        - CVE-2026-55180
        - CVE-2026-55697
        - CVE-2026-59194
        - CVE-2026-59195
        - CVE-2026-59196
        - CVE-2026-82392
        - CVE-2026-82393

       You can install it anyway by allowing this package, using the
       following methods:

       a) To temporarily allow all insecure packages, you can use an environment
          variable for a single invocation of the nix tools:

            $ export NIXPKGS_ALLOW_INSECURE=1

          Note: When using `nix shell`, `nix build`, `nix develop`, etc with a flake,
                then pass `--impure` in order to allow use of environment variables.

       b) for `nixos-rebuild` you can add ‘pnpm-10.34.0’ to
          `nixpkgs.config.permittedInsecurePackages` in the configuration.nix,
          like so:

            {
              nixpkgs.config.permittedInsecurePackages = [
                "pnpm-10.34.0"
              ];
            }

       c) For `nix-env`, `nix-build`, `nix-shell` or any other Nix command you can add
          ‘pnpm-10.34.0’ to `permittedInsecurePackages` in
          ~/.config/nixpkgs/config.nix, like so:

            {
              permittedInsecurePackages = [
                "pnpm-10.34.0"
              ];
            }
failed eval checks.aarch64-linux.devShell-docs —
error: … while calling the 'derivationStrict' builtin at «nix-internal»/derivation-internal.nix:37:12: 36| 37| strict = …
error:
       … while calling the 'derivationStrict' builtin
         at «nix-internal»/derivation-internal.nix:37:12:
           36|
           37|   strict = derivationStrict drvAttrs;
             |            ^
           38|

       … while evaluating derivation 'nix-shell'
         whose name attribute is located at «https://releases.nixos.org/nixos/26.05/nixos-26.05.11628.f584496e0120/nixexprs.tar.xz?narHash=sha256-oADz%2BiVvVvE6aADkqywUEdNruts0BdExqgF20/0nd5o%3D»/pkgs/stdenv/generic/make-derivation.nix:647:11

       … while evaluating attribute 'nativeBuildInputs' of derivation 'nix-shell'
         at «https://releases.nixos.org/nixos/26.05/nixos-26.05.11628.f584496e0120/nixexprs.tar.xz?narHash=sha256-oADz%2BiVvVvE6aADkqywUEdNruts0BdExqgF20/0nd5o%3D»/pkgs/stdenv/generic/make-derivation.nix:715:11:
          714|           depsBuildBuild = buildBuildOutputs;
          715|           nativeBuildInputs = buildHostOutputs;
             |           ^
          716|           depsBuildTarget = buildTargetOutputs;

       (stack trace truncated; use '--show-trace' to show the full, detailed trace)

       error: Refusing to evaluate package 'pnpm-10.34.0' in /nix/store/g7h1h7cia44ljg4wcrhq3vca5gm5mv9k-source/pkgs/development/tools/pnpm/generic.nix:170 because it is marked as insecure

       Known issues:
        - CVE-2026-55487
        - CVE-2026-55698
        - CVE-2026-55180
        - CVE-2026-55697
        - CVE-2026-59194
        - CVE-2026-59195
        - CVE-2026-59196
        - CVE-2026-82392
        - CVE-2026-82393

       You can install it anyway by allowing this package, using the
       following methods:

       a) To temporarily allow all insecure packages, you can use an environment
          variable for a single invocation of the nix tools:

            $ export NIXPKGS_ALLOW_INSECURE=1

          Note: When using `nix shell`, `nix build`, `nix develop`, etc with a flake,
                then pass `--impure` in order to allow use of environment variables.

       b) for `nixos-rebuild` you can add ‘pnpm-10.34.0’ to
          `nixpkgs.config.permittedInsecurePackages` in the configuration.nix,
          like so:

            {
              nixpkgs.config.permittedInsecurePackages = [
                "pnpm-10.34.0"
              ];
            }

       c) For `nix-env`, `nix-build`, `nix-shell` or any other Nix command you can add
          ‘pnpm-10.34.0’ to `permittedInsecurePackages` in
          ~/.config/nixpkgs/config.nix, like so:

            {
              permittedInsecurePackages = [
                "pnpm-10.34.0"
              ];
            }
failed checks.aarch64-linux.dm-dns 45s
setup: ahwky2imndrhg86zbs119ldh71fs54x8-X-Restart-Triggers-nix-daemon.drv: build01: build01: input not substitutable: error: path '/nix/store/9d7gg64nc7x6cp7p8b …
setup:
ahwky2imndrhg86zbs119ldh71fs54x8-X-Restart-Triggers-nix-daemon.drv: build01: build01: input not substitutable: error: path '/nix/store/9d7gg64nc7x6cp7p8baznwr3agibzmfr-nix.conf' is required, but there is no substituter that can build it, asking the scheduler again
4x2i00yh66k810ld2vh5px0achvlqyzb-command-not-found.drv: build01: build01: input not substitutable: error: path '/nix/store/5fdmcpd1nqkzidxc440jdix6z98n16gc-perl-5.42.3-env' is required, but there is no substituter that can build it, asking the scheduler again
nhdnpsysj643yi6m3gkb04gkrj9795cl-decrypt-age-secrets.drv: build01: build01: input not substitutable: error: path '/nix/store/xqmbsf4zbphr1657ibx6smxqy01k1p69-mount-secret-fs' is required, but there is no substituter that can build it, asking the scheduler again
1s72amzjr08x3iiylrwxqa26y00ad7l4-decrypt-age-secrets.drv: build01: build01: input not substitutable: error: path '/nix/store/xqmbsf4zbphr1657ibx6smxqy01k1p69-mount-secret-fs' is required, but there is no substituter that can build it, asking the scheduler again
ahwky2imndrhg86zbs119ldh71fs54x8-X-Restart-Triggers-nix-daemon.drv: build01: build01: input not substitutable: error: path '/nix/store/9d7gg64nc7x6cp7p8baznwr3agibzmfr-nix.conf' is required, but there is no substituter that can build it, asking the scheduler again
nhdnpsysj643yi6m3gkb04gkrj9795cl-decrypt-age-secrets.drv: build01: build01: input not substitutable: error: path '/nix/store/xqmbsf4zbphr1657ibx6smxqy01k1p69-mount-secret-fs' is required, but there is no substituter that can build it, asking the scheduler again
1s72amzjr08x3iiylrwxqa26y00ad7l4-decrypt-age-secrets.drv: build01: build01: input not substitutable: error: path '/nix/store/xqmbsf4zbphr1657ibx6smxqy01k1p69-mount-secret-fs' is required, but there is no substituter that can build it, asking the scheduler again
error: dependency 'd3prmlnaqcdixy8snc632cvd35aai90x-nixos-test-driver-dm-dns.drv' failed
failed checks.aarch64-linux.dyndns 2m 5s
setup: 4x2i00yh66k810ld2vh5px0achvlqyzb-command-not-found.drv: build01: build01: input not substitutable: error: path '/nix/store/5fdmcpd1nqkzidxc440jdix6z98n16 …
setup:
4x2i00yh66k810ld2vh5px0achvlqyzb-command-not-found.drv: build01: build01: input not substitutable: error: path '/nix/store/5fdmcpd1nqkzidxc440jdix6z98n16gc-perl-5.42.3-env' is required, but there is no substituter that can build it, asking the scheduler again
5h3kimag6l6pljvnx39jphmb08pva54g-unit-nix-daemon.service.drv: build01: build01: input not substitutable: error: path '/nix/store/zc12x1yxf4yskzilqgq9ww7bfyfq1cvj-X-Restart-Triggers-nix-daemon' is required, but there is no substituter that can build it, asking the scheduler again
4x2i00yh66k810ld2vh5px0achvlqyzb-command-not-found.drv: build01: build01: input not substitutable: error: path '/nix/store/5fdmcpd1nqkzidxc440jdix6z98n16gc-perl-5.42.3-env' is required, but there is no substituter that can build it, asking the scheduler again
5h3kimag6l6pljvnx39jphmb08pva54g-unit-nix-daemon.service.drv: build01: build01: input not substitutable: error: path '/nix/store/zc12x1yxf4yskzilqgq9ww7bfyfq1cvj-X-Restart-Triggers-nix-daemon' is required, but there is no substituter that can build it, asking the scheduler again
4x2i00yh66k810ld2vh5px0achvlqyzb-command-not-found.drv: build01: build01: input not substitutable: error: path '/nix/store/5fdmcpd1nqkzidxc440jdix6z98n16gc-perl-5.42.3-env' is required, but there is no substituter that can build it, asking the scheduler again
5h3kimag6l6pljvnx39jphmb08pva54g-unit-nix-daemon.service.drv: build01: build01: input not substitutable: error: path '/nix/store/zc12x1yxf4yskzilqgq9ww7bfyfq1cvj-X-Restart-Triggers-nix-daemon' is required, but there is no substituter that can build it, asking the scheduler again
4x2i00yh66k810ld2vh5px0achvlqyzb-command-not-found.drv: build01: build01: input not substitutable: error: path '/nix/store/5fdmcpd1nqkzidxc440jdix6z98n16gc-perl-5.42.3-env' is required, but there is no substituter that can build it, asking the scheduler again
error: dependency 'h5hss9wis0ykrxm5iy7phdiqyxb6cdsg-nixos-test-driver-dyndns.drv' failed
failed checks.aarch64-linux.garage 1m 1s
setup: ahwky2imndrhg86zbs119ldh71fs54x8-X-Restart-Triggers-nix-daemon.drv: build01: build01: input not substitutable: error: path '/nix/store/9d7gg64nc7x6cp7p8b …
setup:
ahwky2imndrhg86zbs119ldh71fs54x8-X-Restart-Triggers-nix-daemon.drv: build01: build01: input not substitutable: error: path '/nix/store/9d7gg64nc7x6cp7p8baznwr3agibzmfr-nix.conf' is required, but there is no substituter that can build it, asking the scheduler again
4x2i00yh66k810ld2vh5px0achvlqyzb-command-not-found.drv: build01: the build this call attached to did not finish, retry, asking the scheduler again
ahwky2imndrhg86zbs119ldh71fs54x8-X-Restart-Triggers-nix-daemon.drv: build01: build01: input not substitutable: error: path '/nix/store/9d7gg64nc7x6cp7p8baznwr3agibzmfr-nix.conf' is required, but there is no substituter that can build it, asking the scheduler again
4x2i00yh66k810ld2vh5px0achvlqyzb-command-not-found.drv: build01: the build this call attached to did not finish, retry, asking the scheduler again
ahwky2imndrhg86zbs119ldh71fs54x8-X-Restart-Triggers-nix-daemon.drv: build01: the build this call attached to did not finish, retry, asking the scheduler again
4x2i00yh66k810ld2vh5px0achvlqyzb-command-not-found.drv: build01: build01: input not substitutable: error: path '/nix/store/5fdmcpd1nqkzidxc440jdix6z98n16gc-perl-5.42.3-env' is required, but there is no substituter that can build it, asking the scheduler again
ahwky2imndrhg86zbs119ldh71fs54x8-X-Restart-Triggers-nix-daemon.drv: build01: the build this call attached to did not finish, retry, asking the scheduler again
error: dependency '3rqlnvsjmiwsdx07w9s8ykhj7fn2d0wh-nixos-test-driver-garage.drv' failed
failed checks.aarch64-linux.hello-service 3m 47s
setup: 4x2i00yh66k810ld2vh5px0achvlqyzb-command-not-found.drv: build01: the build this call attached to did not finish, retry, asking the scheduler again ahwky2 …
setup:
4x2i00yh66k810ld2vh5px0achvlqyzb-command-not-found.drv: build01: the build this call attached to did not finish, retry, asking the scheduler again
ahwky2imndrhg86zbs119ldh71fs54x8-X-Restart-Triggers-nix-daemon.drv: build01: build01: input not substitutable: error: path '/nix/store/9d7gg64nc7x6cp7p8baznwr3agibzmfr-nix.conf' is required, but there is no substituter that can build it, asking the scheduler again
g66fdvinfjr78qvdxgz9b314sw4gszc3-decrypt-age-secrets.drv: build01: build01: input not substitutable: error: path '/nix/store/xqmbsf4zbphr1657ibx6smxqy01k1p69-mount-secret-fs' is required, but there is no substituter that can build it, asking the scheduler again
4x2i00yh66k810ld2vh5px0achvlqyzb-command-not-found.drv: build01: build01: input not substitutable: error: path '/nix/store/5fdmcpd1nqkzidxc440jdix6z98n16gc-perl-5.42.3-env' is required, but there is no substituter that can build it, asking the scheduler again
ahwky2imndrhg86zbs119ldh71fs54x8-X-Restart-Triggers-nix-daemon.drv: build01: build01: input not substitutable: error: path '/nix/store/9d7gg64nc7x6cp7p8baznwr3agibzmfr-nix.conf' is required, but there is no substituter that can build it, asking the scheduler again
4x2i00yh66k810ld2vh5px0achvlqyzb-command-not-found.drv: build01: the build this call attached to did not finish, retry, asking the scheduler again
ahwky2imndrhg86zbs119ldh71fs54x8-X-Restart-Triggers-nix-daemon.drv: build01: the build this call attached to did not finish, retry, asking the scheduler again
error: dependency 'dj7r0ljrq3pkb5ya17pdcgicarzsqawy-nixos-test-driver-hello-service.drv' failed
failed eval checks.aarch64-linux.kde —
error: … while evaluating the attribute 'drvPath' at «https://releases.nixos.org/nixos/26.05/nixos-26.05.11628.f584496e0120/nixexprs.tar.xz?narH …
error:
       … while evaluating the attribute 'drvPath'
         at «https://releases.nixos.org/nixos/26.05/nixos-26.05.11628.f584496e0120/nixexprs.tar.xz?narHash=sha256-oADz%2BiVvVvE6aADkqywUEdNruts0BdExqgF20/0nd5o%3D»/lib/customisation.nix:427:7:
          426|     // {
          427|       drvPath =
             |       ^
          428|         assert condition;

       … while calling the 'derivationStrict' builtin
         at «nix-internal»/derivation-internal.nix:37:12:
           36|
           37|   strict = derivationStrict drvAttrs;
             |            ^
           38|

       … while evaluating the option `nodes.client.networking.interfaces':

       … while evaluating definitions from `/nix/store/g7h1h7cia44ljg4wcrhq3vca5gm5mv9k-source/nixos/modules/hardware/facter/networking':

       … while evaluating the option `nodes.client.hardware.facter.enable':

       … while evaluating the option `nodes.client.hardware.facter.report':

       … while evaluating the option `nodes.client.hardware.facter.reportPath':

       … while evaluating definitions from `/nix/store/i66i58drxvil0pcfgvg0b4x92qic5f8z-source/nixosModules/clanCore/nixos-facter.nix':

       (stack trace truncated; use '--show-trace' to show the full, detailed trace)

       error: build of '/nix/store/4ipgq78dzbz4ddhb72ic0xh33l1ljcrd-merged-test-dir-kde.drv^out' failed: error: gave up after 9 reschedules
failed checks.aarch64-linux.localbackup 2m 2s
setup: ahwky2imndrhg86zbs119ldh71fs54x8-X-Restart-Triggers-nix-daemon.drv: build01: the build this call attached to did not finish, retry, asking the scheduler …
setup:
ahwky2imndrhg86zbs119ldh71fs54x8-X-Restart-Triggers-nix-daemon.drv: build01: the build this call attached to did not finish, retry, asking the scheduler again
4x2i00yh66k810ld2vh5px0achvlqyzb-command-not-found.drv: build01: the build this call attached to did not finish, retry, asking the scheduler again
g66fdvinfjr78qvdxgz9b314sw4gszc3-decrypt-age-secrets.drv: build01: build01: input not substitutable: error: path '/nix/store/xqmbsf4zbphr1657ibx6smxqy01k1p69-mount-secret-fs' is required, but there is no substituter that can build it, asking the scheduler again
ahwky2imndrhg86zbs119ldh71fs54x8-X-Restart-Triggers-nix-daemon.drv: build01: build01: input not substitutable: error: path '/nix/store/9d7gg64nc7x6cp7p8baznwr3agibzmfr-nix.conf' is required, but there is no substituter that can build it, asking the scheduler again
4x2i00yh66k810ld2vh5px0achvlqyzb-command-not-found.drv: build01: the build this call attached to did not finish, retry, asking the scheduler again
g66fdvinfjr78qvdxgz9b314sw4gszc3-decrypt-age-secrets.drv: build01: build01: input not substitutable: error: path '/nix/store/xqmbsf4zbphr1657ibx6smxqy01k1p69-mount-secret-fs' is required, but there is no substituter that can build it, asking the scheduler again
ahwky2imndrhg86zbs119ldh71fs54x8-X-Restart-Triggers-nix-daemon.drv: build01: build01: input not substitutable: error: path '/nix/store/9d7gg64nc7x6cp7p8baznwr3agibzmfr-nix.conf' is required, but there is no substituter that can build it, asking the scheduler again
error: dependency '5ji10arfnmailwi0fq6fwd9pm3714156-nixos-test-driver-localbackup.drv' failed
failed checks.aarch64-linux.machine-id 52s
setup: 5h3kimag6l6pljvnx39jphmb08pva54g-unit-nix-daemon.service.drv: build01: the build this call attached to did not finish, retry, asking the scheduler again …
setup:
5h3kimag6l6pljvnx39jphmb08pva54g-unit-nix-daemon.service.drv: build01: the build this call attached to did not finish, retry, asking the scheduler again
4x2i00yh66k810ld2vh5px0achvlqyzb-command-not-found.drv: build01: the build this call attached to did not finish, retry, asking the scheduler again
g66fdvinfjr78qvdxgz9b314sw4gszc3-decrypt-age-secrets.drv: build01: the build this call attached to did not finish, retry, asking the scheduler again
4x2i00yh66k810ld2vh5px0achvlqyzb-command-not-found.drv: build01: the build this call attached to did not finish, retry, asking the scheduler again
5h3kimag6l6pljvnx39jphmb08pva54g-unit-nix-daemon.service.drv: build01: the build this call attached to did not finish, retry, asking the scheduler again
g66fdvinfjr78qvdxgz9b314sw4gszc3-decrypt-age-secrets.drv: build01: the build this call attached to did not finish, retry, asking the scheduler again
4x2i00yh66k810ld2vh5px0achvlqyzb-command-not-found.drv: build01: the build this call attached to did not finish, retry, asking the scheduler again
error: dependency '6w02ckp2mq6bm0fj3120js2wlry0vhs5-nixos-test-driver-service-machine-id.drv' failed
failed checks.aarch64-linux.matrix-synapse 1m 14s
setup: 2vkvkfqamcs8yylj24vxir2rg9rrb0rv-decrypt-age-secrets.drv: build01: build01: input not substitutable: error: path '/nix/store/xqmbsf4zbphr1657ibx6smxqy01k …
setup:
2vkvkfqamcs8yylj24vxir2rg9rrb0rv-decrypt-age-secrets.drv: build01: build01: input not substitutable: error: path '/nix/store/xqmbsf4zbphr1657ibx6smxqy01k1p69-mount-secret-fs' is required, but there is no substituter that can build it, asking the scheduler again
ahwky2imndrhg86zbs119ldh71fs54x8-X-Restart-Triggers-nix-daemon.drv: build01: build01: input not substitutable: error: path '/nix/store/9d7gg64nc7x6cp7p8baznwr3agibzmfr-nix.conf' is required, but there is no substituter that can build it, asking the scheduler again
4x2i00yh66k810ld2vh5px0achvlqyzb-command-not-found.drv: build01: build01: input not substitutable: error: path '/nix/store/5fdmcpd1nqkzidxc440jdix6z98n16gc-perl-5.42.3-env' is required, but there is no substituter that can build it, asking the scheduler again
2vkvkfqamcs8yylj24vxir2rg9rrb0rv-decrypt-age-secrets.drv: build01: build01: input not substitutable: error: path '/nix/store/xqmbsf4zbphr1657ibx6smxqy01k1p69-mount-secret-fs' is required, but there is no substituter that can build it, asking the scheduler again
ahwky2imndrhg86zbs119ldh71fs54x8-X-Restart-Triggers-nix-daemon.drv: build01: build01: input not substitutable: error: path '/nix/store/9d7gg64nc7x6cp7p8baznwr3agibzmfr-nix.conf' is required, but there is no substituter that can build it, asking the scheduler again
4x2i00yh66k810ld2vh5px0achvlqyzb-command-not-found.drv: build01: build01: input not substitutable: error: path '/nix/store/5fdmcpd1nqkzidxc440jdix6z98n16gc-perl-5.42.3-env' is required, but there is no substituter that can build it, asking the scheduler again
2vkvkfqamcs8yylj24vxir2rg9rrb0rv-decrypt-age-secrets.drv: build01: build01: input not substitutable: error: path '/nix/store/xqmbsf4zbphr1657ibx6smxqy01k1p69-mount-secret-fs' is required, but there is no substituter that can build it, asking the scheduler again
error: dependency 'cbd1q9jz2gf7wb6w5j44ac52w0wbwpi1-nixos-test-driver-matrix-synapse.drv' failed
failed checks.aarch64-linux.monitoring 4m 48s
setup: 5h3kimag6l6pljvnx39jphmb08pva54g-unit-nix-daemon.service.drv: build01: build01: input not substitutable: error: path '/nix/store/zc12x1yxf4yskzilqgq9ww7b …
setup:
5h3kimag6l6pljvnx39jphmb08pva54g-unit-nix-daemon.service.drv: build01: build01: input not substitutable: error: path '/nix/store/zc12x1yxf4yskzilqgq9ww7bfyfq1cvj-X-Restart-Triggers-nix-daemon' is required, but there is no substituter that can build it, asking the scheduler again
4x2i00yh66k810ld2vh5px0achvlqyzb-command-not-found.drv: build01: build01: input not substitutable: error: path '/nix/store/5fdmcpd1nqkzidxc440jdix6z98n16gc-perl-5.42.3-env' is required, but there is no substituter that can build it, asking the scheduler again
jad0j4v04vr7bnfavyl2lxzfr7yx9412-decrypt-age-secrets.drv: build01: build01: input not substitutable: error: path '/nix/store/xqmbsf4zbphr1657ibx6smxqy01k1p69-mount-secret-fs' is required, but there is no substituter that can build it, asking the scheduler again
xx690g9wcknk2ar3i95yc3ai7f9ljg45-decrypt-age-secrets.drv: build01: build01: input not substitutable: error: path '/nix/store/xqmbsf4zbphr1657ibx6smxqy01k1p69-mount-secret-fs' is required, but there is no substituter that can build it, asking the scheduler again
5h3kimag6l6pljvnx39jphmb08pva54g-unit-nix-daemon.service.drv: build01: build01: input not substitutable: error: path '/nix/store/zc12x1yxf4yskzilqgq9ww7bfyfq1cvj-X-Restart-Triggers-nix-daemon' is required, but there is no substituter that can build it, asking the scheduler again
4x2i00yh66k810ld2vh5px0achvlqyzb-command-not-found.drv: build01: build01: input not substitutable: error: path '/nix/store/5fdmcpd1nqkzidxc440jdix6z98n16gc-perl-5.42.3-env' is required, but there is no substituter that can build it, asking the scheduler again
xx690g9wcknk2ar3i95yc3ai7f9ljg45-decrypt-age-secrets.drv: build01: build01: input not substitutable: error: path '/nix/store/xqmbsf4zbphr1657ibx6smxqy01k1p69-mount-secret-fs' is required, but there is no substituter that can build it, asking the scheduler again
error: dependency '8ni9qrxgjyq90c8pvrk35f5z20262kcw-nixos-test-driver-monitoring.drv' failed
failed checks.aarch64-linux.mycelium 3m 58s
setup: 4x2i00yh66k810ld2vh5px0achvlqyzb-command-not-found.drv: build01: build01: input not substitutable: error: path '/nix/store/5fdmcpd1nqkzidxc440jdix6z98n16 …
setup:
4x2i00yh66k810ld2vh5px0achvlqyzb-command-not-found.drv: build01: build01: input not substitutable: error: path '/nix/store/5fdmcpd1nqkzidxc440jdix6z98n16gc-perl-5.42.3-env' is required, but there is no substituter that can build it, asking the scheduler again
6iaj3ylgwdlj60q3msjqgydjbfbr84ks-decrypt-age-secrets.drv: build01: build01: input not substitutable: error: path '/nix/store/xqmbsf4zbphr1657ibx6smxqy01k1p69-mount-secret-fs' is required, but there is no substituter that can build it, asking the scheduler again
narfm0vn9aibv663lar5hkdnjay1im3m-unit-nix-daemon.service.drv: build01: build01: input not substitutable: error: path '/nix/store/zc12x1yxf4yskzilqgq9ww7bfyfq1cvj-X-Restart-Triggers-nix-daemon' is required, but there is no substituter that can build it, asking the scheduler again
4x2i00yh66k810ld2vh5px0achvlqyzb-command-not-found.drv: build01: build01: input not substitutable: error: path '/nix/store/5fdmcpd1nqkzidxc440jdix6z98n16gc-perl-5.42.3-env' is required, but there is no substituter that can build it, asking the scheduler again
6iaj3ylgwdlj60q3msjqgydjbfbr84ks-decrypt-age-secrets.drv: build01: build01: input not substitutable: error: path '/nix/store/xqmbsf4zbphr1657ibx6smxqy01k1p69-mount-secret-fs' is required, but there is no substituter that can build it, asking the scheduler again
narfm0vn9aibv663lar5hkdnjay1im3m-unit-nix-daemon.service.drv: build01: build01: input not substitutable: error: path '/nix/store/zc12x1yxf4yskzilqgq9ww7bfyfq1cvj-X-Restart-Triggers-nix-daemon' is required, but there is no substituter that can build it, asking the scheduler again
4x2i00yh66k810ld2vh5px0achvlqyzb-command-not-found.drv: build01: build01: input not substitutable: error: path '/nix/store/5fdmcpd1nqkzidxc440jdix6z98n16gc-perl-5.42.3-env' is required, but there is no substituter that can build it, asking the scheduler again
error: dependency 'v1vwhxp4y1vynplmkv2jgn670h5jy8ci-nixos-test-driver-mycelium.drv' failed
failed checks.aarch64-linux.ncps 49s
setup: 4x2i00yh66k810ld2vh5px0achvlqyzb-command-not-found.drv: build01: build01: input not substitutable: error: path '/nix/store/5fdmcpd1nqkzidxc440jdix6z98n16 …
setup:
4x2i00yh66k810ld2vh5px0achvlqyzb-command-not-found.drv: build01: build01: input not substitutable: error: path '/nix/store/5fdmcpd1nqkzidxc440jdix6z98n16gc-perl-5.42.3-env' is required, but there is no substituter that can build it, asking the scheduler again
g66fdvinfjr78qvdxgz9b314sw4gszc3-decrypt-age-secrets.drv: build01: build01: input not substitutable: error: path '/nix/store/xqmbsf4zbphr1657ibx6smxqy01k1p69-mount-secret-fs' is required, but there is no substituter that can build it, asking the scheduler again
jr2cy2nq73m6a16cp6i2qpm2lwxwb2y9-decrypt-age-secrets.drv: build01: build01: input not substitutable: error: path '/nix/store/xqmbsf4zbphr1657ibx6smxqy01k1p69-mount-secret-fs' is required, but there is no substituter that can build it, asking the scheduler again
4x2i00yh66k810ld2vh5px0achvlqyzb-command-not-found.drv: build01: the build this call attached to did not finish, retry, asking the scheduler again
g66fdvinfjr78qvdxgz9b314sw4gszc3-decrypt-age-secrets.drv: build01: build01: input not substitutable: error: path '/nix/store/xqmbsf4zbphr1657ibx6smxqy01k1p69-mount-secret-fs' is required, but there is no substituter that can build it, asking the scheduler again
jr2cy2nq73m6a16cp6i2qpm2lwxwb2y9-decrypt-age-secrets.drv: build01: build01: input not substitutable: error: path '/nix/store/xqmbsf4zbphr1657ibx6smxqy01k1p69-mount-secret-fs' is required, but there is no substituter that can build it, asking the scheduler again
jr2cy2nq73m6a16cp6i2qpm2lwxwb2y9-decrypt-age-secrets.drv: build01: build01: input not substitutable: error: path '/nix/store/xqmbsf4zbphr1657ibx6smxqy01k1p69-mount-secret-fs' is required, but there is no substituter that can build it, asking the scheduler again
error: dependency 'mm0pyqpdw6k95xklzilfbidzip0rw49m-nixos-test-driver-ncps.drv' failed
failed checks.aarch64-linux.nixos-systemd-abstraction 12m 18s
setup: 4x2i00yh66k810ld2vh5px0achvlqyzb-command-not-found.drv: build01: build01: input not substitutable: error: path '/nix/store/5fdmcpd1nqkzidxc440jdix6z98n16 …
setup:
4x2i00yh66k810ld2vh5px0achvlqyzb-command-not-found.drv: build01: build01: input not substitutable: error: path '/nix/store/5fdmcpd1nqkzidxc440jdix6z98n16gc-perl-5.42.3-env' is required, but there is no substituter that can build it, asking the scheduler again
4x2i00yh66k810ld2vh5px0achvlqyzb-command-not-found.drv: build01: build01: input not substitutable: error: path '/nix/store/5fdmcpd1nqkzidxc440jdix6z98n16gc-perl-5.42.3-env' is required, but there is no substituter that can build it, asking the scheduler again
4x2i00yh66k810ld2vh5px0achvlqyzb-command-not-found.drv: build01: build01: input not substitutable: error: path '/nix/store/5fdmcpd1nqkzidxc440jdix6z98n16gc-perl-5.42.3-env' is required, but there is no substituter that can build it, asking the scheduler again
4x2i00yh66k810ld2vh5px0achvlqyzb-command-not-found.drv: build01: the build this call attached to did not finish, retry, asking the scheduler again
4x2i00yh66k810ld2vh5px0achvlqyzb-command-not-found.drv: build01: build01: input not substitutable: error: path '/nix/store/5fdmcpd1nqkzidxc440jdix6z98n16gc-perl-5.42.3-env' is required, but there is no substituter that can build it, asking the scheduler again
4x2i00yh66k810ld2vh5px0achvlqyzb-command-not-found.drv: build01: the build this call attached to did not finish, retry, asking the scheduler again
4x2i00yh66k810ld2vh5px0achvlqyzb-command-not-found.drv: build01: the build this call attached to did not finish, retry, asking the scheduler again
error: dependency 'rnxbakmzj42z9flf8zdrknj854v6lf4v-nixos-test-driver-systemd-abstraction.drv' failed
failed checks.aarch64-linux.nixos-test-age-backend 1m 1s
setup: 4x2i00yh66k810ld2vh5px0achvlqyzb-command-not-found.drv: build01: the build this call attached to did not finish, retry, asking the scheduler again 0k7dvr …
setup:
4x2i00yh66k810ld2vh5px0achvlqyzb-command-not-found.drv: build01: the build this call attached to did not finish, retry, asking the scheduler again
0k7dvr3z30s0k16byb6ipnl5059mhps7-decrypt-age-secrets.drv: build01: build01: input not substitutable: error: path '/nix/store/xqmbsf4zbphr1657ibx6smxqy01k1p69-mount-secret-fs' is required, but there is no substituter that can build it, asking the scheduler again
narfm0vn9aibv663lar5hkdnjay1im3m-unit-nix-daemon.service.drv: build01: build01: input not substitutable: error: path '/nix/store/zc12x1yxf4yskzilqgq9ww7bfyfq1cvj-X-Restart-Triggers-nix-daemon' is required, but there is no substituter that can build it, asking the scheduler again
0k7dvr3z30s0k16byb6ipnl5059mhps7-decrypt-age-secrets.drv: build01: build01: input not substitutable: error: path '/nix/store/xqmbsf4zbphr1657ibx6smxqy01k1p69-mount-secret-fs' is required, but there is no substituter that can build it, asking the scheduler again
narfm0vn9aibv663lar5hkdnjay1im3m-unit-nix-daemon.service.drv: build01: build01: input not substitutable: error: path '/nix/store/zc12x1yxf4yskzilqgq9ww7bfyfq1cvj-X-Restart-Triggers-nix-daemon' is required, but there is no substituter that can build it, asking the scheduler again
0k7dvr3z30s0k16byb6ipnl5059mhps7-decrypt-age-secrets.drv: build01: build01: input not substitutable: error: path '/nix/store/xqmbsf4zbphr1657ibx6smxqy01k1p69-mount-secret-fs' is required, but there is no substituter that can build it, asking the scheduler again
narfm0vn9aibv663lar5hkdnjay1im3m-unit-nix-daemon.service.drv: build01: build01: input not substitutable: error: path '/nix/store/zc12x1yxf4yskzilqgq9ww7bfyfq1cvj-X-Restart-Triggers-nix-daemon' is required, but there is no substituter that can build it, asking the scheduler again
error: dependency 'b8pbnmnlmf631ag55s8cpkxnbcbsiv82-nixos-test-driver-nixos-test-age-backend.drv' failed
failed checks.aarch64-linux.nixos-test-container 35s
setup: 4x2i00yh66k810ld2vh5px0achvlqyzb-command-not-found.drv: build01: the build this call attached to did not finish, retry, asking the scheduler again 4x2i00 …
setup:
4x2i00yh66k810ld2vh5px0achvlqyzb-command-not-found.drv: build01: the build this call attached to did not finish, retry, asking the scheduler again
4x2i00yh66k810ld2vh5px0achvlqyzb-command-not-found.drv: build01: the build this call attached to did not finish, retry, asking the scheduler again
4x2i00yh66k810ld2vh5px0achvlqyzb-command-not-found.drv: build01: the build this call attached to did not finish, retry, asking the scheduler again
4x2i00yh66k810ld2vh5px0achvlqyzb-command-not-found.drv: build01: the build this call attached to did not finish, retry, asking the scheduler again
4x2i00yh66k810ld2vh5px0achvlqyzb-command-not-found.drv: build01: the build this call attached to did not finish, retry, asking the scheduler again
4x2i00yh66k810ld2vh5px0achvlqyzb-command-not-found.drv: build01: the build this call attached to did not finish, retry, asking the scheduler again
4x2i00yh66k810ld2vh5px0achvlqyzb-command-not-found.drv: build01: the build this call attached to did not finish, retry, asking the scheduler again
error: dependency 'pld0csva7235wc56v24xs5zxbj061mlh-nixos-test-driver-container.drv' failed
failed checks.aarch64-linux.nixos-test-extra-python-packages 2m 16s
setup: 4x2i00yh66k810ld2vh5px0achvlqyzb-command-not-found.drv: build01: the build this call attached to did not finish, retry, asking the scheduler again 4x2i00 …
setup:
4x2i00yh66k810ld2vh5px0achvlqyzb-command-not-found.drv: build01: the build this call attached to did not finish, retry, asking the scheduler again
4x2i00yh66k810ld2vh5px0achvlqyzb-command-not-found.drv: build01: the build this call attached to did not finish, retry, asking the scheduler again
4x2i00yh66k810ld2vh5px0achvlqyzb-command-not-found.drv: build01: build01: input not substitutable: error: path '/nix/store/5fdmcpd1nqkzidxc440jdix6z98n16gc-perl-5.42.3-env' is required, but there is no substituter that can build it, asking the scheduler again
4x2i00yh66k810ld2vh5px0achvlqyzb-command-not-found.drv: build01: the build this call attached to did not finish, retry, asking the scheduler again
4x2i00yh66k810ld2vh5px0achvlqyzb-command-not-found.drv: build01: build01: input not substitutable: error: path '/nix/store/5fdmcpd1nqkzidxc440jdix6z98n16gc-perl-5.42.3-env' is required, but there is no substituter that can build it, asking the scheduler again
4x2i00yh66k810ld2vh5px0achvlqyzb-command-not-found.drv: build01: the build this call attached to did not finish, retry, asking the scheduler again
4x2i00yh66k810ld2vh5px0achvlqyzb-command-not-found.drv: build01: build01: input not substitutable: error: path '/nix/store/5fdmcpd1nqkzidxc440jdix6z98n16gc-perl-5.42.3-env' is required, but there is no substituter that can build it, asking the scheduler again
error: dependency 'wb023py0nvaf4kkj4dckv76x5y94kl7b-nixos-test-driver-test-extra-python-packages.drv' failed
failed eval checks.aarch64-linux.nixos-test-password-store-mounts —
error: … while evaluating the attribute 'drvPath' at «https://releases.nixos.org/nixos/26.05/nixos-26.05.11628.f584496e0120/nixexprs.tar.xz?narH …
error:
       … while evaluating the attribute 'drvPath'
         at «https://releases.nixos.org/nixos/26.05/nixos-26.05.11628.f584496e0120/nixexprs.tar.xz?narHash=sha256-oADz%2BiVvVvE6aADkqywUEdNruts0BdExqgF20/0nd5o%3D»/lib/customisation.nix:427:7:
          426|     // {
          427|       drvPath =
             |       ^
          428|         assert condition;

       … while calling the 'derivationStrict' builtin
         at «nix-internal»/derivation-internal.nix:37:12:
           36|
           37|   strict = derivationStrict drvAttrs;
             |            ^
           38|

       … while evaluating the option `driverConfiguration.vlans':

       … while evaluating definitions from `/nix/store/g7h1h7cia44ljg4wcrhq3vca5gm5mv9k-source/nixos/lib/testing/driver-configuration.nix':

       … while evaluating the option `nodes.machine.networking.interfaces':

       … while evaluating definitions from `/nix/store/g7h1h7cia44ljg4wcrhq3vca5gm5mv9k-source/nixos/modules/hardware/facter/networking':

       … while evaluating the option `nodes.machine.hardware.facter.enable':

       … while evaluating the option `nodes.machine.hardware.facter.report':

       … while evaluating the option `nodes.machine.hardware.facter.reportPath':

       … while evaluating definitions from `/nix/store/i66i58drxvil0pcfgvg0b4x92qic5f8z-source/nixosModules/clanCore/nixos-facter.nix':

       (stack trace truncated; use '--show-trace' to show the full, detailed trace)

       error: build of '/nix/store/2npa8ksh6qq562d7ydcvxg18h7hkjc3v-merged-test-dir-nixos-test-password-store-mounts.drv^out' failed: error: dependency 'kzq24jlnnp1gdcb31rnf2d2cznvp794d-test-vars-generated.drv' failed
failed checks.aarch64-linux.nixos-test-secrets 2m 28s
setup: 4x2i00yh66k810ld2vh5px0achvlqyzb-command-not-found.drv: build01: build01: input not substitutable: error: path '/nix/store/5fdmcpd1nqkzidxc440jdix6z98n16 …
setup:
4x2i00yh66k810ld2vh5px0achvlqyzb-command-not-found.drv: build01: build01: input not substitutable: error: path '/nix/store/5fdmcpd1nqkzidxc440jdix6z98n16gc-perl-5.42.3-env' is required, but there is no substituter that can build it, asking the scheduler again
ahwky2imndrhg86zbs119ldh71fs54x8-X-Restart-Triggers-nix-daemon.drv: build01: build01: input not substitutable: error: path '/nix/store/9d7gg64nc7x6cp7p8baznwr3agibzmfr-nix.conf' is required, but there is no substituter that can build it, asking the scheduler again
4x2i00yh66k810ld2vh5px0achvlqyzb-command-not-found.drv: build01: build01: input not substitutable: error: path '/nix/store/5fdmcpd1nqkzidxc440jdix6z98n16gc-perl-5.42.3-env' is required, but there is no substituter that can build it, asking the scheduler again
ahwky2imndrhg86zbs119ldh71fs54x8-X-Restart-Triggers-nix-daemon.drv: build01: build01: input not substitutable: error: path '/nix/store/9d7gg64nc7x6cp7p8baznwr3agibzmfr-nix.conf' is required, but there is no substituter that can build it, asking the scheduler again
4x2i00yh66k810ld2vh5px0achvlqyzb-command-not-found.drv: build01: build01: input not substitutable: error: path '/nix/store/5fdmcpd1nqkzidxc440jdix6z98n16gc-perl-5.42.3-env' is required, but there is no substituter that can build it, asking the scheduler again
ahwky2imndrhg86zbs119ldh71fs54x8-X-Restart-Triggers-nix-daemon.drv: build01: build01: input not substitutable: error: path '/nix/store/9d7gg64nc7x6cp7p8baznwr3agibzmfr-nix.conf' is required, but there is no substituter that can build it, asking the scheduler again
4x2i00yh66k810ld2vh5px0achvlqyzb-command-not-found.drv: build01: build01: input not substitutable: error: path '/nix/store/5fdmcpd1nqkzidxc440jdix6z98n16gc-perl-5.42.3-env' is required, but there is no substituter that can build it, asking the scheduler again
error: dependency '59b5753qxy0bd87wfvwrqn12878aw2yv-nixos-test-driver-secrets.drv' failed
failed checks.aarch64-linux.nixos-test-user-firewall-iptables 2m 11s
setup: 4x2i00yh66k810ld2vh5px0achvlqyzb-command-not-found.drv: build01: build01: input not substitutable: error: path '/nix/store/5fdmcpd1nqkzidxc440jdix6z98n16 …
setup:
4x2i00yh66k810ld2vh5px0achvlqyzb-command-not-found.drv: build01: build01: input not substitutable: error: path '/nix/store/5fdmcpd1nqkzidxc440jdix6z98n16gc-perl-5.42.3-env' is required, but there is no substituter that can build it, asking the scheduler again
d1h1hxqcpbrrgi0vqfy0hxjy6xjhr7ml-unit-generate-shutdown-ramfs.service.drv: error: gRPC AddMultipleToStore on 'nix-store.geninf.io:50051' failed: error: some references of path '/nix/store/qm6jbx3ja7qqj650zv7sv2jplvp8xkwb-shutdown-ramfs-contents.json.drv' could not be realised
4x2i00yh66k810ld2vh5px0achvlqyzb-command-not-found.drv: build01: the build this call attached to did not finish, retry, asking the scheduler again
4x2i00yh66k810ld2vh5px0achvlqyzb-command-not-found.drv: build01: build01: input not substitutable: error: path '/nix/store/5fdmcpd1nqkzidxc440jdix6z98n16gc-perl-5.42.3-env' is required, but there is no substituter that can build it, asking the scheduler again
4x2i00yh66k810ld2vh5px0achvlqyzb-command-not-found.drv: build01: build01: input not substitutable: error: path '/nix/store/5fdmcpd1nqkzidxc440jdix6z98n16gc-perl-5.42.3-env' is required, but there is no substituter that can build it, asking the scheduler again
4x2i00yh66k810ld2vh5px0achvlqyzb-command-not-found.drv: build01: build01: input not substitutable: error: path '/nix/store/5fdmcpd1nqkzidxc440jdix6z98n16gc-perl-5.42.3-env' is required, but there is no substituter that can build it, asking the scheduler again
4x2i00yh66k810ld2vh5px0achvlqyzb-command-not-found.drv: build01: build01: input not substitutable: error: path '/nix/store/5fdmcpd1nqkzidxc440jdix6z98n16gc-perl-5.42.3-env' is required, but there is no substituter that can build it, asking the scheduler again
error: dependency '34x032qri3yj9c73570545fl172dg8d7-nixos-test-driver-user-firewall-iptables.drv' failed
failed checks.aarch64-linux.nixos-test-user-firewall-nftables 3m 12s
setup: 4x2i00yh66k810ld2vh5px0achvlqyzb-command-not-found.drv: build01: build01: input not substitutable: error: path '/nix/store/5fdmcpd1nqkzidxc440jdix6z98n16 …
setup:
4x2i00yh66k810ld2vh5px0achvlqyzb-command-not-found.drv: build01: build01: input not substitutable: error: path '/nix/store/5fdmcpd1nqkzidxc440jdix6z98n16gc-perl-5.42.3-env' is required, but there is no substituter that can build it, asking the scheduler again
4x2i00yh66k810ld2vh5px0achvlqyzb-command-not-found.drv: build01: build01: input not substitutable: error: path '/nix/store/5fdmcpd1nqkzidxc440jdix6z98n16gc-perl-5.42.3-env' is required, but there is no substituter that can build it, asking the scheduler again
4x2i00yh66k810ld2vh5px0achvlqyzb-command-not-found.drv: build01: build01: input not substitutable: error: path '/nix/store/5fdmcpd1nqkzidxc440jdix6z98n16gc-perl-5.42.3-env' is required, but there is no substituter that can build it, asking the scheduler again
4x2i00yh66k810ld2vh5px0achvlqyzb-command-not-found.drv: build01: build01: input not substitutable: error: path '/nix/store/5fdmcpd1nqkzidxc440jdix6z98n16gc-perl-5.42.3-env' is required, but there is no substituter that can build it, asking the scheduler again
4x2i00yh66k810ld2vh5px0achvlqyzb-command-not-found.drv: build01: build01: input not substitutable: error: path '/nix/store/5fdmcpd1nqkzidxc440jdix6z98n16gc-perl-5.42.3-env' is required, but there is no substituter that can build it, asking the scheduler again
4x2i00yh66k810ld2vh5px0achvlqyzb-command-not-found.drv: build01: build01: input not substitutable: error: path '/nix/store/5fdmcpd1nqkzidxc440jdix6z98n16gc-perl-5.42.3-env' is required, but there is no substituter that can build it, asking the scheduler again
4x2i00yh66k810ld2vh5px0achvlqyzb-command-not-found.drv: build01: build01: input not substitutable: error: path '/nix/store/5fdmcpd1nqkzidxc440jdix6z98n16gc-perl-5.42.3-env' is required, but there is no substituter that can build it, asking the scheduler again
error: dependency 'dpg5yg9s7mpjd7j8n9nvz0550m0qy75y-nixos-test-driver-user-firewall-nftables.drv' failed
failed checks.aarch64-linux.nixos-test-wayland-proxy-virtwl 1m 13s
setup: 4x2i00yh66k810ld2vh5px0achvlqyzb-command-not-found.drv: build01: build01: input not substitutable: error: path '/nix/store/5fdmcpd1nqkzidxc440jdix6z98n16 …
setup:
4x2i00yh66k810ld2vh5px0achvlqyzb-command-not-found.drv: build01: build01: input not substitutable: error: path '/nix/store/5fdmcpd1nqkzidxc440jdix6z98n16gc-perl-5.42.3-env' is required, but there is no substituter that can build it, asking the scheduler again
4x2i00yh66k810ld2vh5px0achvlqyzb-command-not-found.drv: build01: build01: input not substitutable: error: path '/nix/store/5fdmcpd1nqkzidxc440jdix6z98n16gc-perl-5.42.3-env' is required, but there is no substituter that can build it, asking the scheduler again
ahwky2imndrhg86zbs119ldh71fs54x8-X-Restart-Triggers-nix-daemon.drv: build01: build01: input not substitutable: error: path '/nix/store/9d7gg64nc7x6cp7p8baznwr3agibzmfr-nix.conf' is required, but there is no substituter that can build it, asking the scheduler again
4x2i00yh66k810ld2vh5px0achvlqyzb-command-not-found.drv: build01: build01: input not substitutable: error: path '/nix/store/5fdmcpd1nqkzidxc440jdix6z98n16gc-perl-5.42.3-env' is required, but there is no substituter that can build it, asking the scheduler again
ahwky2imndrhg86zbs119ldh71fs54x8-X-Restart-Triggers-nix-daemon.drv: build01: build01: input not substitutable: error: path '/nix/store/9d7gg64nc7x6cp7p8baznwr3agibzmfr-nix.conf' is required, but there is no substituter that can build it, asking the scheduler again
ahwky2imndrhg86zbs119ldh71fs54x8-X-Restart-Triggers-nix-daemon.drv: build01: the build this call attached to did not finish, retry, asking the scheduler again
4x2i00yh66k810ld2vh5px0achvlqyzb-command-not-found.drv: build01: the build this call attached to did not finish, retry, asking the scheduler again
error: dependency 'v3shl8bnvyk7pfdfbgsv8nhbrg0vlhz0-nixos-test-driver-wayland-proxy-virtwl.drv' failed
failed eval checks.aarch64-linux.p2p-ssh-iroh —
error: … while evaluating the attribute 'drvPath' at «https://releases.nixos.org/nixos/26.05/nixos-26.05.11628.f584496e0120/nixexprs.tar.xz?narH …
error:
       … while evaluating the attribute 'drvPath'
         at «https://releases.nixos.org/nixos/26.05/nixos-26.05.11628.f584496e0120/nixexprs.tar.xz?narHash=sha256-oADz%2BiVvVvE6aADkqywUEdNruts0BdExqgF20/0nd5o%3D»/lib/customisation.nix:427:7:
          426|     // {
          427|       drvPath =
             |       ^
          428|         assert condition;

       … while calling the 'derivationStrict' builtin
         at «nix-internal»/derivation-internal.nix:37:12:
           36|
           37|   strict = derivationStrict drvAttrs;
             |            ^
           38|

       … while evaluating the option `nodes.client.networking.interfaces':

       … while evaluating definitions from `/nix/store/g7h1h7cia44ljg4wcrhq3vca5gm5mv9k-source/nixos/modules/hardware/facter/networking':

       … while evaluating the option `nodes.client.hardware.facter.enable':

       … while evaluating the option `nodes.client.hardware.facter.report':

       … while evaluating the option `nodes.client.hardware.facter.reportPath':

       … while evaluating definitions from `/nix/store/i66i58drxvil0pcfgvg0b4x92qic5f8z-source/nixosModules/clanCore/nixos-facter.nix':

       (stack trace truncated; use '--show-trace' to show the full, detailed trace)

       error: build of '/nix/store/662y1c8sqnn6jw3x8w27n4i0dw0g0p85-merged-test-dir-clan-test-p2p-ssh-iroh.drv^out' failed: error: gave up after 9 reschedules
failed checks.aarch64-linux.packages 54s
setup: 4x2i00yh66k810ld2vh5px0achvlqyzb-command-not-found.drv: build01: build01: input not substitutable: error: path '/nix/store/5fdmcpd1nqkzidxc440jdix6z98n16 …
setup:
4x2i00yh66k810ld2vh5px0achvlqyzb-command-not-found.drv: build01: build01: input not substitutable: error: path '/nix/store/5fdmcpd1nqkzidxc440jdix6z98n16gc-perl-5.42.3-env' is required, but there is no substituter that can build it, asking the scheduler again
ahwky2imndrhg86zbs119ldh71fs54x8-X-Restart-Triggers-nix-daemon.drv: build01: build01: input not substitutable: error: path '/nix/store/9d7gg64nc7x6cp7p8baznwr3agibzmfr-nix.conf' is required, but there is no substituter that can build it, asking the scheduler again
g66fdvinfjr78qvdxgz9b314sw4gszc3-decrypt-age-secrets.drv: build01: the build this call attached to did not finish, retry, asking the scheduler again
4x2i00yh66k810ld2vh5px0achvlqyzb-command-not-found.drv: build01: the build this call attached to did not finish, retry, asking the scheduler again
g66fdvinfjr78qvdxgz9b314sw4gszc3-decrypt-age-secrets.drv: build01: the build this call attached to did not finish, retry, asking the scheduler again
ahwky2imndrhg86zbs119ldh71fs54x8-X-Restart-Triggers-nix-daemon.drv: build01: build01: input not substitutable: error: path '/nix/store/9d7gg64nc7x6cp7p8baznwr3agibzmfr-nix.conf' is required, but there is no substituter that can build it, asking the scheduler again
ahwky2imndrhg86zbs119ldh71fs54x8-X-Restart-Triggers-nix-daemon.drv: build01: build01: input not substitutable: error: path '/nix/store/9d7gg64nc7x6cp7p8baznwr3agibzmfr-nix.conf' is required, but there is no substituter that can build it, asking the scheduler again
error: dependency '0r0650map7xq8rarvbrd8w1xqvry8dhi-nixos-test-driver-packages.drv' failed
failed eval checks.aarch64-linux.pki —
error: … while evaluating the attribute 'drvPath' at «https://releases.nixos.org/nixos/26.05/nixos-26.05.11628.f584496e0120/nixexprs.tar.xz?narH …
error:
       … while evaluating the attribute 'drvPath'
         at «https://releases.nixos.org/nixos/26.05/nixos-26.05.11628.f584496e0120/nixexprs.tar.xz?narHash=sha256-oADz%2BiVvVvE6aADkqywUEdNruts0BdExqgF20/0nd5o%3D»/lib/customisation.nix:427:7:
          426|     // {
          427|       drvPath =
             |       ^
          428|         assert condition;

       … while calling the 'derivationStrict' builtin
         at «nix-internal»/derivation-internal.nix:37:12:
           36|
           37|   strict = derivationStrict drvAttrs;
             |            ^
           38|

       … while evaluating the option `driverConfiguration.vlans':

       … while evaluating definitions from `/nix/store/g7h1h7cia44ljg4wcrhq3vca5gm5mv9k-source/nixos/lib/testing/driver-configuration.nix':

       … while evaluating the option `nodes.caddy.networking.interfaces':

       … while evaluating definitions from `/nix/store/g7h1h7cia44ljg4wcrhq3vca5gm5mv9k-source/nixos/modules/hardware/facter/networking':

       … while evaluating the option `nodes.caddy.hardware.facter.enable':

       … while evaluating the option `nodes.caddy.hardware.facter.report':

       … while evaluating the option `nodes.caddy.hardware.facter.reportPath':

       … while evaluating definitions from `/nix/store/i66i58drxvil0pcfgvg0b4x92qic5f8z-source/nixosModules/clanCore/nixos-facter.nix':

       (stack trace truncated; use '--show-trace' to show the full, detailed trace)

       error: build of '/nix/store/c32pzv31szhkqdd9nwbczdivmrjc0lil-merged-test-dir-pki.drv^out' failed: error: gave up after 9 reschedules
failed checks.aarch64-linux.postgresql 53s
setup: g66fdvinfjr78qvdxgz9b314sw4gszc3-decrypt-age-secrets.drv: build01: the build this call attached to did not finish, retry, asking the scheduler again 4x2i …
setup:
g66fdvinfjr78qvdxgz9b314sw4gszc3-decrypt-age-secrets.drv: build01: the build this call attached to did not finish, retry, asking the scheduler again
4x2i00yh66k810ld2vh5px0achvlqyzb-command-not-found.drv: build01: the build this call attached to did not finish, retry, asking the scheduler again
5h3kimag6l6pljvnx39jphmb08pva54g-unit-nix-daemon.service.drv: build01: the build this call attached to did not finish, retry, asking the scheduler again
g66fdvinfjr78qvdxgz9b314sw4gszc3-decrypt-age-secrets.drv: build01: the build this call attached to did not finish, retry, asking the scheduler again
4x2i00yh66k810ld2vh5px0achvlqyzb-command-not-found.drv: build01: the build this call attached to did not finish, retry, asking the scheduler again
5h3kimag6l6pljvnx39jphmb08pva54g-unit-nix-daemon.service.drv: build01: build01: input not substitutable: error: path '/nix/store/zc12x1yxf4yskzilqgq9ww7bfyfq1cvj-X-Restart-Triggers-nix-daemon' is required, but there is no substituter that can build it, asking the scheduler again
g66fdvinfjr78qvdxgz9b314sw4gszc3-decrypt-age-secrets.drv: build01: build01: input not substitutable: error: path '/nix/store/xqmbsf4zbphr1657ibx6smxqy01k1p69-mount-secret-fs' is required, but there is no substituter that can build it, asking the scheduler again
error: dependency '2na56nkm7g1fxdmzvx3yhfydhm7jw170-nixos-test-driver-service-postgresql.drv' failed
failed checks.aarch64-linux.service-dummy-test 53s
setup: 7d17di14jdlzlp6faay5gkpkw6bdr6zc-decrypt-age-secrets.drv: build01: build01: input not substitutable: error: path '/nix/store/xqmbsf4zbphr1657ibx6smxqy01k …
setup:
7d17di14jdlzlp6faay5gkpkw6bdr6zc-decrypt-age-secrets.drv: build01: build01: input not substitutable: error: path '/nix/store/xqmbsf4zbphr1657ibx6smxqy01k1p69-mount-secret-fs' is required, but there is no substituter that can build it, asking the scheduler again
g66fdvinfjr78qvdxgz9b314sw4gszc3-decrypt-age-secrets.drv: build01: build01: input not substitutable: error: path '/nix/store/xqmbsf4zbphr1657ibx6smxqy01k1p69-mount-secret-fs' is required, but there is no substituter that can build it, asking the scheduler again
4x2i00yh66k810ld2vh5px0achvlqyzb-command-not-found.drv: build01: the build this call attached to did not finish, retry, asking the scheduler again
7d17di14jdlzlp6faay5gkpkw6bdr6zc-decrypt-age-secrets.drv: build01: build01: input not substitutable: error: path '/nix/store/xqmbsf4zbphr1657ibx6smxqy01k1p69-mount-secret-fs' is required, but there is no substituter that can build it, asking the scheduler again
5h3kimag6l6pljvnx39jphmb08pva54g-unit-nix-daemon.service.drv: build01: build01: input not substitutable: error: path '/nix/store/zc12x1yxf4yskzilqgq9ww7bfyfq1cvj-X-Restart-Triggers-nix-daemon' is required, but there is no substituter that can build it, asking the scheduler again
4x2i00yh66k810ld2vh5px0achvlqyzb-command-not-found.drv: build01: the build this call attached to did not finish, retry, asking the scheduler again
7d17di14jdlzlp6faay5gkpkw6bdr6zc-decrypt-age-secrets.drv: build01: build01: input not substitutable: error: path '/nix/store/xqmbsf4zbphr1657ibx6smxqy01k1p69-mount-secret-fs' is required, but there is no substituter that can build it, asking the scheduler again
error: dependency 'p248g5nw0yzh5gx8n37bkyf1779yi9a2-nixos-test-driver-service-dummy-test.drv' failed
failed checks.aarch64-linux.service-dummy-test-from-flake 12m 6s
setup: xdd8d4gm9lijj2ircjg51zs3izr9zw0z-decrypt-age-secrets.drv: build01: build01: input not substitutable: error: path '/nix/store/xqmbsf4zbphr1657ibx6smxqy01k …
setup:
xdd8d4gm9lijj2ircjg51zs3izr9zw0z-decrypt-age-secrets.drv: build01: build01: input not substitutable: error: path '/nix/store/xqmbsf4zbphr1657ibx6smxqy01k1p69-mount-secret-fs' is required, but there is no substituter that can build it, asking the scheduler again
xdd8d4gm9lijj2ircjg51zs3izr9zw0z-decrypt-age-secrets.drv: build01: build01: input not substitutable: error: path '/nix/store/xqmbsf4zbphr1657ibx6smxqy01k1p69-mount-secret-fs' is required, but there is no substituter that can build it, asking the scheduler again
xdd8d4gm9lijj2ircjg51zs3izr9zw0z-decrypt-age-secrets.drv: build01: build01: input not substitutable: error: path '/nix/store/xqmbsf4zbphr1657ibx6smxqy01k1p69-mount-secret-fs' is required, but there is no substituter that can build it, asking the scheduler again
xdd8d4gm9lijj2ircjg51zs3izr9zw0z-decrypt-age-secrets.drv: build01: build01: input not substitutable: error: path '/nix/store/xqmbsf4zbphr1657ibx6smxqy01k1p69-mount-secret-fs' is required, but there is no substituter that can build it, asking the scheduler again
xdd8d4gm9lijj2ircjg51zs3izr9zw0z-decrypt-age-secrets.drv: build01: build01: input not substitutable: error: path '/nix/store/xqmbsf4zbphr1657ibx6smxqy01k1p69-mount-secret-fs' is required, but there is no substituter that can build it, asking the scheduler again
siqlm7gwzl4lxbgbhay6z855v69d0vq6-clan-runtime.drv: build01: not scheduled here: siqlm7gwzl4lxbgbhay6z855v69d0vq6-clan-runtime.drv, asking the scheduler again
ik4p2lj1cihwb7j7rdw0v7h4c2g5kp19-offline-flake-for-test-service-dummy-test-from-flake.drv: build01: not scheduled here: ik4p2lj1cihwb7j7rdw0v7h4c2g5kp19-offline-flake-for-test-service-dummy-test-from-flake.drv, asking the scheduler again
error: dependency '8a7ajb5q1bla4hw015s8lqwfkay4k3gv-nixos-test-driver-service-dummy-test-from-flake.drv' failed
failed checks.aarch64-linux.sshd 2m 53s
setup: 4x2i00yh66k810ld2vh5px0achvlqyzb-command-not-found.drv: build01: build01: input not substitutable: error: path '/nix/store/5fdmcpd1nqkzidxc440jdix6z98n16 …
setup:
4x2i00yh66k810ld2vh5px0achvlqyzb-command-not-found.drv: build01: build01: input not substitutable: error: path '/nix/store/5fdmcpd1nqkzidxc440jdix6z98n16gc-perl-5.42.3-env' is required, but there is no substituter that can build it, asking the scheduler again
g66fdvinfjr78qvdxgz9b314sw4gszc3-decrypt-age-secrets.drv: build01: build01: input not substitutable: error: path '/nix/store/xqmbsf4zbphr1657ibx6smxqy01k1p69-mount-secret-fs' is required, but there is no substituter that can build it, asking the scheduler again
5h3kimag6l6pljvnx39jphmb08pva54g-unit-nix-daemon.service.drv: build01: build01: input not substitutable: error: path '/nix/store/zc12x1yxf4yskzilqgq9ww7bfyfq1cvj-X-Restart-Triggers-nix-daemon' is required, but there is no substituter that can build it, asking the scheduler again
738hzqvsvj22d2bdh6lv0f8z42anl3mi-decrypt-age-secrets.drv: build01: build01: input not substitutable: error: path '/nix/store/xqmbsf4zbphr1657ibx6smxqy01k1p69-mount-secret-fs' is required, but there is no substituter that can build it, asking the scheduler again
4x2i00yh66k810ld2vh5px0achvlqyzb-command-not-found.drv: build01: build01: input not substitutable: error: path '/nix/store/5fdmcpd1nqkzidxc440jdix6z98n16gc-perl-5.42.3-env' is required, but there is no substituter that can build it, asking the scheduler again
5h3kimag6l6pljvnx39jphmb08pva54g-unit-nix-daemon.service.drv: build01: build01: input not substitutable: error: path '/nix/store/zc12x1yxf4yskzilqgq9ww7bfyfq1cvj-X-Restart-Triggers-nix-daemon' is required, but there is no substituter that can build it, asking the scheduler again
738hzqvsvj22d2bdh6lv0f8z42anl3mi-decrypt-age-secrets.drv: build01: build01: input not substitutable: error: path '/nix/store/xqmbsf4zbphr1657ibx6smxqy01k1p69-mount-secret-fs' is required, but there is no substituter that can build it, asking the scheduler again
error: dependency 'x8ymw2h7insq3ymswpskflplwmk13l5m-nixos-test-driver-sshd.drv' failed
failed checks.aarch64-linux.sshd-no-ca 3m 30s
setup: 3mlmhmj5nrs0idm56vx2rawc95lqmm54-decrypt-age-secrets.drv: build01: build01: input not substitutable: error: path '/nix/store/xqmbsf4zbphr1657ibx6smxqy01k …
setup:
3mlmhmj5nrs0idm56vx2rawc95lqmm54-decrypt-age-secrets.drv: build01: build01: input not substitutable: error: path '/nix/store/xqmbsf4zbphr1657ibx6smxqy01k1p69-mount-secret-fs' is required, but there is no substituter that can build it, asking the scheduler again
4x2i00yh66k810ld2vh5px0achvlqyzb-command-not-found.drv: build01: the build this call attached to did not finish, retry, asking the scheduler again
5h3kimag6l6pljvnx39jphmb08pva54g-unit-nix-daemon.service.drv: build01: build01: input not substitutable: error: path '/nix/store/zc12x1yxf4yskzilqgq9ww7bfyfq1cvj-X-Restart-Triggers-nix-daemon' is required, but there is no substituter that can build it, asking the scheduler again
g66fdvinfjr78qvdxgz9b314sw4gszc3-decrypt-age-secrets.drv: build01: build01: input not substitutable: error: path '/nix/store/xqmbsf4zbphr1657ibx6smxqy01k1p69-mount-secret-fs' is required, but there is no substituter that can build it, asking the scheduler again
4x2i00yh66k810ld2vh5px0achvlqyzb-command-not-found.drv: build01: build01: input not substitutable: error: path '/nix/store/5fdmcpd1nqkzidxc440jdix6z98n16gc-perl-5.42.3-env' is required, but there is no substituter that can build it, asking the scheduler again
3mlmhmj5nrs0idm56vx2rawc95lqmm54-decrypt-age-secrets.drv: build01: build01: input not substitutable: error: path '/nix/store/xqmbsf4zbphr1657ibx6smxqy01k1p69-mount-secret-fs' is required, but there is no substituter that can build it, asking the scheduler again
5h3kimag6l6pljvnx39jphmb08pva54g-unit-nix-daemon.service.drv: build01: build01: input not substitutable: error: path '/nix/store/zc12x1yxf4yskzilqgq9ww7bfyfq1cvj-X-Restart-Triggers-nix-daemon' is required, but there is no substituter that can build it, asking the scheduler again
error: dependency 'gswsn63fsb10da7c43fkrfrb0fjv0443-nixos-test-driver-sshd.drv' failed
failed checks.aarch64-linux.state-version 48s
setup: ahwky2imndrhg86zbs119ldh71fs54x8-X-Restart-Triggers-nix-daemon.drv: build01: the build this call attached to did not finish, retry, asking the scheduler …
setup:
ahwky2imndrhg86zbs119ldh71fs54x8-X-Restart-Triggers-nix-daemon.drv: build01: the build this call attached to did not finish, retry, asking the scheduler again
g66fdvinfjr78qvdxgz9b314sw4gszc3-decrypt-age-secrets.drv: build01: the build this call attached to did not finish, retry, asking the scheduler again
4x2i00yh66k810ld2vh5px0achvlqyzb-command-not-found.drv: build01: build01: input not substitutable: error: path '/nix/store/5fdmcpd1nqkzidxc440jdix6z98n16gc-perl-5.42.3-env' is required, but there is no substituter that can build it, asking the scheduler again
g66fdvinfjr78qvdxgz9b314sw4gszc3-decrypt-age-secrets.drv: build01: build01: input not substitutable: error: path '/nix/store/xqmbsf4zbphr1657ibx6smxqy01k1p69-mount-secret-fs' is required, but there is no substituter that can build it, asking the scheduler again
ahwky2imndrhg86zbs119ldh71fs54x8-X-Restart-Triggers-nix-daemon.drv: build01: the build this call attached to did not finish, retry, asking the scheduler again
4x2i00yh66k810ld2vh5px0achvlqyzb-command-not-found.drv: build01: the build this call attached to did not finish, retry, asking the scheduler again
ahwky2imndrhg86zbs119ldh71fs54x8-X-Restart-Triggers-nix-daemon.drv: build01: the build this call attached to did not finish, retry, asking the scheduler again
error: dependency 'f58dqcip6njpb94q07qp12c4sk74fpp6-nixos-test-driver-service-state-version.drv' failed
failed eval checks.aarch64-linux.syncthing-service —
error: … while evaluating the attribute 'drvPath' at «https://releases.nixos.org/nixos/26.05/nixos-26.05.11628.f584496e0120/nixexprs.tar.xz?narH …
error:
       … while evaluating the attribute 'drvPath'
         at «https://releases.nixos.org/nixos/26.05/nixos-26.05.11628.f584496e0120/nixexprs.tar.xz?narHash=sha256-oADz%2BiVvVvE6aADkqywUEdNruts0BdExqgF20/0nd5o%3D»/lib/customisation.nix:427:7:
          426|     // {
          427|       drvPath =
             |       ^
          428|         assert condition;

       … while calling the 'derivationStrict' builtin
         at «nix-internal»/derivation-internal.nix:37:12:
           36|
           37|   strict = derivationStrict drvAttrs;
             |            ^
           38|

       … while evaluating the option `nodes.machine1.networking.interfaces':

       … while evaluating definitions from `/nix/store/g7h1h7cia44ljg4wcrhq3vca5gm5mv9k-source/nixos/modules/hardware/facter/networking':

       … while evaluating the option `nodes.machine1.hardware.facter.enable':

       … while evaluating the option `nodes.machine1.hardware.facter.report':

       … while evaluating the option `nodes.machine1.hardware.facter.reportPath':

       … while evaluating definitions from `/nix/store/i66i58drxvil0pcfgvg0b4x92qic5f8z-source/nixosModules/clanCore/nixos-facter.nix':

       (stack trace truncated; use '--show-trace' to show the full, detailed trace)

       error: build of '/nix/store/s0ffyljja91iyibg12pivpxdj7ipj3lh-merged-test-dir-syncthing-service.drv^out' failed: error: gave up after 9 reschedules
failed checks.aarch64-linux.trusted-nix-caches 46s
setup: g66fdvinfjr78qvdxgz9b314sw4gszc3-decrypt-age-secrets.drv: build01: the build this call attached to did not finish, retry, asking the scheduler again g66f …
setup:
g66fdvinfjr78qvdxgz9b314sw4gszc3-decrypt-age-secrets.drv: build01: the build this call attached to did not finish, retry, asking the scheduler again
g66fdvinfjr78qvdxgz9b314sw4gszc3-decrypt-age-secrets.drv: build01: the build this call attached to did not finish, retry, asking the scheduler again
4x2i00yh66k810ld2vh5px0achvlqyzb-command-not-found.drv: build01: the build this call attached to did not finish, retry, asking the scheduler again
g66fdvinfjr78qvdxgz9b314sw4gszc3-decrypt-age-secrets.drv: build01: the build this call attached to did not finish, retry, asking the scheduler again
4x2i00yh66k810ld2vh5px0achvlqyzb-command-not-found.drv: build01: build01: input not substitutable: error: path '/nix/store/5fdmcpd1nqkzidxc440jdix6z98n16gc-perl-5.42.3-env' is required, but there is no substituter that can build it, asking the scheduler again
g66fdvinfjr78qvdxgz9b314sw4gszc3-decrypt-age-secrets.drv: build01: build01: input not substitutable: error: path '/nix/store/xqmbsf4zbphr1657ibx6smxqy01k1p69-mount-secret-fs' is required, but there is no substituter that can build it, asking the scheduler again
4x2i00yh66k810ld2vh5px0achvlqyzb-command-not-found.drv: build01: the build this call attached to did not finish, retry, asking the scheduler again
error: dependency 'y0wsxsf84y4b81iq1v99gryy1m8x6sra-nixos-test-driver-trusted-nix-caches.drv' failed
failed eval checks.aarch64-linux.users —
error: … while evaluating the attribute 'drvPath' at «https://releases.nixos.org/nixos/26.05/nixos-26.05.11628.f584496e0120/nixexprs.tar.xz?narH …
error:
       … while evaluating the attribute 'drvPath'
         at «https://releases.nixos.org/nixos/26.05/nixos-26.05.11628.f584496e0120/nixexprs.tar.xz?narHash=sha256-oADz%2BiVvVvE6aADkqywUEdNruts0BdExqgF20/0nd5o%3D»/lib/customisation.nix:427:7:
          426|     // {
          427|       drvPath =
             |       ^
          428|         assert condition;

       … while calling the 'derivationStrict' builtin
         at «nix-internal»/derivation-internal.nix:37:12:
           36|
           37|   strict = derivationStrict drvAttrs;
             |            ^
           38|

       … while evaluating the option `nodes.server.networking.interfaces':

       … while evaluating definitions from `/nix/store/g7h1h7cia44ljg4wcrhq3vca5gm5mv9k-source/nixos/modules/hardware/facter/networking':

       … while evaluating the option `nodes.server.hardware.facter.enable':

       … while evaluating the option `nodes.server.hardware.facter.report':

       … while evaluating the option `nodes.server.hardware.facter.reportPath':

       … while evaluating definitions from `/nix/store/i66i58drxvil0pcfgvg0b4x92qic5f8z-source/nixosModules/clanCore/nixos-facter.nix':

       (stack trace truncated; use '--show-trace' to show the full, detailed trace)

       error: build of '/nix/store/wjj1csz796rsk9nfz1fb3ygmj54jqkb7-merged-test-dir-users.drv^out' failed: error: gave up after 9 reschedules
failed eval checks.aarch64-linux.wifi —
error: … while evaluating the attribute 'drvPath' at «https://releases.nixos.org/nixos/26.05/nixos-26.05.11628.f584496e0120/nixexprs.tar.xz?narH …
error:
       … while evaluating the attribute 'drvPath'
         at «https://releases.nixos.org/nixos/26.05/nixos-26.05.11628.f584496e0120/nixexprs.tar.xz?narHash=sha256-oADz%2BiVvVvE6aADkqywUEdNruts0BdExqgF20/0nd5o%3D»/lib/customisation.nix:427:7:
          426|     // {
          427|       drvPath =
             |       ^
          428|         assert condition;

       … while calling the 'derivationStrict' builtin
         at «nix-internal»/derivation-internal.nix:37:12:
           36|
           37|   strict = derivationStrict drvAttrs;
             |            ^
           38|

       … while evaluating the option `driverConfiguration.vlans':

       … while evaluating definitions from `/nix/store/g7h1h7cia44ljg4wcrhq3vca5gm5mv9k-source/nixos/lib/testing/driver-configuration.nix':

       … while evaluating the option `nodes.second.networking.interfaces':

       … while evaluating definitions from `/nix/store/g7h1h7cia44ljg4wcrhq3vca5gm5mv9k-source/nixos/modules/hardware/facter/networking':

       … while evaluating the option `nodes.second.hardware.facter.enable':

       … while evaluating the option `nodes.second.hardware.facter.report':

       … while evaluating the option `nodes.second.hardware.facter.reportPath':

       … while evaluating definitions from `/nix/store/i66i58drxvil0pcfgvg0b4x92qic5f8z-source/nixosModules/clanCore/nixos-facter.nix':

       (stack trace truncated; use '--show-trace' to show the full, detailed trace)

       error: build of '/nix/store/41vn8y52hxjggs8l3qfsclr3qpwr9w7x-merged-test-dir-wifi.drv^out' failed: error: gave up after 9 reschedules
failed eval checks.aarch64-linux.wireguard —
error: … while evaluating the attribute 'drvPath' at «https://releases.nixos.org/nixos/26.05/nixos-26.05.11628.f584496e0120/nixexprs.tar.xz?narH …
error:
       … while evaluating the attribute 'drvPath'
         at «https://releases.nixos.org/nixos/26.05/nixos-26.05.11628.f584496e0120/nixexprs.tar.xz?narHash=sha256-oADz%2BiVvVvE6aADkqywUEdNruts0BdExqgF20/0nd5o%3D»/lib/customisation.nix:427:7:
          426|     // {
          427|       drvPath =
             |       ^
          428|         assert condition;

       … while calling the 'derivationStrict' builtin
         at «nix-internal»/derivation-internal.nix:37:12:
           36|
           37|   strict = derivationStrict drvAttrs;
             |            ^
           38|

       … while evaluating the option `nodes.controller1.networking.interfaces':

       … while evaluating definitions from `/nix/store/g7h1h7cia44ljg4wcrhq3vca5gm5mv9k-source/nixos/modules/hardware/facter/networking':

       … while evaluating the option `nodes.controller1.hardware.facter.enable':

       … while evaluating the option `nodes.controller1.hardware.facter.report':

       … while evaluating the option `nodes.controller1.hardware.facter.reportPath':

       … while evaluating definitions from `/nix/store/i66i58drxvil0pcfgvg0b4x92qic5f8z-source/nixosModules/clanCore/nixos-facter.nix':

       (stack trace truncated; use '--show-trace' to show the full, detailed trace)

       error: build of '/nix/store/bqv8zsy58v6f6jyz0lmdjxq33jvbjfwi-merged-test-dir-wireguard.drv^out' failed: error: gave up after 9 reschedules
failed checks.aarch64-linux.yggdrasil 38s
setup: ahwky2imndrhg86zbs119ldh71fs54x8-X-Restart-Triggers-nix-daemon.drv: build01: build01: input not substitutable: error: path '/nix/store/9d7gg64nc7x6cp7p8b …
setup:
ahwky2imndrhg86zbs119ldh71fs54x8-X-Restart-Triggers-nix-daemon.drv: build01: build01: input not substitutable: error: path '/nix/store/9d7gg64nc7x6cp7p8baznwr3agibzmfr-nix.conf' is required, but there is no substituter that can build it, asking the scheduler again
kllm2dnfpjc997y43d5iknilc3930xmg-decrypt-age-secrets.drv: build01: build01: input not substitutable: error: path '/nix/store/xqmbsf4zbphr1657ibx6smxqy01k1p69-mount-secret-fs' is required, but there is no substituter that can build it, asking the scheduler again
4x2i00yh66k810ld2vh5px0achvlqyzb-command-not-found.drv: build01: build01: input not substitutable: error: path '/nix/store/5fdmcpd1nqkzidxc440jdix6z98n16gc-perl-5.42.3-env' is required, but there is no substituter that can build it, asking the scheduler again
assnbwckmsxhz1iqqmwkiwwrphg76can-decrypt-age-secrets.drv: build01: build01: input not substitutable: error: path '/nix/store/xqmbsf4zbphr1657ibx6smxqy01k1p69-mount-secret-fs' is required, but there is no substituter that can build it, asking the scheduler again
ahwky2imndrhg86zbs119ldh71fs54x8-X-Restart-Triggers-nix-daemon.drv: build01: build01: input not substitutable: error: path '/nix/store/9d7gg64nc7x6cp7p8baznwr3agibzmfr-nix.conf' is required, but there is no substituter that can build it, asking the scheduler again
abjnba7xshybjiwhin9jwdfi3wqxjaa2-decrypt-age-secrets.drv: build01: build01: input not substitutable: error: path '/nix/store/xqmbsf4zbphr1657ibx6smxqy01k1p69-mount-secret-fs' is required, but there is no substituter that can build it, asking the scheduler again
kllm2dnfpjc997y43d5iknilc3930xmg-decrypt-age-secrets.drv: build01: build01: input not substitutable: error: path '/nix/store/xqmbsf4zbphr1657ibx6smxqy01k1p69-mount-secret-fs' is required, but there is no substituter that can build it, asking the scheduler again
error: dependency 'vk4iypz873ms0ala3g6hmq29y60bj4h3-nixos-test-driver-yggdrasil.drv' failed
failed checks.aarch64-linux.zerotier 4m 24s
setup: is5z7fr3ddby830v58hnhd51jcv9yx29-decrypt-age-secrets.drv: build01: build01: input not substitutable: error: path '/nix/store/xqmbsf4zbphr1657ibx6smxqy01k …
setup:
is5z7fr3ddby830v58hnhd51jcv9yx29-decrypt-age-secrets.drv: build01: build01: input not substitutable: error: path '/nix/store/xqmbsf4zbphr1657ibx6smxqy01k1p69-mount-secret-fs' is required, but there is no substituter that can build it, asking the scheduler again
4x2i00yh66k810ld2vh5px0achvlqyzb-command-not-found.drv: build01: build01: input not substitutable: error: path '/nix/store/5fdmcpd1nqkzidxc440jdix6z98n16gc-perl-5.42.3-env' is required, but there is no substituter that can build it, asking the scheduler again
vlv5s6wzzy28lq4lrlh1nm8akbw643q3-decrypt-age-secrets.drv: build01: build01: input not substitutable: error: path '/nix/store/xqmbsf4zbphr1657ibx6smxqy01k1p69-mount-secret-fs' is required, but there is no substituter that can build it, asking the scheduler again
narfm0vn9aibv663lar5hkdnjay1im3m-unit-nix-daemon.service.drv: build01: build01: input not substitutable: error: path '/nix/store/zc12x1yxf4yskzilqgq9ww7bfyfq1cvj-X-Restart-Triggers-nix-daemon' is required, but there is no substituter that can build it, asking the scheduler again
xiphg4rjxnc76j7ywlxqv6mmkzsrjivc-decrypt-age-secrets.drv: build01: build01: input not substitutable: error: path '/nix/store/xqmbsf4zbphr1657ibx6smxqy01k1p69-mount-secret-fs' is required, but there is no substituter that can build it, asking the scheduler again
knlmkrqjahfqk2waflas2rvl1bag1rqa-decrypt-age-secrets.drv: build01: build01: input not substitutable: error: path '/nix/store/xqmbsf4zbphr1657ibx6smxqy01k1p69-mount-secret-fs' is required, but there is no substituter that can build it, asking the scheduler again
is5z7fr3ddby830v58hnhd51jcv9yx29-decrypt-age-secrets.drv: build01: build01: input not substitutable: error: path '/nix/store/xqmbsf4zbphr1657ibx6smxqy01k1p69-mount-secret-fs' is required, but there is no substituter that can build it, asking the scheduler again
error: dependency 'n4mgiz3jrks8xlzky0a809scah81sn4s-nixos-test-driver-zerotier.drv' failed
failed checks.aarch64-linux.zerotier-multi-instance 4m 9s
setup: s6b2dgx90f9jzi8pxg6bc463d96hg8yi-decrypt-age-secrets.drv: build01: build01: input not substitutable: error: path '/nix/store/xqmbsf4zbphr1657ibx6smxqy01k …
setup:
s6b2dgx90f9jzi8pxg6bc463d96hg8yi-decrypt-age-secrets.drv: build01: build01: input not substitutable: error: path '/nix/store/xqmbsf4zbphr1657ibx6smxqy01k1p69-mount-secret-fs' is required, but there is no substituter that can build it, asking the scheduler again
8jlzycab74ppvwkpx8bmdnnsm09snmvq-decrypt-age-secrets.drv: build01: build01: input not substitutable: error: path '/nix/store/xqmbsf4zbphr1657ibx6smxqy01k1p69-mount-secret-fs' is required, but there is no substituter that can build it, asking the scheduler again
ahwky2imndrhg86zbs119ldh71fs54x8-X-Restart-Triggers-nix-daemon.drv: build01: build01: input not substitutable: error: path '/nix/store/9d7gg64nc7x6cp7p8baznwr3agibzmfr-nix.conf' is required, but there is no substituter that can build it, asking the scheduler again
4x2i00yh66k810ld2vh5px0achvlqyzb-command-not-found.drv: build01: build01: input not substitutable: error: path '/nix/store/5fdmcpd1nqkzidxc440jdix6z98n16gc-perl-5.42.3-env' is required, but there is no substituter that can build it, asking the scheduler again
s6b2dgx90f9jzi8pxg6bc463d96hg8yi-decrypt-age-secrets.drv: build01: build01: input not substitutable: error: path '/nix/store/xqmbsf4zbphr1657ibx6smxqy01k1p69-mount-secret-fs' is required, but there is no substituter that can build it, asking the scheduler again
8jlzycab74ppvwkpx8bmdnnsm09snmvq-decrypt-age-secrets.drv: build01: build01: input not substitutable: error: path '/nix/store/xqmbsf4zbphr1657ibx6smxqy01k1p69-mount-secret-fs' is required, but there is no substituter that can build it, asking the scheduler again
ahwky2imndrhg86zbs119ldh71fs54x8-X-Restart-Triggers-nix-daemon.drv: build01: build01: input not substitutable: error: path '/nix/store/9d7gg64nc7x6cp7p8baznwr3agibzmfr-nix.conf' is required, but there is no substituter that can build it, asking the scheduler again
error: dependency 'j7xl2ivlld96lrflcbsrfqnx5vkvfcck-nixos-test-driver-zerotier-multi-instance.drv' failed
failed eval checks.x86_64-linux.all-packages —
error: … while calling the 'derivationStrict' builtin at «nix-internal»/derivation-internal.nix:37:12: 36| 37| strict = …
error:
       … while calling the 'derivationStrict' builtin
         at «nix-internal»/derivation-internal.nix:37:12:
           36|
           37|   strict = derivationStrict drvAttrs;
             |            ^
           38|

       … while evaluating derivation 'all-packages'
         whose name attribute is located at «https://releases.nixos.org/nixos/26.05/nixos-26.05.11628.f584496e0120/nixexprs.tar.xz?narHash=sha256-oADz%2BiVvVvE6aADkqywUEdNruts0BdExqgF20/0nd5o%3D»/pkgs/stdenv/generic/make-derivation.nix:647:11

       … while evaluating attribute 'buildCommand' of derivation 'all-packages'
         at «https://releases.nixos.org/nixos/26.05/nixos-26.05.11628.f584496e0120/nixexprs.tar.xz?narHash=sha256-oADz%2BiVvVvE6aADkqywUEdNruts0BdExqgF20/0nd5o%3D»/pkgs/build-support/trivial-builders/default.nix:81:17:
           80|         enableParallelBuilding = true;
           81|         inherit buildCommand name;
             |                 ^
           82|         passAsFile = [ "buildCommand" ] ++ (derivationArgs.passAsFile or [ ]);

       (stack trace truncated; use '--show-trace' to show the full, detailed trace)

       error: Refusing to evaluate package 'pnpm-10.34.0' in /nix/store/g7h1h7cia44ljg4wcrhq3vca5gm5mv9k-source/pkgs/development/tools/pnpm/generic.nix:170 because it is marked as insecure

       Known issues:
        - CVE-2026-55487
        - CVE-2026-55698
        - CVE-2026-55180
        - CVE-2026-55697
        - CVE-2026-59194
        - CVE-2026-59195
        - CVE-2026-59196
        - CVE-2026-82392
        - CVE-2026-82393

       You can install it anyway by allowing this package, using the
       following methods:

       a) To temporarily allow all insecure packages, you can use an environment
          variable for a single invocation of the nix tools:

            $ export NIXPKGS_ALLOW_INSECURE=1

          Note: When using `nix shell`, `nix build`, `nix develop`, etc with a flake,
                then pass `--impure` in order to allow use of environment variables.

       b) for `nixos-rebuild` you can add ‘pnpm-10.34.0’ to
          `nixpkgs.config.permittedInsecurePackages` in the configuration.nix,
          like so:

            {
              nixpkgs.config.permittedInsecurePackages = [
                "pnpm-10.34.0"
              ];
            }

       c) For `nix-env`, `nix-build`, `nix-shell` or any other Nix command you can add
          ‘pnpm-10.34.0’ to `permittedInsecurePackages` in
          ~/.config/nixpkgs/config.nix, like so:

            {
              permittedInsecurePackages = [
                "pnpm-10.34.0"
              ];
            }
failed eval checks.x86_64-linux.borgbackup —
error: … while evaluating the attribute 'drvPath' at «https://releases.nixos.org/nixos/26.05/nixos-26.05.11628.f584496e0120/nixexprs.tar.xz?narH …
error:
       … while evaluating the attribute 'drvPath'
         at «https://releases.nixos.org/nixos/26.05/nixos-26.05.11628.f584496e0120/nixexprs.tar.xz?narHash=sha256-oADz%2BiVvVvE6aADkqywUEdNruts0BdExqgF20/0nd5o%3D»/lib/customisation.nix:427:7:
          426|     // {
          427|       drvPath =
             |       ^
          428|         assert condition;

       … while calling the 'derivationStrict' builtin
         at «nix-internal»/derivation-internal.nix:37:12:
           36|
           37|   strict = derivationStrict drvAttrs;
             |            ^
           38|

       … while evaluating the option `nodes.clientone.networking.interfaces':

       … while evaluating definitions from `/nix/store/g7h1h7cia44ljg4wcrhq3vca5gm5mv9k-source/nixos/modules/hardware/facter/networking':

       … while evaluating the option `nodes.clientone.hardware.facter.enable':

       … while evaluating the option `nodes.clientone.hardware.facter.report':

       … while evaluating the option `nodes.clientone.hardware.facter.reportPath':

       … while evaluating definitions from `/nix/store/i66i58drxvil0pcfgvg0b4x92qic5f8z-source/nixosModules/clanCore/nixos-facter.nix':

       (stack trace truncated; use '--show-trace' to show the full, detailed trace)

       error: build of '/nix/store/iymk7adx6w7kdzk12m8yl90s7n15qava-merged-test-dir-borgbackup.drv^out' failed: error: gave up after 9 reschedules
failed eval checks.x86_64-linux.certificates —
error: … while evaluating the attribute 'drvPath' at «https://releases.nixos.org/nixos/26.05/nixos-26.05.11628.f584496e0120/nixexprs.tar.xz?narH …
error:
       … while evaluating the attribute 'drvPath'
         at «https://releases.nixos.org/nixos/26.05/nixos-26.05.11628.f584496e0120/nixexprs.tar.xz?narHash=sha256-oADz%2BiVvVvE6aADkqywUEdNruts0BdExqgF20/0nd5o%3D»/lib/customisation.nix:427:7:
          426|     // {
          427|       drvPath =
             |       ^
          428|         assert condition;

       … while calling the 'derivationStrict' builtin
         at «nix-internal»/derivation-internal.nix:37:12:
           36|
           37|   strict = derivationStrict drvAttrs;
             |            ^
           38|

       … while evaluating the option `nodes.ca.networking.interfaces':

       … while evaluating definitions from `/nix/store/g7h1h7cia44ljg4wcrhq3vca5gm5mv9k-source/nixos/modules/hardware/facter/networking':

       … while evaluating the option `nodes.ca.hardware.facter.enable':

       … while evaluating the option `nodes.ca.hardware.facter.report':

       … while evaluating the option `nodes.ca.hardware.facter.reportPath':

       … while evaluating definitions from `/nix/store/i66i58drxvil0pcfgvg0b4x92qic5f8z-source/nixosModules/clanCore/nixos-facter.nix':

       (stack trace truncated; use '--show-trace' to show the full, detailed trace)

       error: build of '/nix/store/4l0b6fay94iqq24kqzjr0340hb8isk8v-merged-test-dir-certificates.drv^out' failed: error: error: gRPC AddMultipleToStore on 'nix-store.geninf.io:50051' failed: error: path '/nix/store/pz095625cmjmg3l5p9p56psv3adsfs7h-generator-step-intermediate-key.drv' is required, but there is no substituter that can build it
failed eval checks.x86_64-linux.clan-site-lint —
error: … while calling the 'derivationStrict' builtin at «nix-internal»/derivation-internal.nix:37:12: 36| 37| strict = …
error:
       … while calling the 'derivationStrict' builtin
         at «nix-internal»/derivation-internal.nix:37:12:
           36|
           37|   strict = derivationStrict drvAttrs;
             |            ^
           38|

       … while evaluating derivation 'clan-site-lint'
         whose name attribute is located at «https://releases.nixos.org/nixos/26.05/nixos-26.05.11628.f584496e0120/nixexprs.tar.xz?narHash=sha256-oADz%2BiVvVvE6aADkqywUEdNruts0BdExqgF20/0nd5o%3D»/pkgs/stdenv/generic/make-derivation.nix:647:11

       … while evaluating attribute 'nativeBuildInputs' of derivation 'clan-site-lint'
         at «https://releases.nixos.org/nixos/26.05/nixos-26.05.11628.f584496e0120/nixexprs.tar.xz?narHash=sha256-oADz%2BiVvVvE6aADkqywUEdNruts0BdExqgF20/0nd5o%3D»/pkgs/stdenv/generic/make-derivation.nix:715:11:
          714|           depsBuildBuild = buildBuildOutputs;
          715|           nativeBuildInputs = buildHostOutputs;
             |           ^
          716|           depsBuildTarget = buildTargetOutputs;

       (stack trace truncated; use '--show-trace' to show the full, detailed trace)

       error: Refusing to evaluate package 'pnpm-10.34.0' in /nix/store/g7h1h7cia44ljg4wcrhq3vca5gm5mv9k-source/pkgs/development/tools/pnpm/generic.nix:170 because it is marked as insecure

       Known issues:
        - CVE-2026-55487
        - CVE-2026-55698
        - CVE-2026-55180
        - CVE-2026-55697
        - CVE-2026-59194
        - CVE-2026-59195
        - CVE-2026-59196
        - CVE-2026-82392
        - CVE-2026-82393

       You can install it anyway by allowing this package, using the
       following methods:

       a) To temporarily allow all insecure packages, you can use an environment
          variable for a single invocation of the nix tools:

            $ export NIXPKGS_ALLOW_INSECURE=1

          Note: When using `nix shell`, `nix build`, `nix develop`, etc with a flake,
                then pass `--impure` in order to allow use of environment variables.

       b) for `nixos-rebuild` you can add ‘pnpm-10.34.0’ to
          `nixpkgs.config.permittedInsecurePackages` in the configuration.nix,
          like so:

            {
              nixpkgs.config.permittedInsecurePackages = [
                "pnpm-10.34.0"
              ];
            }

       c) For `nix-env`, `nix-build`, `nix-shell` or any other Nix command you can add
          ‘pnpm-10.34.0’ to `permittedInsecurePackages` in
          ~/.config/nixpkgs/config.nix, like so:

            {
              permittedInsecurePackages = [
                "pnpm-10.34.0"
              ];
            }
failed checks.x86_64-linux.clan-test-update 5m 29s
setup: zgngaz21bfwccy4hi72na0irb21pwmz9-etc-hostname.drv: error: gRPC BuildDerivation on 'nix-store.geninf.io:50051' failed: build-x86-01: missing: /nix/store/z …
setup:
zgngaz21bfwccy4hi72na0irb21pwmz9-etc-hostname.drv: error: gRPC BuildDerivation on 'nix-store.geninf.io:50051' failed: build-x86-01: missing: /nix/store/zgngaz21bfwccy4hi72na0irb21pwmz9-etc-hostname.drv
zrahvbsyjk0yjc0rb52jyfyks1y73cpq-X-Reload-Triggers-systemd-networkd.drv: gi-build-x86-01: gi-build-x86-01: input not substitutable: error: path '/nix/store/6pcnm59pwzzj4wqxjciw7v6zh159zz20-unit-40-eth1.network' is required, but there is no substituter that can build it, asking the scheduler again
zrahvbsyjk0yjc0rb52jyfyks1y73cpq-X-Reload-Triggers-systemd-networkd.drv: gi-build-x86-01: gi-build-x86-01: input not substitutable: error: path '/nix/store/6pcnm59pwzzj4wqxjciw7v6zh159zz20-unit-40-eth1.network' is required, but there is no substituter that can build it, asking the scheduler again
1vxxzsn1v4n9vfq5aw2n2ramn89qmi76-X-Restart-Triggers-nix-daemon.drv: gi-build-x86-01: gi-build-x86-01: input not substitutable: error: path '/nix/store/jc912xd3lkl1q057lg0vkb6hrln351n3-nix.conf' is required, but there is no substituter that can build it, asking the scheduler again
m88kzb5zpgpim505h8nifyxf3p2wlbk3-hosts.drv: error: gRPC BuildDerivation on 'nix-store.geninf.io:50051' failed: build-x86-01: missing: /nix/store/m88kzb5zpgpim505h8nifyxf3p2wlbk3-hosts.drv
1vxxzsn1v4n9vfq5aw2n2ramn89qmi76-X-Restart-Triggers-nix-daemon.drv: gi-build-x86-01: gi-build-x86-01: input not substitutable: error: path '/nix/store/jc912xd3lkl1q057lg0vkb6hrln351n3-nix.conf' is required, but there is no substituter that can build it, asking the scheduler again
mp58al858m7x1aaprwjzc2d3g9gydrl0-clan-runtime.drv: gi-build-x86-02: not scheduled here: mp58al858m7x1aaprwjzc2d3g9gydrl0-clan-runtime.drv, asking the scheduler again
error: dependency '486ck0wp029q433drm5l235r5w172ph2-nixos-test-driver-clan-test-update.drv' failed
failed checks.x86_64-linux.darwin-test-darwin-machine 2m 3s
setup: qm4r6lgv1ld1pdf52ndlra10gsm97mr8-darwin-rebuild.drv: no connected, non-draining worker for system 'aarch64-darwin' offers features {}, the workers offer …
setup:
qm4r6lgv1ld1pdf52ndlra10gsm97mr8-darwin-rebuild.drv: no connected, non-draining worker for system 'aarch64-darwin' offers features {}, the workers offer {}
qsqb2i82cgnccaiaxvy3kgcw96jax83i-darwin-version.json.drv: no connected, non-draining worker for system 'aarch64-darwin' offers features {}, the workers offer {}
rjrx4i80iwd7xri74wfsfxi8fsal8gbp-set-environment.drv: no connected, non-draining worker for system 'aarch64-darwin' offers features {}, the workers offer {}
shhsdzdwqzfm3v98pjnhai9xr1f1z9pm-options.json.drv: no connected, non-draining worker for system 'aarch64-darwin' offers features {}, the workers offer {}
w4afz2impwxc5cqv08bsa2vh6gr5pl3d-patches.drv: no connected, non-draining worker for system 'aarch64-darwin' offers features {}, the workers offer {}
y5f294bglikn7b7gcnlchbaj9j1qmfjf-etc-099-host-keys.conf.drv: no connected, non-draining worker for system 'aarch64-darwin' offers features {}, the workers offer {}
y6v0x6ql68q9080awrq8ab9mw6l1gavh-launchd.drv: no connected, non-draining worker for system 'aarch64-darwin' offers features {}, the workers offer {}
error: dependency 'q52zn986wach507sllk5f15iya7z5rgg-fonts.drv' failed
failed eval checks.x86_64-linux.data-mesher —
error: … while evaluating the attribute 'drvPath' at «https://releases.nixos.org/nixos/26.05/nixos-26.05.11628.f584496e0120/nixexprs.tar.xz?narH …
error:
       … while evaluating the attribute 'drvPath'
         at «https://releases.nixos.org/nixos/26.05/nixos-26.05.11628.f584496e0120/nixexprs.tar.xz?narHash=sha256-oADz%2BiVvVvE6aADkqywUEdNruts0BdExqgF20/0nd5o%3D»/lib/customisation.nix:427:7:
          426|     // {
          427|       drvPath =
             |       ^
          428|         assert condition;

       … while calling the 'derivationStrict' builtin
         at «nix-internal»/derivation-internal.nix:37:12:
           36|
           37|   strict = derivationStrict drvAttrs;
             |            ^
           38|

       … while evaluating the option `nodes.alpha.networking.interfaces':

       … while evaluating definitions from `/nix/store/g7h1h7cia44ljg4wcrhq3vca5gm5mv9k-source/nixos/modules/hardware/facter/networking':

       … while evaluating the option `nodes.alpha.hardware.facter.enable':

       … while evaluating the option `nodes.alpha.hardware.facter.report':

       … while evaluating the option `nodes.alpha.hardware.facter.reportPath':

       … while evaluating definitions from `/nix/store/i66i58drxvil0pcfgvg0b4x92qic5f8z-source/nixosModules/clanCore/nixos-facter.nix':

       (stack trace truncated; use '--show-trace' to show the full, detailed trace)

       error: build of '/nix/store/lxif27z7q5sh1w5ml9zwwai1q3fm5005-merged-test-dir-data-mesher.drv^out' failed: error: gave up after 9 reschedules
failed eval checks.x86_64-linux.devShell-clan-site —
error: … while calling the 'derivationStrict' builtin at «nix-internal»/derivation-internal.nix:37:12: 36| 37| strict = …
error:
       … while calling the 'derivationStrict' builtin
         at «nix-internal»/derivation-internal.nix:37:12:
           36|
           37|   strict = derivationStrict drvAttrs;
             |            ^
           38|

       … while evaluating derivation 'nix-shell'
         whose name attribute is located at «https://releases.nixos.org/nixos/26.05/nixos-26.05.11628.f584496e0120/nixexprs.tar.xz?narHash=sha256-oADz%2BiVvVvE6aADkqywUEdNruts0BdExqgF20/0nd5o%3D»/pkgs/stdenv/generic/make-derivation.nix:647:11

       … while evaluating attribute 'nativeBuildInputs' of derivation 'nix-shell'
         at «https://releases.nixos.org/nixos/26.05/nixos-26.05.11628.f584496e0120/nixexprs.tar.xz?narHash=sha256-oADz%2BiVvVvE6aADkqywUEdNruts0BdExqgF20/0nd5o%3D»/pkgs/stdenv/generic/make-derivation.nix:715:11:
          714|           depsBuildBuild = buildBuildOutputs;
          715|           nativeBuildInputs = buildHostOutputs;
             |           ^
          716|           depsBuildTarget = buildTargetOutputs;

       (stack trace truncated; use '--show-trace' to show the full, detailed trace)

       error: Refusing to evaluate package 'pnpm-10.34.0' in /nix/store/g7h1h7cia44ljg4wcrhq3vca5gm5mv9k-source/pkgs/development/tools/pnpm/generic.nix:170 because it is marked as insecure

       Known issues:
        - CVE-2026-55487
        - CVE-2026-55698
        - CVE-2026-55180
        - CVE-2026-55697
        - CVE-2026-59194
        - CVE-2026-59195
        - CVE-2026-59196
        - CVE-2026-82392
        - CVE-2026-82393

       You can install it anyway by allowing this package, using the
       following methods:

       a) To temporarily allow all insecure packages, you can use an environment
          variable for a single invocation of the nix tools:

            $ export NIXPKGS_ALLOW_INSECURE=1

          Note: When using `nix shell`, `nix build`, `nix develop`, etc with a flake,
                then pass `--impure` in order to allow use of environment variables.

       b) for `nixos-rebuild` you can add ‘pnpm-10.34.0’ to
          `nixpkgs.config.permittedInsecurePackages` in the configuration.nix,
          like so:

            {
              nixpkgs.config.permittedInsecurePackages = [
                "pnpm-10.34.0"
              ];
            }

       c) For `nix-env`, `nix-build`, `nix-shell` or any other Nix command you can add
          ‘pnpm-10.34.0’ to `permittedInsecurePackages` in
          ~/.config/nixpkgs/config.nix, like so:

            {
              permittedInsecurePackages = [
                "pnpm-10.34.0"
              ];
            }
failed eval checks.x86_64-linux.devShell-docs —
error: … while calling the 'derivationStrict' builtin at «nix-internal»/derivation-internal.nix:37:12: 36| 37| strict = …
error:
       … while calling the 'derivationStrict' builtin
         at «nix-internal»/derivation-internal.nix:37:12:
           36|
           37|   strict = derivationStrict drvAttrs;
             |            ^
           38|

       … while evaluating derivation 'nix-shell'
         whose name attribute is located at «https://releases.nixos.org/nixos/26.05/nixos-26.05.11628.f584496e0120/nixexprs.tar.xz?narHash=sha256-oADz%2BiVvVvE6aADkqywUEdNruts0BdExqgF20/0nd5o%3D»/pkgs/stdenv/generic/make-derivation.nix:647:11

       … while evaluating attribute 'nativeBuildInputs' of derivation 'nix-shell'
         at «https://releases.nixos.org/nixos/26.05/nixos-26.05.11628.f584496e0120/nixexprs.tar.xz?narHash=sha256-oADz%2BiVvVvE6aADkqywUEdNruts0BdExqgF20/0nd5o%3D»/pkgs/stdenv/generic/make-derivation.nix:715:11:
          714|           depsBuildBuild = buildBuildOutputs;
          715|           nativeBuildInputs = buildHostOutputs;
             |           ^
          716|           depsBuildTarget = buildTargetOutputs;

       (stack trace truncated; use '--show-trace' to show the full, detailed trace)

       error: Refusing to evaluate package 'pnpm-10.34.0' in /nix/store/g7h1h7cia44ljg4wcrhq3vca5gm5mv9k-source/pkgs/development/tools/pnpm/generic.nix:170 because it is marked as insecure

       Known issues:
        - CVE-2026-55487
        - CVE-2026-55698
        - CVE-2026-55180
        - CVE-2026-55697
        - CVE-2026-59194
        - CVE-2026-59195
        - CVE-2026-59196
        - CVE-2026-82392
        - CVE-2026-82393

       You can install it anyway by allowing this package, using the
       following methods:

       a) To temporarily allow all insecure packages, you can use an environment
          variable for a single invocation of the nix tools:

            $ export NIXPKGS_ALLOW_INSECURE=1

          Note: When using `nix shell`, `nix build`, `nix develop`, etc with a flake,
                then pass `--impure` in order to allow use of environment variables.

       b) for `nixos-rebuild` you can add ‘pnpm-10.34.0’ to
          `nixpkgs.config.permittedInsecurePackages` in the configuration.nix,
          like so:

            {
              nixpkgs.config.permittedInsecurePackages = [
                "pnpm-10.34.0"
              ];
            }

       c) For `nix-env`, `nix-build`, `nix-shell` or any other Nix command you can add
          ‘pnpm-10.34.0’ to `permittedInsecurePackages` in
          ~/.config/nixpkgs/config.nix, like so:

            {
              permittedInsecurePackages = [
                "pnpm-10.34.0"
              ];
            }
failed checks.x86_64-linux.dyndns 2m 48s
setup: /nix/store/7zbzvm0bwa2mh5dp3p5gasix417lysxc-zstd-1.5.7 /nix/store/z8fp2l0b1k64swd0dxpych445wpfcgb0-zstd-1.5.7-bin /nix/store/4d2k230fhyxb8qab8amyk0 …
setup:
  /nix/store/7zbzvm0bwa2mh5dp3p5gasix417lysxc-zstd-1.5.7
  /nix/store/z8fp2l0b1k64swd0dxpych445wpfcgb0-zstd-1.5.7-bin
  /nix/store/4d2k230fhyxb8qab8amyk011m7pmpcrz-zstd-1.5.7-man
warning: ignoring the client-specified setting 'store', because it is a restricted setting and you are not a trusted user
syfw7cgcf30x5kq24mr530nn7p1c8jcn-unit-acme-account-ac036148678aabb4de7a.target.drv: error: gRPC BuildDerivation on 'nix-store.geninf.io:50051' failed: build-x86-01: missing: /nix/store/syfw7cgcf30x5kq24mr530nn7p1c8jcn-unit-acme-account-ac036148678aabb4de7a.target.drv
hm74x8f593wpzz0d2iydw1c7r5vg11m2-unit-script-nginx-pre-start.drv: error: gRPC BuildDerivation on 'nix-store.geninf.io:50051' failed: build-x86-01: missing: /nix/store/hm74x8f593wpzz0d2iydw1c7r5vg11m2-unit-script-nginx-pre-start.drv
6c9fdpkvfz340jxhpcmj5sdyv78jj905-unit-acme-renew-test.example.com.timer.drv: error: gRPC BuildDerivation on 'nix-store.geninf.io:50051' failed: build-x86-01: missing: /nix/store/6c9fdpkvfz340jxhpcmj5sdyv78jj905-unit-acme-renew-test.example.com.timer.drv
error: dependency '4n6farg7ps77mb60mz9q5wp3l3vqdhrp-nixos-test-driver-dyndns.drv' failed
failed checks.x86_64-linux.garage 1m 14s
setup: don't know how to build these paths: /nix/store/1yy1ds2wq3x9x4rvg2dmg0mskvhxj259-container-test-run-garage.drv warning: ignoring the client-specified s …
setup:
don't know how to build these paths:
  /nix/store/1yy1ds2wq3x9x4rvg2dmg0mskvhxj259-container-test-run-garage.drv
warning: ignoring the client-specified setting 'store', because it is a restricted setting and you are not a trusted user
rja11paihjng1rrvmj8hggr1ldq7s36w-etc.drv: error: gRPC AddMultipleToStore on 'nix-store.geninf.io:50051' failed: error: path '/nix/store/6lxgfcrzhy8fr3dc60jzq4bcl167fmk0-generator-garage.drv' is required, but there is no substituter that can build it
error: dependency 'hp75h51m9yky3x5yqk0azdmww41zcsc8-nixos-test-driver-garage.drv' failed
failed eval checks.x86_64-linux.kde —
error: … while evaluating the attribute 'drvPath' at «https://releases.nixos.org/nixos/26.05/nixos-26.05.11628.f584496e0120/nixexprs.tar.xz?narH …
error:
       … while evaluating the attribute 'drvPath'
         at «https://releases.nixos.org/nixos/26.05/nixos-26.05.11628.f584496e0120/nixexprs.tar.xz?narHash=sha256-oADz%2BiVvVvE6aADkqywUEdNruts0BdExqgF20/0nd5o%3D»/lib/customisation.nix:427:7:
          426|     // {
          427|       drvPath =
             |       ^
          428|         assert condition;

       … while calling the 'derivationStrict' builtin
         at «nix-internal»/derivation-internal.nix:37:12:
           36|
           37|   strict = derivationStrict drvAttrs;
             |            ^
           38|

       … while evaluating the option `nodes.client.networking.interfaces':

       … while evaluating definitions from `/nix/store/g7h1h7cia44ljg4wcrhq3vca5gm5mv9k-source/nixos/modules/hardware/facter/networking':

       … while evaluating the option `nodes.client.hardware.facter.enable':

       … while evaluating the option `nodes.client.hardware.facter.report':

       … while evaluating the option `nodes.client.hardware.facter.reportPath':

       … while evaluating definitions from `/nix/store/i66i58drxvil0pcfgvg0b4x92qic5f8z-source/nixosModules/clanCore/nixos-facter.nix':

       (stack trace truncated; use '--show-trace' to show the full, detailed trace)

       error: build of '/nix/store/4ipgq78dzbz4ddhb72ic0xh33l1ljcrd-merged-test-dir-kde.drv^out' failed: error: gave up after 9 reschedules
failed eval checks.x86_64-linux.nixos-test-password-store-mounts —
error: … while evaluating the attribute 'drvPath' at «https://releases.nixos.org/nixos/26.05/nixos-26.05.11628.f584496e0120/nixexprs.tar.xz?narH …
error:
       … while evaluating the attribute 'drvPath'
         at «https://releases.nixos.org/nixos/26.05/nixos-26.05.11628.f584496e0120/nixexprs.tar.xz?narHash=sha256-oADz%2BiVvVvE6aADkqywUEdNruts0BdExqgF20/0nd5o%3D»/lib/customisation.nix:427:7:
          426|     // {
          427|       drvPath =
             |       ^
          428|         assert condition;

       … while calling the 'derivationStrict' builtin
         at «nix-internal»/derivation-internal.nix:37:12:
           36|
           37|   strict = derivationStrict drvAttrs;
             |            ^
           38|

       … while evaluating the option `driverConfiguration.vlans':

       … while evaluating definitions from `/nix/store/g7h1h7cia44ljg4wcrhq3vca5gm5mv9k-source/nixos/lib/testing/driver-configuration.nix':

       … while evaluating the option `nodes.machine.networking.interfaces':

       … while evaluating definitions from `/nix/store/g7h1h7cia44ljg4wcrhq3vca5gm5mv9k-source/nixos/modules/hardware/facter/networking':

       … while evaluating the option `nodes.machine.hardware.facter.enable':

       … while evaluating the option `nodes.machine.hardware.facter.report':

       … while evaluating the option `nodes.machine.hardware.facter.reportPath':

       … while evaluating definitions from `/nix/store/i66i58drxvil0pcfgvg0b4x92qic5f8z-source/nixosModules/clanCore/nixos-facter.nix':

       (stack trace truncated; use '--show-trace' to show the full, detailed trace)

       error: hash mismatch importing path '/nix/store/zkzazxi1yx3z6i12sxg59p6kxxiymkjg-merged-test-dir-nixos-test-password-store-mounts';
         specified: sha256-FhXs8hNWMCH42XVZyJiTiJO+8Z+QsGYV+xtVkH5IH9Y=
         got:       sha256-QPczPYXyw20mokxX24vLfzqE+W0zgimOK2NtS4zQ4no=
failed checks.x86_64-linux.nixos-test-secrets 3m 19s
setup: /nix/store/15mlpz0nv6dwi8v1z7mx0dpvcmnhd7ql-xz-5.8.4-man /nix/store/xvpdcmxbccnavnw2dciidp0zrknzr1db-zlib-1.3.2-static /nix/store/llsvyjp1d86nh4jr6 …
setup:
  /nix/store/15mlpz0nv6dwi8v1z7mx0dpvcmnhd7ql-xz-5.8.4-man
  /nix/store/xvpdcmxbccnavnw2dciidp0zrknzr1db-zlib-1.3.2-static
  /nix/store/llsvyjp1d86nh4jr6yprl2x1lxahzyzc-zlib-ng-2.3.3
  /nix/store/z8fp2l0b1k64swd0dxpych445wpfcgb0-zstd-1.5.7-bin
  /nix/store/4d2k230fhyxb8qab8amyk011m7pmpcrz-zstd-1.5.7-man
warning: ignoring the client-specified setting 'store', because it is a restricted setting and you are not a trusted user
f24j7myd7z3sac8ph2qd84yr1izk8h2j-nixos-system-machine-test.drv: error: gRPC AddMultipleToStore on 'nix-store.geninf.io:50051' failed: error: path '/nix/store/vx171ky4c2qhfd8n2ngv1v2c7rmv9hw1-dry-activate.drv' is required, but there is no substituter that can build it
error: dependency '87rf0k8qbzaf0hbmzv01dq8djad8s9xw-nixos-test-driver-secrets.drv' failed
failed checks.x86_64-linux.nixos-test-user-firewall-nftables 5m 42s
container-test-run-user-firewall-nftables: exec(self.testscript, self.test_symbols(), None) # noqa: S102 ~~~~^^^^^^^^^^^^^^^^^^^^^^^^^^^^^^^^^^^^^^^^^^ …
container-test-run-user-firewall-nftables:
    exec(self.testscript, self.test_symbols(), None)  # noqa: S102
    ~~~~^^^^^^^^^^^^^^^^^^^^^^^^^^^^^^^^^^^^^^^^^^^^
  File "<string>", line 23, in <module>
  File "/nix/store/s2gv7ksn4gmzbcjmi1rklhiznvfz3r18-test-driver-0.0.1/lib/python3.13/site-packages/test_driver/__init__.py", line 475, in succeed
    raise RuntimeError(msg)
RuntimeError: Failed to run command runuser -u alice -- curl -s http://[2001:db8:1::2]
Exit code: 28
Stdout: 
failed eval checks.x86_64-linux.p2p-ssh-iroh —
error: … while evaluating the attribute 'drvPath' at «https://releases.nixos.org/nixos/26.05/nixos-26.05.11628.f584496e0120/nixexprs.tar.xz?narH …
error:
       … while evaluating the attribute 'drvPath'
         at «https://releases.nixos.org/nixos/26.05/nixos-26.05.11628.f584496e0120/nixexprs.tar.xz?narHash=sha256-oADz%2BiVvVvE6aADkqywUEdNruts0BdExqgF20/0nd5o%3D»/lib/customisation.nix:427:7:
          426|     // {
          427|       drvPath =
             |       ^
          428|         assert condition;

       … while calling the 'derivationStrict' builtin
         at «nix-internal»/derivation-internal.nix:37:12:
           36|
           37|   strict = derivationStrict drvAttrs;
             |            ^
           38|

       … while evaluating the option `nodes.client.networking.interfaces':

       … while evaluating definitions from `/nix/store/g7h1h7cia44ljg4wcrhq3vca5gm5mv9k-source/nixos/modules/hardware/facter/networking':

       … while evaluating the option `nodes.client.hardware.facter.enable':

       … while evaluating the option `nodes.client.hardware.facter.report':

       … while evaluating the option `nodes.client.hardware.facter.reportPath':

       … while evaluating definitions from `/nix/store/i66i58drxvil0pcfgvg0b4x92qic5f8z-source/nixosModules/clanCore/nixos-facter.nix':

       (stack trace truncated; use '--show-trace' to show the full, detailed trace)

       error: hash mismatch importing path '/nix/store/pl2jypwax5dgng2lldc7f6c4nqcv6x1x-merged-test-dir-clan-test-p2p-ssh-iroh';
         specified: sha256-q9KjDCcPWN2mXEUh0oO5R85kNexe2GBVV5q/raFmCSk=
         got:       sha256-H/06tbcjDe62OFgOFepIqiMcBYNIdLavWxhgfpwcyK4=
failed checks.x86_64-linux.packages 2m 52s
setup: /nix/store/15mlpz0nv6dwi8v1z7mx0dpvcmnhd7ql-xz-5.8.4-man /nix/store/xvpdcmxbccnavnw2dciidp0zrknzr1db-zlib-1.3.2-static /nix/store/llsvyjp1d86nh4jr6 …
setup:
  /nix/store/15mlpz0nv6dwi8v1z7mx0dpvcmnhd7ql-xz-5.8.4-man
  /nix/store/xvpdcmxbccnavnw2dciidp0zrknzr1db-zlib-1.3.2-static
  /nix/store/llsvyjp1d86nh4jr6yprl2x1lxahzyzc-zlib-ng-2.3.3
  /nix/store/z8fp2l0b1k64swd0dxpych445wpfcgb0-zstd-1.5.7-bin
  /nix/store/4d2k230fhyxb8qab8amyk011m7pmpcrz-zstd-1.5.7-man
warning: ignoring the client-specified setting 'store', because it is a restricted setting and you are not a trusted user
5czqsrayyhqfai5w4n1fzi7hdl88qmlb-system-path.drv: error: gRPC AddMultipleToStore on 'nix-store.geninf.io:50051' failed: error: some references of path '/nix/store/cgl8ccfsm0dcisaiz0y3qa8qb4n50kfz-cbonsai-1.4.2.drv' could not be realised
error: dependency 'bvz5j69k9y7zxm885p4075v3rql0yr51-nixos-test-driver-packages.drv' failed
failed checks.x86_64-linux.pki 1m 15s
setup: don't know how to build these paths: /nix/store/dxkfngmq8khvyib60h3h768ghdq46v7f-vm-test-run-pki.drv warning: ignoring the client-specified setting 'st …
setup:
don't know how to build these paths:
  /nix/store/dxkfngmq8khvyib60h3h768ghdq46v7f-vm-test-run-pki.drv
warning: ignoring the client-specified setting 'store', because it is a restricted setting and you are not a trusted user
syn73m6gsi18cg7b8zazsi1g2v0bwd5i-nginx.conf.drv: error: gRPC AddMultipleToStore on 'nix-store.geninf.io:50051' failed: error: path '/nix/store/jmwq9iffjb910dnl2gjp2mcnb95ws7bg-cert-website.nginx_website.nginx.fullchain.crt' is required, but there is no substituter that can build it
qvnpd0759dr1vv7iy2bz7gy2asis580d-etc.drv: error: gRPC AddMultipleToStore on 'nix-store.geninf.io:50051' failed: error: some references of path '/nix/store/wxasirnwpnwgirz1i5hpfvyk732qzfrl-hosts.drv' could not be realised
error: dependency 'y1ddlp4sac85yzfl8nbqprjlhzy0m97q-nixos-test-driver-pki.drv' failed
failed eval checks.x86_64-linux.syncthing-service —
error: … while evaluating the attribute 'drvPath' at «https://releases.nixos.org/nixos/26.05/nixos-26.05.11628.f584496e0120/nixexprs.tar.xz?narH …
error:
       … while evaluating the attribute 'drvPath'
         at «https://releases.nixos.org/nixos/26.05/nixos-26.05.11628.f584496e0120/nixexprs.tar.xz?narHash=sha256-oADz%2BiVvVvE6aADkqywUEdNruts0BdExqgF20/0nd5o%3D»/lib/customisation.nix:427:7:
          426|     // {
          427|       drvPath =
             |       ^
          428|         assert condition;

       … while calling the 'derivationStrict' builtin
         at «nix-internal»/derivation-internal.nix:37:12:
           36|
           37|   strict = derivationStrict drvAttrs;
             |            ^
           38|

       … while evaluating the option `nodes.machine1.networking.interfaces':

       … while evaluating definitions from `/nix/store/g7h1h7cia44ljg4wcrhq3vca5gm5mv9k-source/nixos/modules/hardware/facter/networking':

       … while evaluating the option `nodes.machine1.hardware.facter.enable':

       … while evaluating the option `nodes.machine1.hardware.facter.report':

       … while evaluating the option `nodes.machine1.hardware.facter.reportPath':

       … while evaluating definitions from `/nix/store/i66i58drxvil0pcfgvg0b4x92qic5f8z-source/nixosModules/clanCore/nixos-facter.nix':

       (stack trace truncated; use '--show-trace' to show the full, detailed trace)

       error: build of '/nix/store/s0ffyljja91iyibg12pivpxdj7ipj3lh-merged-test-dir-syncthing-service.drv^out' failed: error: gave up after 9 reschedules
failed eval checks.x86_64-linux.users —
error: … while evaluating the attribute 'drvPath' at «https://releases.nixos.org/nixos/26.05/nixos-26.05.11628.f584496e0120/nixexprs.tar.xz?narH …
error:
       … while evaluating the attribute 'drvPath'
         at «https://releases.nixos.org/nixos/26.05/nixos-26.05.11628.f584496e0120/nixexprs.tar.xz?narHash=sha256-oADz%2BiVvVvE6aADkqywUEdNruts0BdExqgF20/0nd5o%3D»/lib/customisation.nix:427:7:
          426|     // {
          427|       drvPath =
             |       ^
          428|         assert condition;

       … while calling the 'derivationStrict' builtin
         at «nix-internal»/derivation-internal.nix:37:12:
           36|
           37|   strict = derivationStrict drvAttrs;
             |            ^
           38|

       … while evaluating the option `nodes.server.networking.interfaces':

       … while evaluating definitions from `/nix/store/g7h1h7cia44ljg4wcrhq3vca5gm5mv9k-source/nixos/modules/hardware/facter/networking':

       … while evaluating the option `nodes.server.hardware.facter.enable':

       … while evaluating the option `nodes.server.hardware.facter.report':

       … while evaluating the option `nodes.server.hardware.facter.reportPath':

       … while evaluating definitions from `/nix/store/i66i58drxvil0pcfgvg0b4x92qic5f8z-source/nixosModules/clanCore/nixos-facter.nix':

       (stack trace truncated; use '--show-trace' to show the full, detailed trace)

       error: build of '/nix/store/wjj1csz796rsk9nfz1fb3ygmj54jqkb7-merged-test-dir-users.drv^out' failed: error: gave up after 9 reschedules
failed eval checks.x86_64-linux.wifi —
error: … while evaluating the attribute 'drvPath' at «https://releases.nixos.org/nixos/26.05/nixos-26.05.11628.f584496e0120/nixexprs.tar.xz?narH …
error:
       … while evaluating the attribute 'drvPath'
         at «https://releases.nixos.org/nixos/26.05/nixos-26.05.11628.f584496e0120/nixexprs.tar.xz?narHash=sha256-oADz%2BiVvVvE6aADkqywUEdNruts0BdExqgF20/0nd5o%3D»/lib/customisation.nix:427:7:
          426|     // {
          427|       drvPath =
             |       ^
          428|         assert condition;

       … while calling the 'derivationStrict' builtin
         at «nix-internal»/derivation-internal.nix:37:12:
           36|
           37|   strict = derivationStrict drvAttrs;
             |            ^
           38|

       … while evaluating the option `driverConfiguration.vlans':

       … while evaluating definitions from `/nix/store/g7h1h7cia44ljg4wcrhq3vca5gm5mv9k-source/nixos/lib/testing/driver-configuration.nix':

       … while evaluating the option `nodes.second.networking.interfaces':

       … while evaluating definitions from `/nix/store/g7h1h7cia44ljg4wcrhq3vca5gm5mv9k-source/nixos/modules/hardware/facter/networking':

       … while evaluating the option `nodes.second.hardware.facter.enable':

       … while evaluating the option `nodes.second.hardware.facter.report':

       … while evaluating the option `nodes.second.hardware.facter.reportPath':

       … while evaluating definitions from `/nix/store/i66i58drxvil0pcfgvg0b4x92qic5f8z-source/nixosModules/clanCore/nixos-facter.nix':

       (stack trace truncated; use '--show-trace' to show the full, detailed trace)

       error: build of '/nix/store/41vn8y52hxjggs8l3qfsclr3qpwr9w7x-merged-test-dir-wifi.drv^out' failed: error: gave up after 9 reschedules
failed eval checks.x86_64-linux.wireguard —
error: … while evaluating the attribute 'drvPath' at «https://releases.nixos.org/nixos/26.05/nixos-26.05.11628.f584496e0120/nixexprs.tar.xz?narH …
error:
       … while evaluating the attribute 'drvPath'
         at «https://releases.nixos.org/nixos/26.05/nixos-26.05.11628.f584496e0120/nixexprs.tar.xz?narHash=sha256-oADz%2BiVvVvE6aADkqywUEdNruts0BdExqgF20/0nd5o%3D»/lib/customisation.nix:427:7:
          426|     // {
          427|       drvPath =
             |       ^
          428|         assert condition;

       … while calling the 'derivationStrict' builtin
         at «nix-internal»/derivation-internal.nix:37:12:
           36|
           37|   strict = derivationStrict drvAttrs;
             |            ^
           38|

       … while evaluating the option `nodes.controller1.networking.interfaces':

       … while evaluating definitions from `/nix/store/g7h1h7cia44ljg4wcrhq3vca5gm5mv9k-source/nixos/modules/hardware/facter/networking':

       … while evaluating the option `nodes.controller1.hardware.facter.enable':

       … while evaluating the option `nodes.controller1.hardware.facter.report':

       … while evaluating the option `nodes.controller1.hardware.facter.reportPath':

       … while evaluating definitions from `/nix/store/i66i58drxvil0pcfgvg0b4x92qic5f8z-source/nixosModules/clanCore/nixos-facter.nix':

       (stack trace truncated; use '--show-trace' to show the full, detailed trace)

       error: build of '/nix/store/bqv8zsy58v6f6jyz0lmdjxq33jvbjfwi-merged-test-dir-wireguard.drv^out' failed: error: error: gRPC AddMultipleToStore on 'nix-store.geninf.io:50051' failed: error: path '/nix/store/d4gbc6i82ncm89gvjn4340valqjakhq8-generator-wireguard-network-wg-test-one.drv' is required, but there is no substituter that can build it
63 succeeded
succeeded attributes
status attribute duration
loading…
14 already built
skipped attributes
status attribute duration
loading…