nixbot

builds

clan/clan-core build #948 failed

branch 26.05 · PR #8177 · commit 9dfb0557f4 · · took 13m 1s · eval 5m 39s

eval warnings 26 kinds · 119 occurrences
  • error …-merged-test-dir-borgbackup.drv: build-x86-01: build-x86-01: input not substitutable: error: path '/nix/store/…-test-vars-generated' is required, but there is no substituter that can build it, asking the scheduler again ×13
  • error ×26
  • error Refusing to evaluate package 'pnpm-10.34.0' in /nix/store/…-source/pkgs/development/tools/pnpm/generic.nix:170 because it is marked as insecure ×10
  • error …-merged-test-dir-borgbackup.drv: gi-build-x86-02: gi-build-x86-02: input not substitutable: error: path '/nix/store/…-test-vars-generated' is required, but there is no substituter that can build it, asking the scheduler again ×5
  • error …-test-vars-generated.drv: error: gRPC AddMultipleToStore on 'nix-store.geninf.io:50051' failed: error: path '/nix/store/…-generator-step-intermediate-key.drv' is required, but there is no substituter that can build it ×1
  • error build of '/nix/store/…-merged-test-dir-certificates.drv^out' failed: error: dependency '…-test-vars-generated.drv' failed ×1
  • error build of '/nix/store/…-merged-test-dir-borgbackup.drv^out' failed: error: gave up after 9 reschedules ×2
  • error gRPC FetchNars failed: error: path '/nix/store/…-merged-test-dir-data-mesher' is required, but there is no substituter that can build it ×1
  • error gRPC FetchNars failed: error: path '/nix/store/…-merged-test-dir-nixos-test-password-store-mounts' is required, but there is no substituter that can build it ×1
  • error gRPC FetchNars failed: error: path '/nix/store/…-merged-test-dir-clan-test-p2p-ssh-iroh' is required, but there is no substituter that can build it ×2
  • error …-merged-test-dir-syncthing-service.drv: build-x86-01: build-x86-01: input not substitutable: error: path '/nix/store/…-test-vars-generated' is required, but there is no substituter that can build it, asking the scheduler again ×9
  • error …-merged-test-dir-users.drv: build-x86-01: build-x86-01: input not substitutable: error: path '/nix/store/…-test-vars-generated' is required, but there is no substituter that can build it, asking the scheduler again ×11
  • error build of '/nix/store/…-merged-test-dir-syncthing-service.drv^out' failed: error: gave up after 9 reschedules ×2
  • error build of '/nix/store/…-merged-test-dir-users.drv^out' failed: error: gave up after 9 reschedules ×2
  • error …-merged-test-dir-wireguard.drv: error: gRPC AddMultipleToStore on 'nix-store.geninf.io:50051' failed: error: path '/nix/store/…-generator-wireguard-network-wg-test-one.drv' is required, but there is no substituter that can build it ×1
  • error build of '/nix/store/…-merged-test-dir-wireguard.drv^out' failed: error: error: gRPC AddMultipleToStore on 'nix-store.geninf.io:50051' failed: error: path '/nix/store/…-generator-wireguard-network-wg-test-one.drv' is required, but there is no substituter that can build it ×1
  • error …-merged-test-dir-certificates.drv: gi-build-x86-02: gi-build-x86-02: input not substitutable: error: path '/nix/store/…-test-vars-generated' is required, but there is no substituter that can build it, asking the scheduler again ×1
  • error …-merged-test-dir-certificates.drv: error: gRPC AddMultipleToStore on 'nix-store.geninf.io:50051' failed: error: path '/nix/store/…-generator-step-intermediate-key.drv' is required, but there is no substituter that can build it ×1
  • error build of '/nix/store/…-merged-test-dir-certificates.drv^out' failed: error: error: gRPC AddMultipleToStore on 'nix-store.geninf.io:50051' failed: error: path '/nix/store/…-generator-step-intermediate-key.drv' is required, but there is no substituter that can build it ×1
  • error path '/nix/store/…-merged-test-dir-data-mesher' is not valid ×1
  • error hash mismatch importing path '/nix/store/…-merged-test-dir-nixos-test-password-store-mounts'; ×1
  • error …-merged-test-dir-syncthing-service.drv: web01: web01: input not substitutable: error: path '/nix/store/…-test-vars-generated' is required, but there is no substituter that can build it, asking the scheduler again ×9
  • error …-merged-test-dir-users.drv: web01: web01: input not substitutable: error: path '/nix/store/…-test-vars-generated' is required, but there is no substituter that can build it, asking the scheduler again ×7
  • error …-merged-test-dir-wireguard.drv: gi-build-x86-02: gi-build-x86-02: input not substitutable: error: path '/nix/store/…-test-vars-generated' is required, but there is no substituter that can build it, asking the scheduler again ×2
  • error …-merged-test-dir-wireguard.drv: web01: web01: input not substitutable: error: path '/nix/store/…-test-vars-generated' is required, but there is no substituter that can build it, asking the scheduler again ×7
  • error build of '/nix/store/…-merged-test-dir-wireguard.drv^out' failed: error: gave up after 9 reschedules ×1

82 failed
failed attributes
status attribute duration
failed eval checks.aarch64-darwin.all-packages —
error: … while calling the 'derivationStrict' builtin at «nix-internal»/derivation-internal.nix:37:12: 36| 37| strict = …
error:
       … while calling the 'derivationStrict' builtin
         at «nix-internal»/derivation-internal.nix:37:12:
           36|
           37|   strict = derivationStrict drvAttrs;
             |            ^
           38|

       … while evaluating derivation 'all-packages'
         whose name attribute is located at «https://releases.nixos.org/nixos/26.05/nixos-26.05.11680.6fcc160353f6/nixexprs.tar.xz?narHash=sha256-tM6MAMxVwetta6uD2aMzoWQ9v5EAaLLmYumiE4jVZeg%3D»/pkgs/stdenv/generic/make-derivation.nix:647:11

       … while evaluating attribute 'buildCommand' of derivation 'all-packages'
         at «https://releases.nixos.org/nixos/26.05/nixos-26.05.11680.6fcc160353f6/nixexprs.tar.xz?narHash=sha256-tM6MAMxVwetta6uD2aMzoWQ9v5EAaLLmYumiE4jVZeg%3D»/pkgs/build-support/trivial-builders/default.nix:81:17:
           80|         enableParallelBuilding = true;
           81|         inherit buildCommand name;
             |                 ^
           82|         passAsFile = [ "buildCommand" ] ++ (derivationArgs.passAsFile or [ ]);

       (stack trace truncated; use '--show-trace' to show the full, detailed trace)

       error: Refusing to evaluate package 'pnpm-10.34.0' in /nix/store/k1vyrhach56zhxf4835z5whii9mdr485-source/pkgs/development/tools/pnpm/generic.nix:170 because it is marked as insecure

       Known issues:
        - CVE-2026-55487
        - CVE-2026-55698
        - CVE-2026-55180
        - CVE-2026-55697
        - CVE-2026-59194
        - CVE-2026-59195
        - CVE-2026-59196
        - CVE-2026-82392
        - CVE-2026-82393

       You can install it anyway by allowing this package, using the
       following methods:

       a) To temporarily allow all insecure packages, you can use an environment
          variable for a single invocation of the nix tools:

            $ export NIXPKGS_ALLOW_INSECURE=1

          Note: When using `nix shell`, `nix build`, `nix develop`, etc with a flake,
                then pass `--impure` in order to allow use of environment variables.

       b) for `nixos-rebuild` you can add ‘pnpm-10.34.0’ to
          `nixpkgs.config.permittedInsecurePackages` in the configuration.nix,
          like so:

            {
              nixpkgs.config.permittedInsecurePackages = [
                "pnpm-10.34.0"
              ];
            }

       c) For `nix-env`, `nix-build`, `nix-shell` or any other Nix command you can add
          ‘pnpm-10.34.0’ to `permittedInsecurePackages` in
          ~/.config/nixpkgs/config.nix, like so:

            {
              permittedInsecurePackages = [
                "pnpm-10.34.0"
              ];
            }
failed checks.aarch64-darwin.clan-app-pytest 2m 5s
setup: warning: ignoring the client-specified setting 'store', because it is a restricted setting and you are not a trusted user warning: 2vq97vcpv3x4banc8r1vpz …
setup:
warning: ignoring the client-specified setting 'store', because it is a restricted setting and you are not a trusted user
warning: 2vq97vcpv3x4banc8r1vpzlpf4zzlfky-webview-nightly.drv: no connected, non-draining worker for system 'aarch64-darwin' offers features {}, the workers offer {}, waiting up to 120s for a worker
warning: lxr8rqdvglwdxn9f2bm51s12g5ajnyqn-clan-runtime.drv: no connected, non-draining worker for system 'aarch64-darwin' offers features {}, the workers offer {}, waiting up to 120s for a worker
warning: q1qgvwm3lcfpsk9zbl566bfa2y5ilwk5-python3-3.13.15-env.drv: no connected, non-draining worker for system 'aarch64-darwin' offers features {}, the workers offer {}, waiting up to 120s for a worker
2vq97vcpv3x4banc8r1vpzlpf4zzlfky-webview-nightly.drv: no connected, non-draining worker for system 'aarch64-darwin' offers features {}, the workers offer {}
lxr8rqdvglwdxn9f2bm51s12g5ajnyqn-clan-runtime.drv: no connected, non-draining worker for system 'aarch64-darwin' offers features {}, the workers offer {}
q1qgvwm3lcfpsk9zbl566bfa2y5ilwk5-python3-3.13.15-env.drv: no connected, non-draining worker for system 'aarch64-darwin' offers features {}, the workers offer {}
error: dependency '2vq97vcpv3x4banc8r1vpzlpf4zzlfky-webview-nightly.drv' failed
failed checks.aarch64-darwin.clan-app-ui-unit-tests 2m 3s
setup: warning: kzdw7zw5nv08894mwk1v82wk3rbp36y5-unknown.drv: no connected, non-draining worker for system 'aarch64-darwin' offers features {}, the workers offe …
setup:
warning: kzdw7zw5nv08894mwk1v82wk3rbp36y5-unknown.drv: no connected, non-draining worker for system 'aarch64-darwin' offers features {}, the workers offer {}, waiting up to 120s for a worker
warning: p4b96a9l12zifk49k0l49cadqyxfj945-clan-ts-api.drv: no connected, non-draining worker for system 'aarch64-darwin' offers features {}, the workers offer {}, waiting up to 120s for a worker
warning: v7cfvzx59d42d7insb9qfcdbyalw64zx-npm-config-hook.drv: no connected, non-draining worker for system 'aarch64-darwin' offers features {}, the workers offer {}, waiting up to 120s for a worker
3dp020c98sm3y9b9iz9jbifrgfqjrkp1--clan-ui-0.0.1-sources.drv: no connected, non-draining worker for system 'aarch64-darwin' offers features {}, the workers offer {}
kzdw7zw5nv08894mwk1v82wk3rbp36y5-unknown.drv: no connected, non-draining worker for system 'aarch64-darwin' offers features {}, the workers offer {}
p4b96a9l12zifk49k0l49cadqyxfj945-clan-ts-api.drv: no connected, non-draining worker for system 'aarch64-darwin' offers features {}, the workers offer {}
v7cfvzx59d42d7insb9qfcdbyalw64zx-npm-config-hook.drv: no connected, non-draining worker for system 'aarch64-darwin' offers features {}, the workers offer {}
error: dependency 'kzdw7zw5nv08894mwk1v82wk3rbp36y5-unknown.drv' failed
failed checks.aarch64-darwin.clan-deps 2m 2s
setup: don't know how to build these paths: /nix/store/rzch3gyc5991ya2gvyazmglkwb47bnjm-clan-deps.drv warning: ignoring the client-specified setting 'store', …
setup:
don't know how to build these paths:
  /nix/store/rzch3gyc5991ya2gvyazmglkwb47bnjm-clan-deps.drv
warning: ignoring the client-specified setting 'store', because it is a restricted setting and you are not a trusted user
warning: rzch3gyc5991ya2gvyazmglkwb47bnjm-clan-deps.drv: no connected, non-draining worker for system 'aarch64-darwin' offers features {}, the workers offer {}, waiting up to 120s for a worker
rzch3gyc5991ya2gvyazmglkwb47bnjm-clan-deps.drv: no connected, non-draining worker for system 'aarch64-darwin' offers features {}, the workers offer {}
error: no connected, non-draining worker for system 'aarch64-darwin' offers features {}, the workers offer {}
failed checks.aarch64-darwin.clan-pytest-with-core 2m 2s
setup: 57ml0mka925di7mb92s385yh8jlijxr3-perl-5.42.3-env.drv: no connected, non-draining worker for system 'aarch64-darwin' offers features {}, the workers offer …
setup:
57ml0mka925di7mb92s385yh8jlijxr3-perl-5.42.3-env.drv: no connected, non-draining worker for system 'aarch64-darwin' offers features {}, the workers offer {}
7k4pzjrqabm61ar5lkzmnscv8z56qkhc-clan-core-flake.drv: no connected, non-draining worker for system 'aarch64-darwin' offers features {}, the workers offer {}
lxr8rqdvglwdxn9f2bm51s12g5ajnyqn-clan-runtime.drv: no connected, non-draining worker for system 'aarch64-darwin' offers features {}, the workers offer {}
pav0ikgjyv0ci86riqpsrlpk5mpwqcr6-closure-info.drv: no connected, non-draining worker for system 'aarch64-darwin' offers features {}, the workers offer {}
ra2927r70v9zjjz5z3rxcj7g5dh6mmnk-zerotierone-1.16.0.drv: no connected, non-draining worker for system 'aarch64-darwin' offers features {}, the workers offer {}
xj2xqw5v2f9mmd748nwsigchzv9q9pzr-zerotier-tools-0.1.0.drv: no connected, non-draining worker for system 'aarch64-darwin' offers features {}, the workers offer {}
ym0w3fjav52jbam294jqn8zvbpndrjc9-python3-3.13.15-env.drv: no connected, non-draining worker for system 'aarch64-darwin' offers features {}, the workers offer {}
error: dependency 'ym0w3fjav52jbam294jqn8zvbpndrjc9-python3-3.13.15-env.drv' failed
failed checks.aarch64-darwin.clan-pytest-without-core 2m 1s
setup: warning: ignoring the client-specified setting 'store', because it is a restricted setting and you are not a trusted user warning: lxr8rqdvglwdxn9f2bm51s …
setup:
warning: ignoring the client-specified setting 'store', because it is a restricted setting and you are not a trusted user
warning: lxr8rqdvglwdxn9f2bm51s12g5ajnyqn-clan-runtime.drv: no connected, non-draining worker for system 'aarch64-darwin' offers features {}, the workers offer {}, waiting up to 120s for a worker
warning: pav0ikgjyv0ci86riqpsrlpk5mpwqcr6-closure-info.drv: no connected, non-draining worker for system 'aarch64-darwin' offers features {}, the workers offer {}, waiting up to 120s for a worker
warning: ym0w3fjav52jbam294jqn8zvbpndrjc9-python3-3.13.15-env.drv: no connected, non-draining worker for system 'aarch64-darwin' offers features {}, the workers offer {}, waiting up to 120s for a worker
lxr8rqdvglwdxn9f2bm51s12g5ajnyqn-clan-runtime.drv: no connected, non-draining worker for system 'aarch64-darwin' offers features {}, the workers offer {}
pav0ikgjyv0ci86riqpsrlpk5mpwqcr6-closure-info.drv: no connected, non-draining worker for system 'aarch64-darwin' offers features {}, the workers offer {}
ym0w3fjav52jbam294jqn8zvbpndrjc9-python3-3.13.15-env.drv: no connected, non-draining worker for system 'aarch64-darwin' offers features {}, the workers offer {}
error: dependency 'ym0w3fjav52jbam294jqn8zvbpndrjc9-python3-3.13.15-env.drv' failed
failed checks.aarch64-darwin.darwin-test-darwin-machine 2m 3s
setup: q8j2d3gm7gwm3k0ail51fkbw9nyrpzaz-etc-registry.json.drv: no connected, non-draining worker for system 'aarch64-darwin' offers features {}, the workers off …
setup:
q8j2d3gm7gwm3k0ail51fkbw9nyrpzaz-etc-registry.json.drv: no connected, non-draining worker for system 'aarch64-darwin' offers features {}, the workers offer {}
qm4r6lgv1ld1pdf52ndlra10gsm97mr8-darwin-rebuild.drv: no connected, non-draining worker for system 'aarch64-darwin' offers features {}, the workers offer {}
rjrx4i80iwd7xri74wfsfxi8fsal8gbp-set-environment.drv: no connected, non-draining worker for system 'aarch64-darwin' offers features {}, the workers offer {}
w4afz2impwxc5cqv08bsa2vh6gr5pl3d-patches.drv: no connected, non-draining worker for system 'aarch64-darwin' offers features {}, the workers offer {}
y5f294bglikn7b7gcnlchbaj9j1qmfjf-etc-099-host-keys.conf.drv: no connected, non-draining worker for system 'aarch64-darwin' offers features {}, the workers offer {}
y6v0x6ql68q9080awrq8ab9mw6l1gavh-launchd.drv: no connected, non-draining worker for system 'aarch64-darwin' offers features {}, the workers offer {}
z9s1ywmxymywpbrgf5vr2x1q6ydvp5cx-darwin-version.json.drv: no connected, non-draining worker for system 'aarch64-darwin' offers features {}, the workers offer {}
error: dependency 'agvg2jxavh8brpfpq88c022j89rcycsr-darwin-version.json.drv' failed
dependency failed checks.aarch64-darwin.devshell —
failed checks.aarch64-darwin.devShell-clan-app 2m 4s
setup: q1qgvwm3lcfpsk9zbl566bfa2y5ilwk5-python3-3.13.15-env.drv: no connected, non-draining worker for system 'aarch64-darwin' offers features {}, the workers o …
setup:
q1qgvwm3lcfpsk9zbl566bfa2y5ilwk5-python3-3.13.15-env.drv: no connected, non-draining worker for system 'aarch64-darwin' offers features {}, the workers offer {}
qgyz1jxvkphwlgf9kz6bh68r8p8ywgk5-lint-cross-compat.drv: no connected, non-draining worker for system 'aarch64-darwin' offers features {}, the workers offer {}
rx5pxikcvm5z95kx61w8wa6m06zrqb4w-Terms.yml.drv: no connected, non-draining worker for system 'aarch64-darwin' offers features {}, the workers offer {}
v7cfvzx59d42d7insb9qfcdbyalw64zx-npm-config-hook.drv: no connected, non-draining worker for system 'aarch64-darwin' offers features {}, the workers offer {}
xylhsnd1s92qvbm1481d9iddx8l8xing-playwright-browsers.drv: no connected, non-draining worker for system 'aarch64-darwin' offers features {}, the workers offer {}
ydjg695g7gkgpfk0bdyrks5150irm1sm-python3.13-datamodel-code-generator-0.52.1.drv: no connected, non-draining worker for system 'aarch64-darwin' offers features {}, the workers offer {}
zbapc0x7k24x20sq2k0m2zcpdxzlzgnp-sizelint.toml.drv: no connected, non-draining worker for system 'aarch64-darwin' offers features {}, the workers offer {}
error: dependency 'bhkky2n1rlsxfqqljlkzw9285vhw14xv-tea-create-pr.drv' failed
failed checks.aarch64-darwin.devShell-clan-cli 2m 26s
setup: 9bm3fnyv1px2rcxyb7bjdfibg5vd3nj3-fmt-nix-codeblocks.drv: no connected, non-draining worker for system 'aarch64-darwin' offers features {}, the workers of …
setup:
9bm3fnyv1px2rcxyb7bjdfibg5vd3nj3-fmt-nix-codeblocks.drv: no connected, non-draining worker for system 'aarch64-darwin' offers features {}, the workers offer {}
bhkky2n1rlsxfqqljlkzw9285vhw14xv-tea-create-pr.drv: no connected, non-draining worker for system 'aarch64-darwin' offers features {}, the workers offer {}
lxr8rqdvglwdxn9f2bm51s12g5ajnyqn-clan-runtime.drv: no connected, non-draining worker for system 'aarch64-darwin' offers features {}, the workers offer {}
qgyz1jxvkphwlgf9kz6bh68r8p8ywgk5-lint-cross-compat.drv: no connected, non-draining worker for system 'aarch64-darwin' offers features {}, the workers offer {}
rx5pxikcvm5z95kx61w8wa6m06zrqb4w-Terms.yml.drv: no connected, non-draining worker for system 'aarch64-darwin' offers features {}, the workers offer {}
ydjg695g7gkgpfk0bdyrks5150irm1sm-python3.13-datamodel-code-generator-0.52.1.drv: no connected, non-draining worker for system 'aarch64-darwin' offers features {}, the workers offer {}
zbapc0x7k24x20sq2k0m2zcpdxzlzgnp-sizelint.toml.drv: no connected, non-draining worker for system 'aarch64-darwin' offers features {}, the workers offer {}
error: dependency 'bhkky2n1rlsxfqqljlkzw9285vhw14xv-tea-create-pr.drv' failed
failed eval checks.aarch64-darwin.devShell-clan-site —
error: … while calling the 'derivationStrict' builtin at «nix-internal»/derivation-internal.nix:37:12: 36| 37| strict = …
error:
       … while calling the 'derivationStrict' builtin
         at «nix-internal»/derivation-internal.nix:37:12:
           36|
           37|   strict = derivationStrict drvAttrs;
             |            ^
           38|

       … while evaluating derivation 'nix-shell'
         whose name attribute is located at «https://releases.nixos.org/nixos/26.05/nixos-26.05.11680.6fcc160353f6/nixexprs.tar.xz?narHash=sha256-tM6MAMxVwetta6uD2aMzoWQ9v5EAaLLmYumiE4jVZeg%3D»/pkgs/stdenv/generic/make-derivation.nix:647:11

       … while evaluating attribute '__impureHostDeps' of derivation 'nix-shell'
         at «https://releases.nixos.org/nixos/26.05/nixos-26.05.11680.6fcc160353f6/nixexprs.tar.xz?narHash=sha256-tM6MAMxVwetta6uD2aMzoWQ9v5EAaLLmYumiE4jVZeg%3D»/pkgs/stdenv/generic/make-derivation.nix:816:11:
          815|             unique (computedPropagatedSandboxProfile ++ [ propagatedSandboxProfile ]);
          816|           ${if buildIsDarwin then "__impureHostDeps" else null} =
             |           ^
          817|             let

       (stack trace truncated; use '--show-trace' to show the full, detailed trace)

       error: Refusing to evaluate package 'pnpm-10.34.0' in /nix/store/k1vyrhach56zhxf4835z5whii9mdr485-source/pkgs/development/tools/pnpm/generic.nix:170 because it is marked as insecure

       Known issues:
        - CVE-2026-55487
        - CVE-2026-55698
        - CVE-2026-55180
        - CVE-2026-55697
        - CVE-2026-59194
        - CVE-2026-59195
        - CVE-2026-59196
        - CVE-2026-82392
        - CVE-2026-82393

       You can install it anyway by allowing this package, using the
       following methods:

       a) To temporarily allow all insecure packages, you can use an environment
          variable for a single invocation of the nix tools:

            $ export NIXPKGS_ALLOW_INSECURE=1

          Note: When using `nix shell`, `nix build`, `nix develop`, etc with a flake,
                then pass `--impure` in order to allow use of environment variables.

       b) for `nixos-rebuild` you can add ‘pnpm-10.34.0’ to
          `nixpkgs.config.permittedInsecurePackages` in the configuration.nix,
          like so:

            {
              nixpkgs.config.permittedInsecurePackages = [
                "pnpm-10.34.0"
              ];
            }

       c) For `nix-env`, `nix-build`, `nix-shell` or any other Nix command you can add
          ‘pnpm-10.34.0’ to `permittedInsecurePackages` in
          ~/.config/nixpkgs/config.nix, like so:

            {
              permittedInsecurePackages = [
                "pnpm-10.34.0"
              ];
            }
failed checks.aarch64-darwin.devShell-default 2m 3s
setup: 9bm3fnyv1px2rcxyb7bjdfibg5vd3nj3-fmt-nix-codeblocks.drv: no connected, non-draining worker for system 'aarch64-darwin' offers features {}, the workers of …
setup:
9bm3fnyv1px2rcxyb7bjdfibg5vd3nj3-fmt-nix-codeblocks.drv: no connected, non-draining worker for system 'aarch64-darwin' offers features {}, the workers offer {}
bhkky2n1rlsxfqqljlkzw9285vhw14xv-tea-create-pr.drv: no connected, non-draining worker for system 'aarch64-darwin' offers features {}, the workers offer {}
lxr8rqdvglwdxn9f2bm51s12g5ajnyqn-clan-runtime.drv: no connected, non-draining worker for system 'aarch64-darwin' offers features {}, the workers offer {}
qgyz1jxvkphwlgf9kz6bh68r8p8ywgk5-lint-cross-compat.drv: no connected, non-draining worker for system 'aarch64-darwin' offers features {}, the workers offer {}
rx5pxikcvm5z95kx61w8wa6m06zrqb4w-Terms.yml.drv: no connected, non-draining worker for system 'aarch64-darwin' offers features {}, the workers offer {}
ydjg695g7gkgpfk0bdyrks5150irm1sm-python3.13-datamodel-code-generator-0.52.1.drv: no connected, non-draining worker for system 'aarch64-darwin' offers features {}, the workers offer {}
zbapc0x7k24x20sq2k0m2zcpdxzlzgnp-sizelint.toml.drv: no connected, non-draining worker for system 'aarch64-darwin' offers features {}, the workers offer {}
error: dependency '8z7nmdfqg7alvl7dvfpf350xi7lqksfg-pending-reviews.drv' failed
failed checks.aarch64-darwin.devShell-inventory-schema 2m 2s
setup: warning: lxr8rqdvglwdxn9f2bm51s12g5ajnyqn-clan-runtime.drv: no connected, non-draining worker for system 'aarch64-darwin' offers features {}, the workers …
setup:
warning: lxr8rqdvglwdxn9f2bm51s12g5ajnyqn-clan-runtime.drv: no connected, non-draining worker for system 'aarch64-darwin' offers features {}, the workers offer {}, waiting up to 120s for a worker
warning: ydjg695g7gkgpfk0bdyrks5150irm1sm-python3.13-datamodel-code-generator-0.52.1.drv: no connected, non-draining worker for system 'aarch64-darwin' offers features {}, the workers offer {}, waiting up to 120s for a worker
4g5fqmp8imdqzfgnymq2kbwdci9yfy17-pythoncheck.sh.drv: no connected, non-draining worker for system 'aarch64-darwin' offers features {}, the workers offer {}
8z7nmdfqg7alvl7dvfpf350xi7lqksfg-pending-reviews.drv: no connected, non-draining worker for system 'aarch64-darwin' offers features {}, the workers offer {}
bhkky2n1rlsxfqqljlkzw9285vhw14xv-tea-create-pr.drv: no connected, non-draining worker for system 'aarch64-darwin' offers features {}, the workers offer {}
lxr8rqdvglwdxn9f2bm51s12g5ajnyqn-clan-runtime.drv: no connected, non-draining worker for system 'aarch64-darwin' offers features {}, the workers offer {}
ydjg695g7gkgpfk0bdyrks5150irm1sm-python3.13-datamodel-code-generator-0.52.1.drv: no connected, non-draining worker for system 'aarch64-darwin' offers features {}, the workers offer {}
error: dependency '8z7nmdfqg7alvl7dvfpf350xi7lqksfg-pending-reviews.drv' failed
failed checks.aarch64-darwin.eval-tests 2m 14s
setup: hl8dqqxfn4q0g1kdi8cvmwyl6nzic3l9-evalCheck-eval-lib-resolve-module.drv: no connected, non-draining worker for system 'aarch64-darwin' offers features {}, …
setup:
hl8dqqxfn4q0g1kdi8cvmwyl6nzic3l9-evalCheck-eval-lib-resolve-module.drv: no connected, non-draining worker for system 'aarch64-darwin' offers features {}, the workers offer {}
l615rin14jjwkgly09phw528q1klc0bp-evalCheck-eval-generators-to-sops.drv: no connected, non-draining worker for system 'aarch64-darwin' offers features {}, the workers offer {}
niqh2a5cqzv364yac4wmmnn8hraaq60k-evalCheck-lib-jsonschema-unit-tests.drv: no connected, non-draining worker for system 'aarch64-darwin' offers features {}, the workers offer {}
rs949zvmcdr6d3wk6rnp13xbmcp97852-evalCheck-eval-lib-values.drv: no connected, non-draining worker for system 'aarch64-darwin' offers features {}, the workers offer {}
v610l6lx9gamx8wivqdbzwnc12vvsf3a-evalCheck-eval-tests-zerotier.drv: no connected, non-draining worker for system 'aarch64-darwin' offers features {}, the workers offer {}
vhzl7pipikijlzmba8mzl4lmpm75rpwf-evalCheck-eval-lib-build-clan.drv: no connected, non-draining worker for system 'aarch64-darwin' offers features {}, the workers offer {}
xwf143avi41yr8llyrgcyny32c4w5p0a-evalCheck-eval-tests-syncthing.drv: no connected, non-draining worker for system 'aarch64-darwin' offers features {}, the workers offer {}
error: dependency '60iaj5c9iqrjy8r9pr9m5ff68h68cl66-evalCheck-eval-lib-exports.drv' failed
failed checks.aarch64-darwin.lib-jsonschema-example-valid 2m 3s
setup: don't know how to build these paths: /nix/store/d9265m4xh8l704k9vwjv1q3hflpwq4jr-lib-jsonschema-example-valid.drv warning: ignoring the client-specifie …
setup:
don't know how to build these paths:
  /nix/store/d9265m4xh8l704k9vwjv1q3hflpwq4jr-lib-jsonschema-example-valid.drv
warning: ignoring the client-specified setting 'store', because it is a restricted setting and you are not a trusted user
warning: d9265m4xh8l704k9vwjv1q3hflpwq4jr-lib-jsonschema-example-valid.drv: no connected, non-draining worker for system 'aarch64-darwin' offers features {}, the workers offer {}, waiting up to 120s for a worker
d9265m4xh8l704k9vwjv1q3hflpwq4jr-lib-jsonschema-example-valid.drv: no connected, non-draining worker for system 'aarch64-darwin' offers features {}, the workers offer {}
error: no connected, non-draining worker for system 'aarch64-darwin' offers features {}, the workers offer {}
failed checks.aarch64-darwin.treefmt 2m 10s
setup: /nix/store/n7p1x32wf4irnayvwbl4r5iqvysikqn8-zlib-ng-2.3.3 /nix/store/jy52fklj7cbcmz11chmy9swxylqn8bbm-zstd-1.5.7 /nix/store/wr82xdgrbzxa546ifmvkzqn …
setup:
  /nix/store/n7p1x32wf4irnayvwbl4r5iqvysikqn8-zlib-ng-2.3.3
  /nix/store/jy52fklj7cbcmz11chmy9swxylqn8bbm-zstd-1.5.7
  /nix/store/wr82xdgrbzxa546ifmvkzqn46swr220f-zstd-1.5.7-bin
  /nix/store/gr8mnaz86kwnw1a017hvqyx3jkgryb3q-zstd-1.5.7-dev
warning: ignoring the client-specified setting 'store', because it is a restricted setting and you are not a trusted user
warning: cli542snfh4azrap53gnqdkz90h5sfvr-treefmt-check.drv: no connected, non-draining worker for system 'aarch64-darwin' offers features {}, the workers offer {}, waiting up to 120s for a worker
cli542snfh4azrap53gnqdkz90h5sfvr-treefmt-check.drv: no connected, non-draining worker for system 'aarch64-darwin' offers features {}, the workers offer {}
error: no connected, non-draining worker for system 'aarch64-darwin' offers features {}, the workers offer {}
failed checks.aarch64-darwin.zerotier-tools-pytest 2m 2s
setup: don't know how to build these paths: /nix/store/nhf0pgz8v7pi38ggih491zvvxh0a19r3-zerotier-tools-pytest.drv warning: ignoring the client-specified setti …
setup:
don't know how to build these paths:
  /nix/store/nhf0pgz8v7pi38ggih491zvvxh0a19r3-zerotier-tools-pytest.drv
warning: ignoring the client-specified setting 'store', because it is a restricted setting and you are not a trusted user
warning: ghshv97idlargpf015rbsgvdmk4p9chp-python3-3.13.15-env.drv: no connected, non-draining worker for system 'aarch64-darwin' offers features {}, the workers offer {}, waiting up to 120s for a worker
ghshv97idlargpf015rbsgvdmk4p9chp-python3-3.13.15-env.drv: no connected, non-draining worker for system 'aarch64-darwin' offers features {}, the workers offer {}
error: dependency 'ghshv97idlargpf015rbsgvdmk4p9chp-python3-3.13.15-env.drv' failed
failed checks.aarch64-linux.admin 1m 18s
setup: g66fdvinfjr78qvdxgz9b314sw4gszc3-decrypt-age-secrets.drv: build01: the build this call attached to did not finish, retry, asking the scheduler again ahwk …
setup:
g66fdvinfjr78qvdxgz9b314sw4gszc3-decrypt-age-secrets.drv: build01: the build this call attached to did not finish, retry, asking the scheduler again
ahwky2imndrhg86zbs119ldh71fs54x8-X-Restart-Triggers-nix-daemon.drv: build01: build01: input not substitutable: error: path '/nix/store/9d7gg64nc7x6cp7p8baznwr3agibzmfr-nix.conf' is required, but there is no substituter that can build it, asking the scheduler again
a2d0xj6xzgjl7wp4h4vx72sh9fmqdqy0-command-not-found.drv: build01: the build this call attached to did not finish, retry, asking the scheduler again
y8w6xrp7xpgzg6md1hvbfplzhpy26q11-decrypt-age-secrets.drv: build01: build01: input not substitutable: error: path '/nix/store/xqmbsf4zbphr1657ibx6smxqy01k1p69-mount-secret-fs' is required, but there is no substituter that can build it, asking the scheduler again
g66fdvinfjr78qvdxgz9b314sw4gszc3-decrypt-age-secrets.drv: build01: build01: input not substitutable: error: path '/nix/store/xqmbsf4zbphr1657ibx6smxqy01k1p69-mount-secret-fs' is required, but there is no substituter that can build it, asking the scheduler again
y8w6xrp7xpgzg6md1hvbfplzhpy26q11-decrypt-age-secrets.drv: build01: build01: input not substitutable: error: path '/nix/store/xqmbsf4zbphr1657ibx6smxqy01k1p69-mount-secret-fs' is required, but there is no substituter that can build it, asking the scheduler again
g66fdvinfjr78qvdxgz9b314sw4gszc3-decrypt-age-secrets.drv: build01: build01: input not substitutable: error: path '/nix/store/xqmbsf4zbphr1657ibx6smxqy01k1p69-mount-secret-fs' is required, but there is no substituter that can build it, asking the scheduler again
error: dependency '2yh9s13qf2wkd2clkpxkdqxsvwf9yhpi-nixos-test-driver-admin.drv' failed
failed eval checks.aarch64-linux.all-packages —
error: … while calling the 'derivationStrict' builtin at «nix-internal»/derivation-internal.nix:37:12: 36| 37| strict = …
error:
       … while calling the 'derivationStrict' builtin
         at «nix-internal»/derivation-internal.nix:37:12:
           36|
           37|   strict = derivationStrict drvAttrs;
             |            ^
           38|

       … while evaluating derivation 'all-packages'
         whose name attribute is located at «https://releases.nixos.org/nixos/26.05/nixos-26.05.11680.6fcc160353f6/nixexprs.tar.xz?narHash=sha256-tM6MAMxVwetta6uD2aMzoWQ9v5EAaLLmYumiE4jVZeg%3D»/pkgs/stdenv/generic/make-derivation.nix:647:11

       … while evaluating attribute 'buildCommand' of derivation 'all-packages'
         at «https://releases.nixos.org/nixos/26.05/nixos-26.05.11680.6fcc160353f6/nixexprs.tar.xz?narHash=sha256-tM6MAMxVwetta6uD2aMzoWQ9v5EAaLLmYumiE4jVZeg%3D»/pkgs/build-support/trivial-builders/default.nix:81:17:
           80|         enableParallelBuilding = true;
           81|         inherit buildCommand name;
             |                 ^
           82|         passAsFile = [ "buildCommand" ] ++ (derivationArgs.passAsFile or [ ]);

       (stack trace truncated; use '--show-trace' to show the full, detailed trace)

       error: Refusing to evaluate package 'pnpm-10.34.0' in /nix/store/k1vyrhach56zhxf4835z5whii9mdr485-source/pkgs/development/tools/pnpm/generic.nix:170 because it is marked as insecure

       Known issues:
        - CVE-2026-55487
        - CVE-2026-55698
        - CVE-2026-55180
        - CVE-2026-55697
        - CVE-2026-59194
        - CVE-2026-59195
        - CVE-2026-59196
        - CVE-2026-82392
        - CVE-2026-82393

       You can install it anyway by allowing this package, using the
       following methods:

       a) To temporarily allow all insecure packages, you can use an environment
          variable for a single invocation of the nix tools:

            $ export NIXPKGS_ALLOW_INSECURE=1

          Note: When using `nix shell`, `nix build`, `nix develop`, etc with a flake,
                then pass `--impure` in order to allow use of environment variables.

       b) for `nixos-rebuild` you can add ‘pnpm-10.34.0’ to
          `nixpkgs.config.permittedInsecurePackages` in the configuration.nix,
          like so:

            {
              nixpkgs.config.permittedInsecurePackages = [
                "pnpm-10.34.0"
              ];
            }

       c) For `nix-env`, `nix-build`, `nix-shell` or any other Nix command you can add
          ‘pnpm-10.34.0’ to `permittedInsecurePackages` in
          ~/.config/nixpkgs/config.nix, like so:

            {
              permittedInsecurePackages = [
                "pnpm-10.34.0"
              ];
            }
failed eval checks.aarch64-linux.borgbackup —
error: … while evaluating the attribute 'drvPath' at «https://releases.nixos.org/nixos/26.05/nixos-26.05.11680.6fcc160353f6/nixexprs.tar.xz?narH …
error:
       … while evaluating the attribute 'drvPath'
         at «https://releases.nixos.org/nixos/26.05/nixos-26.05.11680.6fcc160353f6/nixexprs.tar.xz?narHash=sha256-tM6MAMxVwetta6uD2aMzoWQ9v5EAaLLmYumiE4jVZeg%3D»/lib/customisation.nix:427:7:
          426|     // {
          427|       drvPath =
             |       ^
          428|         assert condition;

       … while calling the 'derivationStrict' builtin
         at «nix-internal»/derivation-internal.nix:37:12:
           36|
           37|   strict = derivationStrict drvAttrs;
             |            ^
           38|

       … while evaluating the option `nodes.clientone.networking.interfaces':

       … while evaluating definitions from `/nix/store/k1vyrhach56zhxf4835z5whii9mdr485-source/nixos/modules/hardware/facter/networking':

       … while evaluating the option `nodes.clientone.hardware.facter.enable':

       … while evaluating the option `nodes.clientone.hardware.facter.report':

       … while evaluating the option `nodes.clientone.hardware.facter.reportPath':

       … while evaluating definitions from `/nix/store/49x637kiwh63f7fc071q93np9vil8j1k-source/nixosModules/clanCore/nixos-facter.nix':

       (stack trace truncated; use '--show-trace' to show the full, detailed trace)

       error: build of '/nix/store/iymk7adx6w7kdzk12m8yl90s7n15qava-merged-test-dir-borgbackup.drv^out' failed: error: gave up after 9 reschedules
failed eval checks.aarch64-linux.certificates —
error: … while evaluating the attribute 'drvPath' at «https://releases.nixos.org/nixos/26.05/nixos-26.05.11680.6fcc160353f6/nixexprs.tar.xz?narH …
error:
       … while evaluating the attribute 'drvPath'
         at «https://releases.nixos.org/nixos/26.05/nixos-26.05.11680.6fcc160353f6/nixexprs.tar.xz?narHash=sha256-tM6MAMxVwetta6uD2aMzoWQ9v5EAaLLmYumiE4jVZeg%3D»/lib/customisation.nix:427:7:
          426|     // {
          427|       drvPath =
             |       ^
          428|         assert condition;

       … while calling the 'derivationStrict' builtin
         at «nix-internal»/derivation-internal.nix:37:12:
           36|
           37|   strict = derivationStrict drvAttrs;
             |            ^
           38|

       … while evaluating the option `nodes.ca.networking.interfaces':

       … while evaluating definitions from `/nix/store/k1vyrhach56zhxf4835z5whii9mdr485-source/nixos/modules/hardware/facter/networking':

       … while evaluating the option `nodes.ca.hardware.facter.enable':

       … while evaluating the option `nodes.ca.hardware.facter.report':

       … while evaluating the option `nodes.ca.hardware.facter.reportPath':

       … while evaluating definitions from `/nix/store/49x637kiwh63f7fc071q93np9vil8j1k-source/nixosModules/clanCore/nixos-facter.nix':

       (stack trace truncated; use '--show-trace' to show the full, detailed trace)

       error: build of '/nix/store/4l0b6fay94iqq24kqzjr0340hb8isk8v-merged-test-dir-certificates.drv^out' failed: error: dependency 'dcprywyx49335g99k4zk2zypa1zwazh8-test-vars-generated.drv' failed
failed eval checks.aarch64-linux.clan-site-lint —
error: … while calling the 'derivationStrict' builtin at «nix-internal»/derivation-internal.nix:37:12: 36| 37| strict = …
error:
       … while calling the 'derivationStrict' builtin
         at «nix-internal»/derivation-internal.nix:37:12:
           36|
           37|   strict = derivationStrict drvAttrs;
             |            ^
           38|

       … while evaluating derivation 'clan-site-lint'
         whose name attribute is located at «https://releases.nixos.org/nixos/26.05/nixos-26.05.11680.6fcc160353f6/nixexprs.tar.xz?narHash=sha256-tM6MAMxVwetta6uD2aMzoWQ9v5EAaLLmYumiE4jVZeg%3D»/pkgs/stdenv/generic/make-derivation.nix:647:11

       … while evaluating attribute 'nativeBuildInputs' of derivation 'clan-site-lint'
         at «https://releases.nixos.org/nixos/26.05/nixos-26.05.11680.6fcc160353f6/nixexprs.tar.xz?narHash=sha256-tM6MAMxVwetta6uD2aMzoWQ9v5EAaLLmYumiE4jVZeg%3D»/pkgs/stdenv/generic/make-derivation.nix:715:11:
          714|           depsBuildBuild = buildBuildOutputs;
          715|           nativeBuildInputs = buildHostOutputs;
             |           ^
          716|           depsBuildTarget = buildTargetOutputs;

       (stack trace truncated; use '--show-trace' to show the full, detailed trace)

       error: Refusing to evaluate package 'pnpm-10.34.0' in /nix/store/k1vyrhach56zhxf4835z5whii9mdr485-source/pkgs/development/tools/pnpm/generic.nix:170 because it is marked as insecure

       Known issues:
        - CVE-2026-55487
        - CVE-2026-55698
        - CVE-2026-55180
        - CVE-2026-55697
        - CVE-2026-59194
        - CVE-2026-59195
        - CVE-2026-59196
        - CVE-2026-82392
        - CVE-2026-82393

       You can install it anyway by allowing this package, using the
       following methods:

       a) To temporarily allow all insecure packages, you can use an environment
          variable for a single invocation of the nix tools:

            $ export NIXPKGS_ALLOW_INSECURE=1

          Note: When using `nix shell`, `nix build`, `nix develop`, etc with a flake,
                then pass `--impure` in order to allow use of environment variables.

       b) for `nixos-rebuild` you can add ‘pnpm-10.34.0’ to
          `nixpkgs.config.permittedInsecurePackages` in the configuration.nix,
          like so:

            {
              nixpkgs.config.permittedInsecurePackages = [
                "pnpm-10.34.0"
              ];
            }

       c) For `nix-env`, `nix-build`, `nix-shell` or any other Nix command you can add
          ‘pnpm-10.34.0’ to `permittedInsecurePackages` in
          ~/.config/nixpkgs/config.nix, like so:

            {
              permittedInsecurePackages = [
                "pnpm-10.34.0"
              ];
            }
failed checks.aarch64-linux.clan-test-iso 7m 10s
setup: a2d0xj6xzgjl7wp4h4vx72sh9fmqdqy0-command-not-found.drv: build01: build01: input not substitutable: error: path '/nix/store/5fdmcpd1nqkzidxc440jdix6z98n16 …
setup:
a2d0xj6xzgjl7wp4h4vx72sh9fmqdqy0-command-not-found.drv: build01: build01: input not substitutable: error: path '/nix/store/5fdmcpd1nqkzidxc440jdix6z98n16gc-perl-5.42.3-env' is required, but there is no substituter that can build it, asking the scheduler again
a2d0xj6xzgjl7wp4h4vx72sh9fmqdqy0-command-not-found.drv: build01: build01: input not substitutable: error: path '/nix/store/5fdmcpd1nqkzidxc440jdix6z98n16gc-perl-5.42.3-env' is required, but there is no substituter that can build it, asking the scheduler again
a2d0xj6xzgjl7wp4h4vx72sh9fmqdqy0-command-not-found.drv: build01: build01: input not substitutable: error: path '/nix/store/5fdmcpd1nqkzidxc440jdix6z98n16gc-perl-5.42.3-env' is required, but there is no substituter that can build it, asking the scheduler again
a2d0xj6xzgjl7wp4h4vx72sh9fmqdqy0-command-not-found.drv: build01: build01: input not substitutable: error: path '/nix/store/5fdmcpd1nqkzidxc440jdix6z98n16gc-perl-5.42.3-env' is required, but there is no substituter that can build it, asking the scheduler again
a2d0xj6xzgjl7wp4h4vx72sh9fmqdqy0-command-not-found.drv: build01: build01: input not substitutable: error: path '/nix/store/5fdmcpd1nqkzidxc440jdix6z98n16gc-perl-5.42.3-env' is required, but there is no substituter that can build it, asking the scheduler again
a2d0xj6xzgjl7wp4h4vx72sh9fmqdqy0-command-not-found.drv: build01: build01: input not substitutable: error: path '/nix/store/5fdmcpd1nqkzidxc440jdix6z98n16gc-perl-5.42.3-env' is required, but there is no substituter that can build it, asking the scheduler again
a2d0xj6xzgjl7wp4h4vx72sh9fmqdqy0-command-not-found.drv: build01: build01: input not substitutable: error: path '/nix/store/5fdmcpd1nqkzidxc440jdix6z98n16gc-perl-5.42.3-env' is required, but there is no substituter that can build it, asking the scheduler again
error: dependency '3jjqhxdx0ysqjf9by06cs27v9krkkzzd-nixos-test-driver-clan-test-iso.drv' failed
failed checks.aarch64-linux.darwin-test-darwin-machine 2m 1s
setup: q8j2d3gm7gwm3k0ail51fkbw9nyrpzaz-etc-registry.json.drv: no connected, non-draining worker for system 'aarch64-darwin' offers features {}, the workers off …
setup:
q8j2d3gm7gwm3k0ail51fkbw9nyrpzaz-etc-registry.json.drv: no connected, non-draining worker for system 'aarch64-darwin' offers features {}, the workers offer {}
qm4r6lgv1ld1pdf52ndlra10gsm97mr8-darwin-rebuild.drv: no connected, non-draining worker for system 'aarch64-darwin' offers features {}, the workers offer {}
rjrx4i80iwd7xri74wfsfxi8fsal8gbp-set-environment.drv: no connected, non-draining worker for system 'aarch64-darwin' offers features {}, the workers offer {}
w4afz2impwxc5cqv08bsa2vh6gr5pl3d-patches.drv: no connected, non-draining worker for system 'aarch64-darwin' offers features {}, the workers offer {}
y5f294bglikn7b7gcnlchbaj9j1qmfjf-etc-099-host-keys.conf.drv: no connected, non-draining worker for system 'aarch64-darwin' offers features {}, the workers offer {}
y6v0x6ql68q9080awrq8ab9mw6l1gavh-launchd.drv: no connected, non-draining worker for system 'aarch64-darwin' offers features {}, the workers offer {}
z9s1ywmxymywpbrgf5vr2x1q6ydvp5cx-darwin-version.json.drv: no connected, non-draining worker for system 'aarch64-darwin' offers features {}, the workers offer {}
error: dependency 'agvg2jxavh8brpfpq88c022j89rcycsr-darwin-version.json.drv' failed
failed eval checks.aarch64-linux.data-mesher —
error: … while evaluating the attribute 'drvPath' at «https://releases.nixos.org/nixos/26.05/nixos-26.05.11680.6fcc160353f6/nixexprs.tar.xz?narH …
error:
       … while evaluating the attribute 'drvPath'
         at «https://releases.nixos.org/nixos/26.05/nixos-26.05.11680.6fcc160353f6/nixexprs.tar.xz?narHash=sha256-tM6MAMxVwetta6uD2aMzoWQ9v5EAaLLmYumiE4jVZeg%3D»/lib/customisation.nix:427:7:
          426|     // {
          427|       drvPath =
             |       ^
          428|         assert condition;

       … while calling the 'derivationStrict' builtin
         at «nix-internal»/derivation-internal.nix:37:12:
           36|
           37|   strict = derivationStrict drvAttrs;
             |            ^
           38|

       … while evaluating the option `nodes.alpha.networking.interfaces':

       … while evaluating definitions from `/nix/store/k1vyrhach56zhxf4835z5whii9mdr485-source/nixos/modules/hardware/facter/networking':

       … while evaluating the option `nodes.alpha.hardware.facter.enable':

       … while evaluating the option `nodes.alpha.hardware.facter.report':

       … while evaluating the option `nodes.alpha.hardware.facter.reportPath':

       … while evaluating definitions from `/nix/store/49x637kiwh63f7fc071q93np9vil8j1k-source/nixosModules/clanCore/nixos-facter.nix':

       (stack trace truncated; use '--show-trace' to show the full, detailed trace)

       error: gRPC FetchNars failed: error: path '/nix/store/06gndqwdcgxnblx7nr2jc6k0nzfj48jq-merged-test-dir-data-mesher' is required, but there is no substituter that can build it
failed eval checks.aarch64-linux.devShell-clan-site —
error: … while calling the 'derivationStrict' builtin at «nix-internal»/derivation-internal.nix:37:12: 36| 37| strict = …
error:
       … while calling the 'derivationStrict' builtin
         at «nix-internal»/derivation-internal.nix:37:12:
           36|
           37|   strict = derivationStrict drvAttrs;
             |            ^
           38|

       … while evaluating derivation 'nix-shell'
         whose name attribute is located at «https://releases.nixos.org/nixos/26.05/nixos-26.05.11680.6fcc160353f6/nixexprs.tar.xz?narHash=sha256-tM6MAMxVwetta6uD2aMzoWQ9v5EAaLLmYumiE4jVZeg%3D»/pkgs/stdenv/generic/make-derivation.nix:647:11

       … while evaluating attribute 'nativeBuildInputs' of derivation 'nix-shell'
         at «https://releases.nixos.org/nixos/26.05/nixos-26.05.11680.6fcc160353f6/nixexprs.tar.xz?narHash=sha256-tM6MAMxVwetta6uD2aMzoWQ9v5EAaLLmYumiE4jVZeg%3D»/pkgs/stdenv/generic/make-derivation.nix:715:11:
          714|           depsBuildBuild = buildBuildOutputs;
          715|           nativeBuildInputs = buildHostOutputs;
             |           ^
          716|           depsBuildTarget = buildTargetOutputs;

       (stack trace truncated; use '--show-trace' to show the full, detailed trace)

       error: Refusing to evaluate package 'pnpm-10.34.0' in /nix/store/k1vyrhach56zhxf4835z5whii9mdr485-source/pkgs/development/tools/pnpm/generic.nix:170 because it is marked as insecure

       Known issues:
        - CVE-2026-55487
        - CVE-2026-55698
        - CVE-2026-55180
        - CVE-2026-55697
        - CVE-2026-59194
        - CVE-2026-59195
        - CVE-2026-59196
        - CVE-2026-82392
        - CVE-2026-82393

       You can install it anyway by allowing this package, using the
       following methods:

       a) To temporarily allow all insecure packages, you can use an environment
          variable for a single invocation of the nix tools:

            $ export NIXPKGS_ALLOW_INSECURE=1

          Note: When using `nix shell`, `nix build`, `nix develop`, etc with a flake,
                then pass `--impure` in order to allow use of environment variables.

       b) for `nixos-rebuild` you can add ‘pnpm-10.34.0’ to
          `nixpkgs.config.permittedInsecurePackages` in the configuration.nix,
          like so:

            {
              nixpkgs.config.permittedInsecurePackages = [
                "pnpm-10.34.0"
              ];
            }

       c) For `nix-env`, `nix-build`, `nix-shell` or any other Nix command you can add
          ‘pnpm-10.34.0’ to `permittedInsecurePackages` in
          ~/.config/nixpkgs/config.nix, like so:

            {
              permittedInsecurePackages = [
                "pnpm-10.34.0"
              ];
            }
failed eval checks.aarch64-linux.devShell-docs —
error: … while calling the 'derivationStrict' builtin at «nix-internal»/derivation-internal.nix:37:12: 36| 37| strict = …
error:
       … while calling the 'derivationStrict' builtin
         at «nix-internal»/derivation-internal.nix:37:12:
           36|
           37|   strict = derivationStrict drvAttrs;
             |            ^
           38|

       … while evaluating derivation 'nix-shell'
         whose name attribute is located at «https://releases.nixos.org/nixos/26.05/nixos-26.05.11680.6fcc160353f6/nixexprs.tar.xz?narHash=sha256-tM6MAMxVwetta6uD2aMzoWQ9v5EAaLLmYumiE4jVZeg%3D»/pkgs/stdenv/generic/make-derivation.nix:647:11

       … while evaluating attribute 'nativeBuildInputs' of derivation 'nix-shell'
         at «https://releases.nixos.org/nixos/26.05/nixos-26.05.11680.6fcc160353f6/nixexprs.tar.xz?narHash=sha256-tM6MAMxVwetta6uD2aMzoWQ9v5EAaLLmYumiE4jVZeg%3D»/pkgs/stdenv/generic/make-derivation.nix:715:11:
          714|           depsBuildBuild = buildBuildOutputs;
          715|           nativeBuildInputs = buildHostOutputs;
             |           ^
          716|           depsBuildTarget = buildTargetOutputs;

       (stack trace truncated; use '--show-trace' to show the full, detailed trace)

       error: Refusing to evaluate package 'pnpm-10.34.0' in /nix/store/k1vyrhach56zhxf4835z5whii9mdr485-source/pkgs/development/tools/pnpm/generic.nix:170 because it is marked as insecure

       Known issues:
        - CVE-2026-55487
        - CVE-2026-55698
        - CVE-2026-55180
        - CVE-2026-55697
        - CVE-2026-59194
        - CVE-2026-59195
        - CVE-2026-59196
        - CVE-2026-82392
        - CVE-2026-82393

       You can install it anyway by allowing this package, using the
       following methods:

       a) To temporarily allow all insecure packages, you can use an environment
          variable for a single invocation of the nix tools:

            $ export NIXPKGS_ALLOW_INSECURE=1

          Note: When using `nix shell`, `nix build`, `nix develop`, etc with a flake,
                then pass `--impure` in order to allow use of environment variables.

       b) for `nixos-rebuild` you can add ‘pnpm-10.34.0’ to
          `nixpkgs.config.permittedInsecurePackages` in the configuration.nix,
          like so:

            {
              nixpkgs.config.permittedInsecurePackages = [
                "pnpm-10.34.0"
              ];
            }

       c) For `nix-env`, `nix-build`, `nix-shell` or any other Nix command you can add
          ‘pnpm-10.34.0’ to `permittedInsecurePackages` in
          ~/.config/nixpkgs/config.nix, like so:

            {
              permittedInsecurePackages = [
                "pnpm-10.34.0"
              ];
            }
failed checks.aarch64-linux.dm-dns 1m 16s
setup: nhdnpsysj643yi6m3gkb04gkrj9795cl-decrypt-age-secrets.drv: build01: build01: input not substitutable: error: path '/nix/store/xqmbsf4zbphr1657ibx6smxqy01k …
setup:
nhdnpsysj643yi6m3gkb04gkrj9795cl-decrypt-age-secrets.drv: build01: build01: input not substitutable: error: path '/nix/store/xqmbsf4zbphr1657ibx6smxqy01k1p69-mount-secret-fs' is required, but there is no substituter that can build it, asking the scheduler again
a2d0xj6xzgjl7wp4h4vx72sh9fmqdqy0-command-not-found.drv: build01: the build this call attached to did not finish, retry, asking the scheduler again
1s72amzjr08x3iiylrwxqa26y00ad7l4-decrypt-age-secrets.drv: build01: build01: input not substitutable: error: path '/nix/store/xqmbsf4zbphr1657ibx6smxqy01k1p69-mount-secret-fs' is required, but there is no substituter that can build it, asking the scheduler again
a2d0xj6xzgjl7wp4h4vx72sh9fmqdqy0-command-not-found.drv: build01: build01: input not substitutable: error: path '/nix/store/5fdmcpd1nqkzidxc440jdix6z98n16gc-perl-5.42.3-env' is required, but there is no substituter that can build it, asking the scheduler again
nhdnpsysj643yi6m3gkb04gkrj9795cl-decrypt-age-secrets.drv: build01: build01: input not substitutable: error: path '/nix/store/xqmbsf4zbphr1657ibx6smxqy01k1p69-mount-secret-fs' is required, but there is no substituter that can build it, asking the scheduler again
ahwky2imndrhg86zbs119ldh71fs54x8-X-Restart-Triggers-nix-daemon.drv: build01: the build this call attached to did not finish, retry, asking the scheduler again
nhdnpsysj643yi6m3gkb04gkrj9795cl-decrypt-age-secrets.drv: build01: build01: input not substitutable: error: path '/nix/store/xqmbsf4zbphr1657ibx6smxqy01k1p69-mount-secret-fs' is required, but there is no substituter that can build it, asking the scheduler again
error: dependency 'qmnjaq6mz66c4mjfy6064hvv51vvl7ld-nixos-test-driver-dm-dns.drv' failed
failed checks.aarch64-linux.dyndns 2m 13s
setup: a2d0xj6xzgjl7wp4h4vx72sh9fmqdqy0-command-not-found.drv: build01: build01: input not substitutable: error: path '/nix/store/5fdmcpd1nqkzidxc440jdix6z98n16 …
setup:
a2d0xj6xzgjl7wp4h4vx72sh9fmqdqy0-command-not-found.drv: build01: build01: input not substitutable: error: path '/nix/store/5fdmcpd1nqkzidxc440jdix6z98n16gc-perl-5.42.3-env' is required, but there is no substituter that can build it, asking the scheduler again
5h3kimag6l6pljvnx39jphmb08pva54g-unit-nix-daemon.service.drv: build01: build01: input not substitutable: error: path '/nix/store/zc12x1yxf4yskzilqgq9ww7bfyfq1cvj-X-Restart-Triggers-nix-daemon' is required, but there is no substituter that can build it, asking the scheduler again
a2d0xj6xzgjl7wp4h4vx72sh9fmqdqy0-command-not-found.drv: build01: build01: input not substitutable: error: path '/nix/store/5fdmcpd1nqkzidxc440jdix6z98n16gc-perl-5.42.3-env' is required, but there is no substituter that can build it, asking the scheduler again
5h3kimag6l6pljvnx39jphmb08pva54g-unit-nix-daemon.service.drv: build01: build01: input not substitutable: error: path '/nix/store/zc12x1yxf4yskzilqgq9ww7bfyfq1cvj-X-Restart-Triggers-nix-daemon' is required, but there is no substituter that can build it, asking the scheduler again
a2d0xj6xzgjl7wp4h4vx72sh9fmqdqy0-command-not-found.drv: build01: build01: input not substitutable: error: path '/nix/store/5fdmcpd1nqkzidxc440jdix6z98n16gc-perl-5.42.3-env' is required, but there is no substituter that can build it, asking the scheduler again
5h3kimag6l6pljvnx39jphmb08pva54g-unit-nix-daemon.service.drv: build01: build01: input not substitutable: error: path '/nix/store/zc12x1yxf4yskzilqgq9ww7bfyfq1cvj-X-Restart-Triggers-nix-daemon' is required, but there is no substituter that can build it, asking the scheduler again
5h3kimag6l6pljvnx39jphmb08pva54g-unit-nix-daemon.service.drv: build01: build01: input not substitutable: error: path '/nix/store/zc12x1yxf4yskzilqgq9ww7bfyfq1cvj-X-Restart-Triggers-nix-daemon' is required, but there is no substituter that can build it, asking the scheduler again
error: dependency 'grp2h320y6czfksmgw2ji80q9v236hrh-nixos-test-driver-dyndns.drv' failed
failed checks.aarch64-linux.garage 3m 19s
setup: ahwky2imndrhg86zbs119ldh71fs54x8-X-Restart-Triggers-nix-daemon.drv: build01: build01: input not substitutable: error: path '/nix/store/9d7gg64nc7x6cp7p8b …
setup:
ahwky2imndrhg86zbs119ldh71fs54x8-X-Restart-Triggers-nix-daemon.drv: build01: build01: input not substitutable: error: path '/nix/store/9d7gg64nc7x6cp7p8baznwr3agibzmfr-nix.conf' is required, but there is no substituter that can build it, asking the scheduler again
a2d0xj6xzgjl7wp4h4vx72sh9fmqdqy0-command-not-found.drv: build01: build01: input not substitutable: error: path '/nix/store/5fdmcpd1nqkzidxc440jdix6z98n16gc-perl-5.42.3-env' is required, but there is no substituter that can build it, asking the scheduler again
ahwky2imndrhg86zbs119ldh71fs54x8-X-Restart-Triggers-nix-daemon.drv: build01: build01: input not substitutable: error: path '/nix/store/9d7gg64nc7x6cp7p8baznwr3agibzmfr-nix.conf' is required, but there is no substituter that can build it, asking the scheduler again
a2d0xj6xzgjl7wp4h4vx72sh9fmqdqy0-command-not-found.drv: build01: build01: input not substitutable: error: path '/nix/store/5fdmcpd1nqkzidxc440jdix6z98n16gc-perl-5.42.3-env' is required, but there is no substituter that can build it, asking the scheduler again
ahwky2imndrhg86zbs119ldh71fs54x8-X-Restart-Triggers-nix-daemon.drv: build01: build01: input not substitutable: error: path '/nix/store/9d7gg64nc7x6cp7p8baznwr3agibzmfr-nix.conf' is required, but there is no substituter that can build it, asking the scheduler again
a2d0xj6xzgjl7wp4h4vx72sh9fmqdqy0-command-not-found.drv: build01: build01: input not substitutable: error: path '/nix/store/5fdmcpd1nqkzidxc440jdix6z98n16gc-perl-5.42.3-env' is required, but there is no substituter that can build it, asking the scheduler again
ahwky2imndrhg86zbs119ldh71fs54x8-X-Restart-Triggers-nix-daemon.drv: build01: build01: input not substitutable: error: path '/nix/store/9d7gg64nc7x6cp7p8baznwr3agibzmfr-nix.conf' is required, but there is no substituter that can build it, asking the scheduler again
error: dependency 'y8lnjqy45sc2rla1vvw00rs41hpw4c5j-nixos-test-driver-garage.drv' failed
failed checks.aarch64-linux.hello-service 1m 18s
setup: g66fdvinfjr78qvdxgz9b314sw4gszc3-decrypt-age-secrets.drv: build01: the build this call attached to did not finish, retry, asking the scheduler again ahwk …
setup:
g66fdvinfjr78qvdxgz9b314sw4gszc3-decrypt-age-secrets.drv: build01: the build this call attached to did not finish, retry, asking the scheduler again
ahwky2imndrhg86zbs119ldh71fs54x8-X-Restart-Triggers-nix-daemon.drv: build01: build01: input not substitutable: error: path '/nix/store/9d7gg64nc7x6cp7p8baznwr3agibzmfr-nix.conf' is required, but there is no substituter that can build it, asking the scheduler again
a2d0xj6xzgjl7wp4h4vx72sh9fmqdqy0-command-not-found.drv: build01: the build this call attached to did not finish, retry, asking the scheduler again
g66fdvinfjr78qvdxgz9b314sw4gszc3-decrypt-age-secrets.drv: build01: the build this call attached to did not finish, retry, asking the scheduler again
ahwky2imndrhg86zbs119ldh71fs54x8-X-Restart-Triggers-nix-daemon.drv: build01: the build this call attached to did not finish, retry, asking the scheduler again
g66fdvinfjr78qvdxgz9b314sw4gszc3-decrypt-age-secrets.drv: build01: the build this call attached to did not finish, retry, asking the scheduler again
a2d0xj6xzgjl7wp4h4vx72sh9fmqdqy0-command-not-found.drv: build01: the build this call attached to did not finish, retry, asking the scheduler again
error: dependency '4zqfmd3n2qf0ff769syp8pjiwls9klgn-nixos-test-driver-hello-service.drv' failed
failed checks.aarch64-linux.kde 1m 34s
setup: 5h3kimag6l6pljvnx39jphmb08pva54g-unit-nix-daemon.service.drv: build01: the build this call attached to did not finish, retry, asking the scheduler again …
setup:
5h3kimag6l6pljvnx39jphmb08pva54g-unit-nix-daemon.service.drv: build01: the build this call attached to did not finish, retry, asking the scheduler again
5h3kimag6l6pljvnx39jphmb08pva54g-unit-nix-daemon.service.drv: build01: the build this call attached to did not finish, retry, asking the scheduler again
g66fdvinfjr78qvdxgz9b314sw4gszc3-decrypt-age-secrets.drv: build01: the build this call attached to did not finish, retry, asking the scheduler again
a2d0xj6xzgjl7wp4h4vx72sh9fmqdqy0-command-not-found.drv: build01: the build this call attached to did not finish, retry, asking the scheduler again
5h3kimag6l6pljvnx39jphmb08pva54g-unit-nix-daemon.service.drv: build01: build01: input not substitutable: error: path '/nix/store/zc12x1yxf4yskzilqgq9ww7bfyfq1cvj-X-Restart-Triggers-nix-daemon' is required, but there is no substituter that can build it, asking the scheduler again
g66fdvinfjr78qvdxgz9b314sw4gszc3-decrypt-age-secrets.drv: build01: build01: input not substitutable: error: path '/nix/store/xqmbsf4zbphr1657ibx6smxqy01k1p69-mount-secret-fs' is required, but there is no substituter that can build it, asking the scheduler again
g66fdvinfjr78qvdxgz9b314sw4gszc3-decrypt-age-secrets.drv: build01: the build this call attached to did not finish, retry, asking the scheduler again
error: dependency 'b0n90f1zj16aacaffv94v8rxamkyw50m-nixos-test-driver-kde.drv' failed
failed checks.aarch64-linux.localbackup 5m 13s
setup: a2d0xj6xzgjl7wp4h4vx72sh9fmqdqy0-command-not-found.drv: build01: build01: input not substitutable: error: path '/nix/store/5fdmcpd1nqkzidxc440jdix6z98n16 …
setup:
a2d0xj6xzgjl7wp4h4vx72sh9fmqdqy0-command-not-found.drv: build01: build01: input not substitutable: error: path '/nix/store/5fdmcpd1nqkzidxc440jdix6z98n16gc-perl-5.42.3-env' is required, but there is no substituter that can build it, asking the scheduler again
5h3kimag6l6pljvnx39jphmb08pva54g-unit-nix-daemon.service.drv: build01: build01: input not substitutable: error: path '/nix/store/zc12x1yxf4yskzilqgq9ww7bfyfq1cvj-X-Restart-Triggers-nix-daemon' is required, but there is no substituter that can build it, asking the scheduler again
g66fdvinfjr78qvdxgz9b314sw4gszc3-decrypt-age-secrets.drv: build01: build01: input not substitutable: error: path '/nix/store/xqmbsf4zbphr1657ibx6smxqy01k1p69-mount-secret-fs' is required, but there is no substituter that can build it, asking the scheduler again
a2d0xj6xzgjl7wp4h4vx72sh9fmqdqy0-command-not-found.drv: build01: build01: input not substitutable: error: path '/nix/store/5fdmcpd1nqkzidxc440jdix6z98n16gc-perl-5.42.3-env' is required, but there is no substituter that can build it, asking the scheduler again
5h3kimag6l6pljvnx39jphmb08pva54g-unit-nix-daemon.service.drv: build01: build01: input not substitutable: error: path '/nix/store/zc12x1yxf4yskzilqgq9ww7bfyfq1cvj-X-Restart-Triggers-nix-daemon' is required, but there is no substituter that can build it, asking the scheduler again
a2d0xj6xzgjl7wp4h4vx72sh9fmqdqy0-command-not-found.drv: build01: build01: input not substitutable: error: path '/nix/store/5fdmcpd1nqkzidxc440jdix6z98n16gc-perl-5.42.3-env' is required, but there is no substituter that can build it, asking the scheduler again
5h3kimag6l6pljvnx39jphmb08pva54g-unit-nix-daemon.service.drv: build01: build01: input not substitutable: error: path '/nix/store/zc12x1yxf4yskzilqgq9ww7bfyfq1cvj-X-Restart-Triggers-nix-daemon' is required, but there is no substituter that can build it, asking the scheduler again
error: dependency '82myl7b6v9vgfh9g23faz3xvis83r5kl-nixos-test-driver-localbackup.drv' failed
failed checks.aarch64-linux.machine-id 5m 31s
setup: g66fdvinfjr78qvdxgz9b314sw4gszc3-decrypt-age-secrets.drv: build01: build01: input not substitutable: error: path '/nix/store/xqmbsf4zbphr1657ibx6smxqy01k …
setup:
g66fdvinfjr78qvdxgz9b314sw4gszc3-decrypt-age-secrets.drv: build01: build01: input not substitutable: error: path '/nix/store/xqmbsf4zbphr1657ibx6smxqy01k1p69-mount-secret-fs' is required, but there is no substituter that can build it, asking the scheduler again
5h3kimag6l6pljvnx39jphmb08pva54g-unit-nix-daemon.service.drv: build01: build01: input not substitutable: error: path '/nix/store/zc12x1yxf4yskzilqgq9ww7bfyfq1cvj-X-Restart-Triggers-nix-daemon' is required, but there is no substituter that can build it, asking the scheduler again
a2d0xj6xzgjl7wp4h4vx72sh9fmqdqy0-command-not-found.drv: build01: build01: input not substitutable: error: path '/nix/store/5fdmcpd1nqkzidxc440jdix6z98n16gc-perl-5.42.3-env' is required, but there is no substituter that can build it, asking the scheduler again
g66fdvinfjr78qvdxgz9b314sw4gszc3-decrypt-age-secrets.drv: build01: build01: input not substitutable: error: path '/nix/store/xqmbsf4zbphr1657ibx6smxqy01k1p69-mount-secret-fs' is required, but there is no substituter that can build it, asking the scheduler again
5h3kimag6l6pljvnx39jphmb08pva54g-unit-nix-daemon.service.drv: build01: build01: input not substitutable: error: path '/nix/store/zc12x1yxf4yskzilqgq9ww7bfyfq1cvj-X-Restart-Triggers-nix-daemon' is required, but there is no substituter that can build it, asking the scheduler again
a2d0xj6xzgjl7wp4h4vx72sh9fmqdqy0-command-not-found.drv: build01: build01: input not substitutable: error: path '/nix/store/5fdmcpd1nqkzidxc440jdix6z98n16gc-perl-5.42.3-env' is required, but there is no substituter that can build it, asking the scheduler again
5h3kimag6l6pljvnx39jphmb08pva54g-unit-nix-daemon.service.drv: build01: build01: input not substitutable: error: path '/nix/store/zc12x1yxf4yskzilqgq9ww7bfyfq1cvj-X-Restart-Triggers-nix-daemon' is required, but there is no substituter that can build it, asking the scheduler again
error: dependency 'lzmsprp4zrs3dgbyxkdf2277vkka6sam-nixos-test-driver-service-machine-id.drv' failed
failed checks.aarch64-linux.matrix-synapse 1m 15s
setup: a2d0xj6xzgjl7wp4h4vx72sh9fmqdqy0-command-not-found.drv: build01: the build this call attached to did not finish, retry, asking the scheduler again ahwky2 …
setup:
a2d0xj6xzgjl7wp4h4vx72sh9fmqdqy0-command-not-found.drv: build01: the build this call attached to did not finish, retry, asking the scheduler again
ahwky2imndrhg86zbs119ldh71fs54x8-X-Restart-Triggers-nix-daemon.drv: build01: the build this call attached to did not finish, retry, asking the scheduler again
2vkvkfqamcs8yylj24vxir2rg9rrb0rv-decrypt-age-secrets.drv: build01: build01: input not substitutable: error: path '/nix/store/xqmbsf4zbphr1657ibx6smxqy01k1p69-mount-secret-fs' is required, but there is no substituter that can build it, asking the scheduler again
ahwky2imndrhg86zbs119ldh71fs54x8-X-Restart-Triggers-nix-daemon.drv: build01: build01: input not substitutable: error: path '/nix/store/9d7gg64nc7x6cp7p8baznwr3agibzmfr-nix.conf' is required, but there is no substituter that can build it, asking the scheduler again
a2d0xj6xzgjl7wp4h4vx72sh9fmqdqy0-command-not-found.drv: build01: the build this call attached to did not finish, retry, asking the scheduler again
2vkvkfqamcs8yylj24vxir2rg9rrb0rv-decrypt-age-secrets.drv: build01: build01: input not substitutable: error: path '/nix/store/xqmbsf4zbphr1657ibx6smxqy01k1p69-mount-secret-fs' is required, but there is no substituter that can build it, asking the scheduler again
2vkvkfqamcs8yylj24vxir2rg9rrb0rv-decrypt-age-secrets.drv: build01: build01: input not substitutable: error: path '/nix/store/xqmbsf4zbphr1657ibx6smxqy01k1p69-mount-secret-fs' is required, but there is no substituter that can build it, asking the scheduler again
error: dependency 'mlv9c8n81ppdivp68mqyr5kn3dw80l36-nixos-test-driver-matrix-synapse.drv' failed
failed checks.aarch64-linux.monitoring 6m 8s
setup: ahwky2imndrhg86zbs119ldh71fs54x8-X-Restart-Triggers-nix-daemon.drv: build01: build01: input not substitutable: error: path '/nix/store/9d7gg64nc7x6cp7p8b …
setup:
ahwky2imndrhg86zbs119ldh71fs54x8-X-Restart-Triggers-nix-daemon.drv: build01: build01: input not substitutable: error: path '/nix/store/9d7gg64nc7x6cp7p8baznwr3agibzmfr-nix.conf' is required, but there is no substituter that can build it, asking the scheduler again
a2d0xj6xzgjl7wp4h4vx72sh9fmqdqy0-command-not-found.drv: build01: build01: input not substitutable: error: path '/nix/store/5fdmcpd1nqkzidxc440jdix6z98n16gc-perl-5.42.3-env' is required, but there is no substituter that can build it, asking the scheduler again
xx690g9wcknk2ar3i95yc3ai7f9ljg45-decrypt-age-secrets.drv: build01: build01: input not substitutable: error: path '/nix/store/xqmbsf4zbphr1657ibx6smxqy01k1p69-mount-secret-fs' is required, but there is no substituter that can build it, asking the scheduler again
jad0j4v04vr7bnfavyl2lxzfr7yx9412-decrypt-age-secrets.drv: build01: build01: input not substitutable: error: path '/nix/store/xqmbsf4zbphr1657ibx6smxqy01k1p69-mount-secret-fs' is required, but there is no substituter that can build it, asking the scheduler again
ahwky2imndrhg86zbs119ldh71fs54x8-X-Restart-Triggers-nix-daemon.drv: build01: build01: input not substitutable: error: path '/nix/store/9d7gg64nc7x6cp7p8baznwr3agibzmfr-nix.conf' is required, but there is no substituter that can build it, asking the scheduler again
a2d0xj6xzgjl7wp4h4vx72sh9fmqdqy0-command-not-found.drv: build01: build01: input not substitutable: error: path '/nix/store/5fdmcpd1nqkzidxc440jdix6z98n16gc-perl-5.42.3-env' is required, but there is no substituter that can build it, asking the scheduler again
xx690g9wcknk2ar3i95yc3ai7f9ljg45-decrypt-age-secrets.drv: build01: build01: input not substitutable: error: path '/nix/store/xqmbsf4zbphr1657ibx6smxqy01k1p69-mount-secret-fs' is required, but there is no substituter that can build it, asking the scheduler again
error: dependency 'lf4h4xqf23z6jjlvaxjb2aadfy4dd00k-nixos-test-driver-monitoring.drv' failed
failed checks.aarch64-linux.mycelium 5m 31s
setup: 6iaj3ylgwdlj60q3msjqgydjbfbr84ks-decrypt-age-secrets.drv: build01: build01: input not substitutable: error: path '/nix/store/xqmbsf4zbphr1657ibx6smxqy01k …
setup:
6iaj3ylgwdlj60q3msjqgydjbfbr84ks-decrypt-age-secrets.drv: build01: build01: input not substitutable: error: path '/nix/store/xqmbsf4zbphr1657ibx6smxqy01k1p69-mount-secret-fs' is required, but there is no substituter that can build it, asking the scheduler again
a2d0xj6xzgjl7wp4h4vx72sh9fmqdqy0-command-not-found.drv: build01: build01: input not substitutable: error: path '/nix/store/5fdmcpd1nqkzidxc440jdix6z98n16gc-perl-5.42.3-env' is required, but there is no substituter that can build it, asking the scheduler again
narfm0vn9aibv663lar5hkdnjay1im3m-unit-nix-daemon.service.drv: build01: build01: input not substitutable: error: path '/nix/store/zc12x1yxf4yskzilqgq9ww7bfyfq1cvj-X-Restart-Triggers-nix-daemon' is required, but there is no substituter that can build it, asking the scheduler again
6iaj3ylgwdlj60q3msjqgydjbfbr84ks-decrypt-age-secrets.drv: build01: build01: input not substitutable: error: path '/nix/store/xqmbsf4zbphr1657ibx6smxqy01k1p69-mount-secret-fs' is required, but there is no substituter that can build it, asking the scheduler again
a2d0xj6xzgjl7wp4h4vx72sh9fmqdqy0-command-not-found.drv: build01: build01: input not substitutable: error: path '/nix/store/5fdmcpd1nqkzidxc440jdix6z98n16gc-perl-5.42.3-env' is required, but there is no substituter that can build it, asking the scheduler again
narfm0vn9aibv663lar5hkdnjay1im3m-unit-nix-daemon.service.drv: build01: build01: input not substitutable: error: path '/nix/store/zc12x1yxf4yskzilqgq9ww7bfyfq1cvj-X-Restart-Triggers-nix-daemon' is required, but there is no substituter that can build it, asking the scheduler again
6iaj3ylgwdlj60q3msjqgydjbfbr84ks-decrypt-age-secrets.drv: build01: build01: input not substitutable: error: path '/nix/store/xqmbsf4zbphr1657ibx6smxqy01k1p69-mount-secret-fs' is required, but there is no substituter that can build it, asking the scheduler again
error: dependency '3mwcz8w8g7jn1kh212lcszp45vyq1k7h-nixos-test-driver-mycelium.drv' failed
failed checks.aarch64-linux.ncps 1m 22s
setup: ahwky2imndrhg86zbs119ldh71fs54x8-X-Restart-Triggers-nix-daemon.drv: build01: the build this call attached to did not finish, retry, asking the scheduler …
setup:
ahwky2imndrhg86zbs119ldh71fs54x8-X-Restart-Triggers-nix-daemon.drv: build01: the build this call attached to did not finish, retry, asking the scheduler again
jr2cy2nq73m6a16cp6i2qpm2lwxwb2y9-decrypt-age-secrets.drv: build01: build01: input not substitutable: error: path '/nix/store/xqmbsf4zbphr1657ibx6smxqy01k1p69-mount-secret-fs' is required, but there is no substituter that can build it, asking the scheduler again
a2d0xj6xzgjl7wp4h4vx72sh9fmqdqy0-command-not-found.drv: build01: build01: input not substitutable: error: path '/nix/store/5fdmcpd1nqkzidxc440jdix6z98n16gc-perl-5.42.3-env' is required, but there is no substituter that can build it, asking the scheduler again
jr2cy2nq73m6a16cp6i2qpm2lwxwb2y9-decrypt-age-secrets.drv: build01: build01: input not substitutable: error: path '/nix/store/xqmbsf4zbphr1657ibx6smxqy01k1p69-mount-secret-fs' is required, but there is no substituter that can build it, asking the scheduler again
g66fdvinfjr78qvdxgz9b314sw4gszc3-decrypt-age-secrets.drv: build01: build01: input not substitutable: error: path '/nix/store/xqmbsf4zbphr1657ibx6smxqy01k1p69-mount-secret-fs' is required, but there is no substituter that can build it, asking the scheduler again
ahwky2imndrhg86zbs119ldh71fs54x8-X-Restart-Triggers-nix-daemon.drv: build01: build01: input not substitutable: error: path '/nix/store/9d7gg64nc7x6cp7p8baznwr3agibzmfr-nix.conf' is required, but there is no substituter that can build it, asking the scheduler again
jr2cy2nq73m6a16cp6i2qpm2lwxwb2y9-decrypt-age-secrets.drv: build01: build01: input not substitutable: error: path '/nix/store/xqmbsf4zbphr1657ibx6smxqy01k1p69-mount-secret-fs' is required, but there is no substituter that can build it, asking the scheduler again
error: dependency '59rpmlcdiy9vmhi0d261h9cyxvs6gn88-nixos-test-driver-ncps.drv' failed
failed checks.aarch64-linux.nixos-systemd-abstraction 7m 10s
setup: a2d0xj6xzgjl7wp4h4vx72sh9fmqdqy0-command-not-found.drv: build01: the build this call attached to did not finish, retry, asking the scheduler again a2d0xj …
setup:
a2d0xj6xzgjl7wp4h4vx72sh9fmqdqy0-command-not-found.drv: build01: the build this call attached to did not finish, retry, asking the scheduler again
a2d0xj6xzgjl7wp4h4vx72sh9fmqdqy0-command-not-found.drv: build01: the build this call attached to did not finish, retry, asking the scheduler again
a2d0xj6xzgjl7wp4h4vx72sh9fmqdqy0-command-not-found.drv: build01: build01: input not substitutable: error: path '/nix/store/5fdmcpd1nqkzidxc440jdix6z98n16gc-perl-5.42.3-env' is required, but there is no substituter that can build it, asking the scheduler again
a2d0xj6xzgjl7wp4h4vx72sh9fmqdqy0-command-not-found.drv: build01: the build this call attached to did not finish, retry, asking the scheduler again
a2d0xj6xzgjl7wp4h4vx72sh9fmqdqy0-command-not-found.drv: build01: build01: input not substitutable: error: path '/nix/store/5fdmcpd1nqkzidxc440jdix6z98n16gc-perl-5.42.3-env' is required, but there is no substituter that can build it, asking the scheduler again
a2d0xj6xzgjl7wp4h4vx72sh9fmqdqy0-command-not-found.drv: build01: the build this call attached to did not finish, retry, asking the scheduler again
a2d0xj6xzgjl7wp4h4vx72sh9fmqdqy0-command-not-found.drv: build01: build01: input not substitutable: error: path '/nix/store/5fdmcpd1nqkzidxc440jdix6z98n16gc-perl-5.42.3-env' is required, but there is no substituter that can build it, asking the scheduler again
error: dependency 'g3z13d78rzqn7wqhrn0az286b23jx91p-nixos-test-driver-systemd-abstraction.drv' failed
failed checks.aarch64-linux.nixos-test-age-backend 1m 14s
setup: a2d0xj6xzgjl7wp4h4vx72sh9fmqdqy0-command-not-found.drv: build01: the build this call attached to did not finish, retry, asking the scheduler again 0k7dvr …
setup:
a2d0xj6xzgjl7wp4h4vx72sh9fmqdqy0-command-not-found.drv: build01: the build this call attached to did not finish, retry, asking the scheduler again
0k7dvr3z30s0k16byb6ipnl5059mhps7-decrypt-age-secrets.drv: build01: build01: input not substitutable: error: path '/nix/store/xqmbsf4zbphr1657ibx6smxqy01k1p69-mount-secret-fs' is required, but there is no substituter that can build it, asking the scheduler again
a2d0xj6xzgjl7wp4h4vx72sh9fmqdqy0-command-not-found.drv: build01: the build this call attached to did not finish, retry, asking the scheduler again
ahwky2imndrhg86zbs119ldh71fs54x8-X-Restart-Triggers-nix-daemon.drv: build01: the build this call attached to did not finish, retry, asking the scheduler again
0k7dvr3z30s0k16byb6ipnl5059mhps7-decrypt-age-secrets.drv: build01: build01: input not substitutable: error: path '/nix/store/xqmbsf4zbphr1657ibx6smxqy01k1p69-mount-secret-fs' is required, but there is no substituter that can build it, asking the scheduler again
0k7dvr3z30s0k16byb6ipnl5059mhps7-decrypt-age-secrets.drv: build01: build01: input not substitutable: error: path '/nix/store/xqmbsf4zbphr1657ibx6smxqy01k1p69-mount-secret-fs' is required, but there is no substituter that can build it, asking the scheduler again
0k7dvr3z30s0k16byb6ipnl5059mhps7-decrypt-age-secrets.drv: build01: build01: input not substitutable: error: path '/nix/store/xqmbsf4zbphr1657ibx6smxqy01k1p69-mount-secret-fs' is required, but there is no substituter that can build it, asking the scheduler again
error: dependency 'pkv3c59yilk0l4wmqdrwpw3qcmkiqklh-nixos-test-driver-nixos-test-age-backend.drv' failed
failed checks.aarch64-linux.nixos-test-container 41s
setup: a2d0xj6xzgjl7wp4h4vx72sh9fmqdqy0-command-not-found.drv: build01: the build this call attached to did not finish, retry, asking the scheduler again a2d0xj …
setup:
a2d0xj6xzgjl7wp4h4vx72sh9fmqdqy0-command-not-found.drv: build01: the build this call attached to did not finish, retry, asking the scheduler again
a2d0xj6xzgjl7wp4h4vx72sh9fmqdqy0-command-not-found.drv: build01: the build this call attached to did not finish, retry, asking the scheduler again
a2d0xj6xzgjl7wp4h4vx72sh9fmqdqy0-command-not-found.drv: build01: the build this call attached to did not finish, retry, asking the scheduler again
a2d0xj6xzgjl7wp4h4vx72sh9fmqdqy0-command-not-found.drv: build01: the build this call attached to did not finish, retry, asking the scheduler again
a2d0xj6xzgjl7wp4h4vx72sh9fmqdqy0-command-not-found.drv: build01: the build this call attached to did not finish, retry, asking the scheduler again
a2d0xj6xzgjl7wp4h4vx72sh9fmqdqy0-command-not-found.drv: build01: the build this call attached to did not finish, retry, asking the scheduler again
a2d0xj6xzgjl7wp4h4vx72sh9fmqdqy0-command-not-found.drv: build01: the build this call attached to did not finish, retry, asking the scheduler again
error: dependency 'r63y9jcz2nvmvga53l6skyg832qmd13q-nixos-test-driver-container.drv' failed
failed checks.aarch64-linux.nixos-test-extra-python-packages 1m 39s
setup: a2d0xj6xzgjl7wp4h4vx72sh9fmqdqy0-command-not-found.drv: build01: the build this call attached to did not finish, retry, asking the scheduler again a2d0xj …
setup:
a2d0xj6xzgjl7wp4h4vx72sh9fmqdqy0-command-not-found.drv: build01: the build this call attached to did not finish, retry, asking the scheduler again
a2d0xj6xzgjl7wp4h4vx72sh9fmqdqy0-command-not-found.drv: build01: build01: input not substitutable: error: path '/nix/store/5fdmcpd1nqkzidxc440jdix6z98n16gc-perl-5.42.3-env' is required, but there is no substituter that can build it, asking the scheduler again
a2d0xj6xzgjl7wp4h4vx72sh9fmqdqy0-command-not-found.drv: build01: the build this call attached to did not finish, retry, asking the scheduler again
a2d0xj6xzgjl7wp4h4vx72sh9fmqdqy0-command-not-found.drv: build01: the build this call attached to did not finish, retry, asking the scheduler again
a2d0xj6xzgjl7wp4h4vx72sh9fmqdqy0-command-not-found.drv: build01: the build this call attached to did not finish, retry, asking the scheduler again
a2d0xj6xzgjl7wp4h4vx72sh9fmqdqy0-command-not-found.drv: build01: the build this call attached to did not finish, retry, asking the scheduler again
a2d0xj6xzgjl7wp4h4vx72sh9fmqdqy0-command-not-found.drv: build01: the build this call attached to did not finish, retry, asking the scheduler again
error: dependency 'dqrgmcfdgf17i3yawqdw8v3cpbw2z6m7-nixos-test-driver-test-extra-python-packages.drv' failed
failed eval checks.aarch64-linux.nixos-test-password-store-mounts —
error: … while evaluating the attribute 'drvPath' at «https://releases.nixos.org/nixos/26.05/nixos-26.05.11680.6fcc160353f6/nixexprs.tar.xz?narH …
error:
       … while evaluating the attribute 'drvPath'
         at «https://releases.nixos.org/nixos/26.05/nixos-26.05.11680.6fcc160353f6/nixexprs.tar.xz?narHash=sha256-tM6MAMxVwetta6uD2aMzoWQ9v5EAaLLmYumiE4jVZeg%3D»/lib/customisation.nix:427:7:
          426|     // {
          427|       drvPath =
             |       ^
          428|         assert condition;

       … while calling the 'derivationStrict' builtin
         at «nix-internal»/derivation-internal.nix:37:12:
           36|
           37|   strict = derivationStrict drvAttrs;
             |            ^
           38|

       … while evaluating the option `driverConfiguration.vlans':

       … while evaluating definitions from `/nix/store/k1vyrhach56zhxf4835z5whii9mdr485-source/nixos/lib/testing/driver-configuration.nix':

       … while evaluating the option `nodes.machine.networking.interfaces':

       … while evaluating definitions from `/nix/store/k1vyrhach56zhxf4835z5whii9mdr485-source/nixos/modules/hardware/facter/networking':

       … while evaluating the option `nodes.machine.hardware.facter.enable':

       … while evaluating the option `nodes.machine.hardware.facter.report':

       … while evaluating the option `nodes.machine.hardware.facter.reportPath':

       … while evaluating definitions from `/nix/store/49x637kiwh63f7fc071q93np9vil8j1k-source/nixosModules/clanCore/nixos-facter.nix':

       (stack trace truncated; use '--show-trace' to show the full, detailed trace)

       error: gRPC FetchNars failed: error: path '/nix/store/zkzazxi1yx3z6i12sxg59p6kxxiymkjg-merged-test-dir-nixos-test-password-store-mounts' is required, but there is no substituter that can build it
failed checks.aarch64-linux.nixos-test-secrets 4m 28s
setup: ahwky2imndrhg86zbs119ldh71fs54x8-X-Restart-Triggers-nix-daemon.drv: build01: build01: input not substitutable: error: path '/nix/store/9d7gg64nc7x6cp7p8b …
setup:
ahwky2imndrhg86zbs119ldh71fs54x8-X-Restart-Triggers-nix-daemon.drv: build01: build01: input not substitutable: error: path '/nix/store/9d7gg64nc7x6cp7p8baznwr3agibzmfr-nix.conf' is required, but there is no substituter that can build it, asking the scheduler again
a2d0xj6xzgjl7wp4h4vx72sh9fmqdqy0-command-not-found.drv: build01: build01: input not substitutable: error: path '/nix/store/5fdmcpd1nqkzidxc440jdix6z98n16gc-perl-5.42.3-env' is required, but there is no substituter that can build it, asking the scheduler again
ahwky2imndrhg86zbs119ldh71fs54x8-X-Restart-Triggers-nix-daemon.drv: build01: build01: input not substitutable: error: path '/nix/store/9d7gg64nc7x6cp7p8baznwr3agibzmfr-nix.conf' is required, but there is no substituter that can build it, asking the scheduler again
a2d0xj6xzgjl7wp4h4vx72sh9fmqdqy0-command-not-found.drv: build01: build01: input not substitutable: error: path '/nix/store/5fdmcpd1nqkzidxc440jdix6z98n16gc-perl-5.42.3-env' is required, but there is no substituter that can build it, asking the scheduler again
ahwky2imndrhg86zbs119ldh71fs54x8-X-Restart-Triggers-nix-daemon.drv: build01: build01: input not substitutable: error: path '/nix/store/9d7gg64nc7x6cp7p8baznwr3agibzmfr-nix.conf' is required, but there is no substituter that can build it, asking the scheduler again
a2d0xj6xzgjl7wp4h4vx72sh9fmqdqy0-command-not-found.drv: build01: build01: input not substitutable: error: path '/nix/store/5fdmcpd1nqkzidxc440jdix6z98n16gc-perl-5.42.3-env' is required, but there is no substituter that can build it, asking the scheduler again
ahwky2imndrhg86zbs119ldh71fs54x8-X-Restart-Triggers-nix-daemon.drv: build01: build01: input not substitutable: error: path '/nix/store/9d7gg64nc7x6cp7p8baznwr3agibzmfr-nix.conf' is required, but there is no substituter that can build it, asking the scheduler again
error: dependency 'nf04szn615c0s8yhhmh2smhcmxh1iqnd-nixos-test-driver-secrets.drv' failed
failed checks.aarch64-linux.nixos-test-user-firewall-iptables 1m 18s
setup: a2d0xj6xzgjl7wp4h4vx72sh9fmqdqy0-command-not-found.drv: build01: the build this call attached to did not finish, retry, asking the scheduler again a2d0xj …
setup:
a2d0xj6xzgjl7wp4h4vx72sh9fmqdqy0-command-not-found.drv: build01: the build this call attached to did not finish, retry, asking the scheduler again
a2d0xj6xzgjl7wp4h4vx72sh9fmqdqy0-command-not-found.drv: build01: the build this call attached to did not finish, retry, asking the scheduler again
a2d0xj6xzgjl7wp4h4vx72sh9fmqdqy0-command-not-found.drv: build01: build01: input not substitutable: error: path '/nix/store/5fdmcpd1nqkzidxc440jdix6z98n16gc-perl-5.42.3-env' is required, but there is no substituter that can build it, asking the scheduler again
a2d0xj6xzgjl7wp4h4vx72sh9fmqdqy0-command-not-found.drv: build01: the build this call attached to did not finish, retry, asking the scheduler again
a2d0xj6xzgjl7wp4h4vx72sh9fmqdqy0-command-not-found.drv: build01: build01: input not substitutable: error: path '/nix/store/5fdmcpd1nqkzidxc440jdix6z98n16gc-perl-5.42.3-env' is required, but there is no substituter that can build it, asking the scheduler again
a2d0xj6xzgjl7wp4h4vx72sh9fmqdqy0-command-not-found.drv: build01: build01: input not substitutable: error: path '/nix/store/5fdmcpd1nqkzidxc440jdix6z98n16gc-perl-5.42.3-env' is required, but there is no substituter that can build it, asking the scheduler again
a2d0xj6xzgjl7wp4h4vx72sh9fmqdqy0-command-not-found.drv: build01: build01: input not substitutable: error: path '/nix/store/5fdmcpd1nqkzidxc440jdix6z98n16gc-perl-5.42.3-env' is required, but there is no substituter that can build it, asking the scheduler again
error: dependency '554b8c96fw48p2n6wh1lyamrwc12n12k-nixos-test-driver-user-firewall-iptables.drv' failed
failed checks.aarch64-linux.nixos-test-user-firewall-nftables 4m 13s
setup: a2d0xj6xzgjl7wp4h4vx72sh9fmqdqy0-command-not-found.drv: build01: build01: input not substitutable: error: path '/nix/store/5fdmcpd1nqkzidxc440jdix6z98n16 …
setup:
a2d0xj6xzgjl7wp4h4vx72sh9fmqdqy0-command-not-found.drv: build01: build01: input not substitutable: error: path '/nix/store/5fdmcpd1nqkzidxc440jdix6z98n16gc-perl-5.42.3-env' is required, but there is no substituter that can build it, asking the scheduler again
a2d0xj6xzgjl7wp4h4vx72sh9fmqdqy0-command-not-found.drv: build01: the build this call attached to did not finish, retry, asking the scheduler again
a2d0xj6xzgjl7wp4h4vx72sh9fmqdqy0-command-not-found.drv: build01: the build this call attached to did not finish, retry, asking the scheduler again
a2d0xj6xzgjl7wp4h4vx72sh9fmqdqy0-command-not-found.drv: build01: build01: input not substitutable: error: path '/nix/store/5fdmcpd1nqkzidxc440jdix6z98n16gc-perl-5.42.3-env' is required, but there is no substituter that can build it, asking the scheduler again
a2d0xj6xzgjl7wp4h4vx72sh9fmqdqy0-command-not-found.drv: build01: build01: input not substitutable: error: path '/nix/store/5fdmcpd1nqkzidxc440jdix6z98n16gc-perl-5.42.3-env' is required, but there is no substituter that can build it, asking the scheduler again
a2d0xj6xzgjl7wp4h4vx72sh9fmqdqy0-command-not-found.drv: build01: build01: input not substitutable: error: path '/nix/store/5fdmcpd1nqkzidxc440jdix6z98n16gc-perl-5.42.3-env' is required, but there is no substituter that can build it, asking the scheduler again
a2d0xj6xzgjl7wp4h4vx72sh9fmqdqy0-command-not-found.drv: build01: build01: input not substitutable: error: path '/nix/store/5fdmcpd1nqkzidxc440jdix6z98n16gc-perl-5.42.3-env' is required, but there is no substituter that can build it, asking the scheduler again
error: dependency '5raxpshvxmyfnrgwi435277xf53vq83a-nixos-test-driver-user-firewall-nftables.drv' failed
failed checks.aarch64-linux.nixos-test-wayland-proxy-virtwl 1m 53s
setup: ahwky2imndrhg86zbs119ldh71fs54x8-X-Restart-Triggers-nix-daemon.drv: build01: build01: input not substitutable: error: path '/nix/store/9d7gg64nc7x6cp7p8b …
setup:
ahwky2imndrhg86zbs119ldh71fs54x8-X-Restart-Triggers-nix-daemon.drv: build01: build01: input not substitutable: error: path '/nix/store/9d7gg64nc7x6cp7p8baznwr3agibzmfr-nix.conf' is required, but there is no substituter that can build it, asking the scheduler again
a2d0xj6xzgjl7wp4h4vx72sh9fmqdqy0-command-not-found.drv: build01: build01: input not substitutable: error: path '/nix/store/5fdmcpd1nqkzidxc440jdix6z98n16gc-perl-5.42.3-env' is required, but there is no substituter that can build it, asking the scheduler again
ahwky2imndrhg86zbs119ldh71fs54x8-X-Restart-Triggers-nix-daemon.drv: build01: build01: input not substitutable: error: path '/nix/store/9d7gg64nc7x6cp7p8baznwr3agibzmfr-nix.conf' is required, but there is no substituter that can build it, asking the scheduler again
a2d0xj6xzgjl7wp4h4vx72sh9fmqdqy0-command-not-found.drv: build01: build01: input not substitutable: error: path '/nix/store/5fdmcpd1nqkzidxc440jdix6z98n16gc-perl-5.42.3-env' is required, but there is no substituter that can build it, asking the scheduler again
ahwky2imndrhg86zbs119ldh71fs54x8-X-Restart-Triggers-nix-daemon.drv: build01: build01: input not substitutable: error: path '/nix/store/9d7gg64nc7x6cp7p8baznwr3agibzmfr-nix.conf' is required, but there is no substituter that can build it, asking the scheduler again
a2d0xj6xzgjl7wp4h4vx72sh9fmqdqy0-command-not-found.drv: build01: build01: input not substitutable: error: path '/nix/store/5fdmcpd1nqkzidxc440jdix6z98n16gc-perl-5.42.3-env' is required, but there is no substituter that can build it, asking the scheduler again
ahwky2imndrhg86zbs119ldh71fs54x8-X-Restart-Triggers-nix-daemon.drv: build01: build01: input not substitutable: error: path '/nix/store/9d7gg64nc7x6cp7p8baznwr3agibzmfr-nix.conf' is required, but there is no substituter that can build it, asking the scheduler again
error: dependency 'h4djrzpq2p5p9bvz2kfcdwbhd05d2nqz-nixos-test-driver-wayland-proxy-virtwl.drv' failed
failed eval checks.aarch64-linux.p2p-ssh-iroh —
error: … while evaluating the attribute 'drvPath' at «https://releases.nixos.org/nixos/26.05/nixos-26.05.11680.6fcc160353f6/nixexprs.tar.xz?narH …
error:
       … while evaluating the attribute 'drvPath'
         at «https://releases.nixos.org/nixos/26.05/nixos-26.05.11680.6fcc160353f6/nixexprs.tar.xz?narHash=sha256-tM6MAMxVwetta6uD2aMzoWQ9v5EAaLLmYumiE4jVZeg%3D»/lib/customisation.nix:427:7:
          426|     // {
          427|       drvPath =
             |       ^
          428|         assert condition;

       … while calling the 'derivationStrict' builtin
         at «nix-internal»/derivation-internal.nix:37:12:
           36|
           37|   strict = derivationStrict drvAttrs;
             |            ^
           38|

       … while evaluating the option `nodes.client.networking.interfaces':

       … while evaluating definitions from `/nix/store/k1vyrhach56zhxf4835z5whii9mdr485-source/nixos/modules/hardware/facter/networking':

       … while evaluating the option `nodes.client.hardware.facter.enable':

       … while evaluating the option `nodes.client.hardware.facter.report':

       … while evaluating the option `nodes.client.hardware.facter.reportPath':

       … while evaluating definitions from `/nix/store/49x637kiwh63f7fc071q93np9vil8j1k-source/nixosModules/clanCore/nixos-facter.nix':

       (stack trace truncated; use '--show-trace' to show the full, detailed trace)

       error: gRPC FetchNars failed: error: path '/nix/store/pl2jypwax5dgng2lldc7f6c4nqcv6x1x-merged-test-dir-clan-test-p2p-ssh-iroh' is required, but there is no substituter that can build it
failed checks.aarch64-linux.packages 3m 41s
setup: a2d0xj6xzgjl7wp4h4vx72sh9fmqdqy0-command-not-found.drv: build01: build01: input not substitutable: error: path '/nix/store/5fdmcpd1nqkzidxc440jdix6z98n16 …
setup:
a2d0xj6xzgjl7wp4h4vx72sh9fmqdqy0-command-not-found.drv: build01: build01: input not substitutable: error: path '/nix/store/5fdmcpd1nqkzidxc440jdix6z98n16gc-perl-5.42.3-env' is required, but there is no substituter that can build it, asking the scheduler again
5h3kimag6l6pljvnx39jphmb08pva54g-unit-nix-daemon.service.drv: build01: build01: input not substitutable: error: path '/nix/store/zc12x1yxf4yskzilqgq9ww7bfyfq1cvj-X-Restart-Triggers-nix-daemon' is required, but there is no substituter that can build it, asking the scheduler again
g66fdvinfjr78qvdxgz9b314sw4gszc3-decrypt-age-secrets.drv: build01: build01: input not substitutable: error: path '/nix/store/xqmbsf4zbphr1657ibx6smxqy01k1p69-mount-secret-fs' is required, but there is no substituter that can build it, asking the scheduler again
a2d0xj6xzgjl7wp4h4vx72sh9fmqdqy0-command-not-found.drv: build01: build01: input not substitutable: error: path '/nix/store/5fdmcpd1nqkzidxc440jdix6z98n16gc-perl-5.42.3-env' is required, but there is no substituter that can build it, asking the scheduler again
5h3kimag6l6pljvnx39jphmb08pva54g-unit-nix-daemon.service.drv: build01: build01: input not substitutable: error: path '/nix/store/zc12x1yxf4yskzilqgq9ww7bfyfq1cvj-X-Restart-Triggers-nix-daemon' is required, but there is no substituter that can build it, asking the scheduler again
g66fdvinfjr78qvdxgz9b314sw4gszc3-decrypt-age-secrets.drv: build01: build01: input not substitutable: error: path '/nix/store/xqmbsf4zbphr1657ibx6smxqy01k1p69-mount-secret-fs' is required, but there is no substituter that can build it, asking the scheduler again
a2d0xj6xzgjl7wp4h4vx72sh9fmqdqy0-command-not-found.drv: build01: build01: input not substitutable: error: path '/nix/store/5fdmcpd1nqkzidxc440jdix6z98n16gc-perl-5.42.3-env' is required, but there is no substituter that can build it, asking the scheduler again
error: dependency 'snd04jh96shs587wd8i7immss977i2nc-nixos-test-driver-packages.drv' failed
failed checks.aarch64-linux.pki 7m 24s
setup: 1byrs27pmvkjd4pn3p3d7s6khnb34xvi-decrypt-age-secrets.drv: build01: build01: input not substitutable: error: path '/nix/store/xqmbsf4zbphr1657ibx6smxqy01k …
setup:
1byrs27pmvkjd4pn3p3d7s6khnb34xvi-decrypt-age-secrets.drv: build01: build01: input not substitutable: error: path '/nix/store/xqmbsf4zbphr1657ibx6smxqy01k1p69-mount-secret-fs' is required, but there is no substituter that can build it, asking the scheduler again
9b0jhqlq0psphv0xlhnhsxblgwy8hr4r-decrypt-age-secrets.drv: build01: build01: input not substitutable: error: path '/nix/store/xqmbsf4zbphr1657ibx6smxqy01k1p69-mount-secret-fs' is required, but there is no substituter that can build it, asking the scheduler again
g66fdvinfjr78qvdxgz9b314sw4gszc3-decrypt-age-secrets.drv: build01: build01: input not substitutable: error: path '/nix/store/xqmbsf4zbphr1657ibx6smxqy01k1p69-mount-secret-fs' is required, but there is no substituter that can build it, asking the scheduler again
kwb2wkwyqviz8v5y97nlaqcqdy961dsx-unit-nix-daemon.service.drv: build01: build01: input not substitutable: error: path '/nix/store/zc12x1yxf4yskzilqgq9ww7bfyfq1cvj-X-Restart-Triggers-nix-daemon' is required, but there is no substituter that can build it, asking the scheduler again
a2d0xj6xzgjl7wp4h4vx72sh9fmqdqy0-command-not-found.drv: build01: build01: input not substitutable: error: path '/nix/store/5fdmcpd1nqkzidxc440jdix6z98n16gc-perl-5.42.3-env' is required, but there is no substituter that can build it, asking the scheduler again
1byrs27pmvkjd4pn3p3d7s6khnb34xvi-decrypt-age-secrets.drv: build01: build01: input not substitutable: error: path '/nix/store/xqmbsf4zbphr1657ibx6smxqy01k1p69-mount-secret-fs' is required, but there is no substituter that can build it, asking the scheduler again
g66fdvinfjr78qvdxgz9b314sw4gszc3-decrypt-age-secrets.drv: build01: build01: input not substitutable: error: path '/nix/store/xqmbsf4zbphr1657ibx6smxqy01k1p69-mount-secret-fs' is required, but there is no substituter that can build it, asking the scheduler again
error: dependency '6yppwml5hqs76d4ay3l9fg6n2iz7ccdg-nixos-test-driver-pki.drv' failed
failed checks.aarch64-linux.postgresql 1m 23s
setup: ahwky2imndrhg86zbs119ldh71fs54x8-X-Restart-Triggers-nix-daemon.drv: build01: the build this call attached to did not finish, retry, asking the scheduler …
setup:
ahwky2imndrhg86zbs119ldh71fs54x8-X-Restart-Triggers-nix-daemon.drv: build01: the build this call attached to did not finish, retry, asking the scheduler again
a2d0xj6xzgjl7wp4h4vx72sh9fmqdqy0-command-not-found.drv: build01: the build this call attached to did not finish, retry, asking the scheduler again
g66fdvinfjr78qvdxgz9b314sw4gszc3-decrypt-age-secrets.drv: build01: the build this call attached to did not finish, retry, asking the scheduler again
ahwky2imndrhg86zbs119ldh71fs54x8-X-Restart-Triggers-nix-daemon.drv: build01: the build this call attached to did not finish, retry, asking the scheduler again
a2d0xj6xzgjl7wp4h4vx72sh9fmqdqy0-command-not-found.drv: build01: the build this call attached to did not finish, retry, asking the scheduler again
g66fdvinfjr78qvdxgz9b314sw4gszc3-decrypt-age-secrets.drv: build01: build01: input not substitutable: error: path '/nix/store/xqmbsf4zbphr1657ibx6smxqy01k1p69-mount-secret-fs' is required, but there is no substituter that can build it, asking the scheduler again
g66fdvinfjr78qvdxgz9b314sw4gszc3-decrypt-age-secrets.drv: build01: the build this call attached to did not finish, retry, asking the scheduler again
error: dependency '0x67g58l8cfbhspvf0pp03svv7f5wd7j-nixos-test-driver-service-postgresql.drv' failed
failed checks.aarch64-linux.service-dummy-test 1m 21s
setup: ahwky2imndrhg86zbs119ldh71fs54x8-X-Restart-Triggers-nix-daemon.drv: build01: the build this call attached to did not finish, retry, asking the scheduler …
setup:
ahwky2imndrhg86zbs119ldh71fs54x8-X-Restart-Triggers-nix-daemon.drv: build01: the build this call attached to did not finish, retry, asking the scheduler again
g66fdvinfjr78qvdxgz9b314sw4gszc3-decrypt-age-secrets.drv: build01: build01: input not substitutable: error: path '/nix/store/xqmbsf4zbphr1657ibx6smxqy01k1p69-mount-secret-fs' is required, but there is no substituter that can build it, asking the scheduler again
a2d0xj6xzgjl7wp4h4vx72sh9fmqdqy0-command-not-found.drv: build01: the build this call attached to did not finish, retry, asking the scheduler again
7d17di14jdlzlp6faay5gkpkw6bdr6zc-decrypt-age-secrets.drv: build01: build01: input not substitutable: error: path '/nix/store/xqmbsf4zbphr1657ibx6smxqy01k1p69-mount-secret-fs' is required, but there is no substituter that can build it, asking the scheduler again
g66fdvinfjr78qvdxgz9b314sw4gszc3-decrypt-age-secrets.drv: build01: the build this call attached to did not finish, retry, asking the scheduler again
ahwky2imndrhg86zbs119ldh71fs54x8-X-Restart-Triggers-nix-daemon.drv: build01: build01: input not substitutable: error: path '/nix/store/9d7gg64nc7x6cp7p8baznwr3agibzmfr-nix.conf' is required, but there is no substituter that can build it, asking the scheduler again
7d17di14jdlzlp6faay5gkpkw6bdr6zc-decrypt-age-secrets.drv: build01: build01: input not substitutable: error: path '/nix/store/xqmbsf4zbphr1657ibx6smxqy01k1p69-mount-secret-fs' is required, but there is no substituter that can build it, asking the scheduler again
error: dependency 'zqzkv6j09zwrgkk0dswcw93q1l7h4syi-nixos-test-driver-service-dummy-test.drv' failed
failed checks.aarch64-linux.service-dummy-test-from-flake 12m 7s
setup: a2d0xj6xzgjl7wp4h4vx72sh9fmqdqy0-command-not-found.drv: build01: the build this call attached to did not finish, retry, asking the scheduler again g66fdv …
setup:
a2d0xj6xzgjl7wp4h4vx72sh9fmqdqy0-command-not-found.drv: build01: the build this call attached to did not finish, retry, asking the scheduler again
g66fdvinfjr78qvdxgz9b314sw4gszc3-decrypt-age-secrets.drv: build01: the build this call attached to did not finish, retry, asking the scheduler again
xdd8d4gm9lijj2ircjg51zs3izr9zw0z-decrypt-age-secrets.drv: build01: build01: input not substitutable: error: path '/nix/store/xqmbsf4zbphr1657ibx6smxqy01k1p69-mount-secret-fs' is required, but there is no substituter that can build it, asking the scheduler again
g66fdvinfjr78qvdxgz9b314sw4gszc3-decrypt-age-secrets.drv: build01: the build this call attached to did not finish, retry, asking the scheduler again
xdd8d4gm9lijj2ircjg51zs3izr9zw0z-decrypt-age-secrets.drv: build01: build01: input not substitutable: error: path '/nix/store/xqmbsf4zbphr1657ibx6smxqy01k1p69-mount-secret-fs' is required, but there is no substituter that can build it, asking the scheduler again
5rchd8r4qxc02fdvh6a25mazjkzx0dp5-offline-flake-for-test-service-dummy-test-from-flake.drv: build01: not scheduled here: 5rchd8r4qxc02fdvh6a25mazjkzx0dp5-offline-flake-for-test-service-dummy-test-from-flake.drv, asking the scheduler again
vq0m3pyh59nqzi4s9whxp86ylcf8flnh-clan-runtime.drv: build01: not scheduled here: vq0m3pyh59nqzi4s9whxp86ylcf8flnh-clan-runtime.drv, asking the scheduler again
error: dependency '7gspjak3my4p2h5mfmf2zixy84250prk-nixos-test-driver-service-dummy-test-from-flake.drv' failed
failed checks.aarch64-linux.sshd 5m 38s
setup: ahwky2imndrhg86zbs119ldh71fs54x8-X-Restart-Triggers-nix-daemon.drv: build01: build01: input not substitutable: error: path '/nix/store/9d7gg64nc7x6cp7p8b …
setup:
ahwky2imndrhg86zbs119ldh71fs54x8-X-Restart-Triggers-nix-daemon.drv: build01: build01: input not substitutable: error: path '/nix/store/9d7gg64nc7x6cp7p8baznwr3agibzmfr-nix.conf' is required, but there is no substituter that can build it, asking the scheduler again
a2d0xj6xzgjl7wp4h4vx72sh9fmqdqy0-command-not-found.drv: build01: build01: input not substitutable: error: path '/nix/store/5fdmcpd1nqkzidxc440jdix6z98n16gc-perl-5.42.3-env' is required, but there is no substituter that can build it, asking the scheduler again
738hzqvsvj22d2bdh6lv0f8z42anl3mi-decrypt-age-secrets.drv: build01: build01: input not substitutable: error: path '/nix/store/xqmbsf4zbphr1657ibx6smxqy01k1p69-mount-secret-fs' is required, but there is no substituter that can build it, asking the scheduler again
g66fdvinfjr78qvdxgz9b314sw4gszc3-decrypt-age-secrets.drv: build01: build01: input not substitutable: error: path '/nix/store/xqmbsf4zbphr1657ibx6smxqy01k1p69-mount-secret-fs' is required, but there is no substituter that can build it, asking the scheduler again
ahwky2imndrhg86zbs119ldh71fs54x8-X-Restart-Triggers-nix-daemon.drv: build01: build01: input not substitutable: error: path '/nix/store/9d7gg64nc7x6cp7p8baznwr3agibzmfr-nix.conf' is required, but there is no substituter that can build it, asking the scheduler again
a2d0xj6xzgjl7wp4h4vx72sh9fmqdqy0-command-not-found.drv: build01: build01: input not substitutable: error: path '/nix/store/5fdmcpd1nqkzidxc440jdix6z98n16gc-perl-5.42.3-env' is required, but there is no substituter that can build it, asking the scheduler again
738hzqvsvj22d2bdh6lv0f8z42anl3mi-decrypt-age-secrets.drv: build01: build01: input not substitutable: error: path '/nix/store/xqmbsf4zbphr1657ibx6smxqy01k1p69-mount-secret-fs' is required, but there is no substituter that can build it, asking the scheduler again
error: dependency '25zrswchfa9j5yl8b63zc56dsr6aycfs-nixos-test-driver-sshd.drv' failed
failed checks.aarch64-linux.sshd-no-ca 3m 41s
setup: 3mlmhmj5nrs0idm56vx2rawc95lqmm54-decrypt-age-secrets.drv: build01: build01: input not substitutable: error: path '/nix/store/xqmbsf4zbphr1657ibx6smxqy01k …
setup:
3mlmhmj5nrs0idm56vx2rawc95lqmm54-decrypt-age-secrets.drv: build01: build01: input not substitutable: error: path '/nix/store/xqmbsf4zbphr1657ibx6smxqy01k1p69-mount-secret-fs' is required, but there is no substituter that can build it, asking the scheduler again
ahwky2imndrhg86zbs119ldh71fs54x8-X-Restart-Triggers-nix-daemon.drv: build01: build01: input not substitutable: error: path '/nix/store/9d7gg64nc7x6cp7p8baznwr3agibzmfr-nix.conf' is required, but there is no substituter that can build it, asking the scheduler again
g66fdvinfjr78qvdxgz9b314sw4gszc3-decrypt-age-secrets.drv: build01: build01: input not substitutable: error: path '/nix/store/xqmbsf4zbphr1657ibx6smxqy01k1p69-mount-secret-fs' is required, but there is no substituter that can build it, asking the scheduler again
a2d0xj6xzgjl7wp4h4vx72sh9fmqdqy0-command-not-found.drv: build01: build01: input not substitutable: error: path '/nix/store/5fdmcpd1nqkzidxc440jdix6z98n16gc-perl-5.42.3-env' is required, but there is no substituter that can build it, asking the scheduler again
3mlmhmj5nrs0idm56vx2rawc95lqmm54-decrypt-age-secrets.drv: build01: build01: input not substitutable: error: path '/nix/store/xqmbsf4zbphr1657ibx6smxqy01k1p69-mount-secret-fs' is required, but there is no substituter that can build it, asking the scheduler again
ahwky2imndrhg86zbs119ldh71fs54x8-X-Restart-Triggers-nix-daemon.drv: build01: build01: input not substitutable: error: path '/nix/store/9d7gg64nc7x6cp7p8baznwr3agibzmfr-nix.conf' is required, but there is no substituter that can build it, asking the scheduler again
3mlmhmj5nrs0idm56vx2rawc95lqmm54-decrypt-age-secrets.drv: build01: build01: input not substitutable: error: path '/nix/store/xqmbsf4zbphr1657ibx6smxqy01k1p69-mount-secret-fs' is required, but there is no substituter that can build it, asking the scheduler again
error: dependency '5lqvbycw5zykawb9wsnyd464vgkcav1n-nixos-test-driver-sshd.drv' failed
failed checks.aarch64-linux.state-version 1m 20s
setup: a2d0xj6xzgjl7wp4h4vx72sh9fmqdqy0-command-not-found.drv: build01: the build this call attached to did not finish, retry, asking the scheduler again 5h3kim …
setup:
a2d0xj6xzgjl7wp4h4vx72sh9fmqdqy0-command-not-found.drv: build01: the build this call attached to did not finish, retry, asking the scheduler again
5h3kimag6l6pljvnx39jphmb08pva54g-unit-nix-daemon.service.drv: build01: build01: input not substitutable: error: path '/nix/store/zc12x1yxf4yskzilqgq9ww7bfyfq1cvj-X-Restart-Triggers-nix-daemon' is required, but there is no substituter that can build it, asking the scheduler again
g66fdvinfjr78qvdxgz9b314sw4gszc3-decrypt-age-secrets.drv: build01: the build this call attached to did not finish, retry, asking the scheduler again
a2d0xj6xzgjl7wp4h4vx72sh9fmqdqy0-command-not-found.drv: build01: the build this call attached to did not finish, retry, asking the scheduler again
5h3kimag6l6pljvnx39jphmb08pva54g-unit-nix-daemon.service.drv: build01: build01: input not substitutable: error: path '/nix/store/zc12x1yxf4yskzilqgq9ww7bfyfq1cvj-X-Restart-Triggers-nix-daemon' is required, but there is no substituter that can build it, asking the scheduler again
g66fdvinfjr78qvdxgz9b314sw4gszc3-decrypt-age-secrets.drv: build01: the build this call attached to did not finish, retry, asking the scheduler again
5h3kimag6l6pljvnx39jphmb08pva54g-unit-nix-daemon.service.drv: build01: build01: input not substitutable: error: path '/nix/store/zc12x1yxf4yskzilqgq9ww7bfyfq1cvj-X-Restart-Triggers-nix-daemon' is required, but there is no substituter that can build it, asking the scheduler again
error: dependency 'i2ar0icrxhcng3k9nq4nlz4gvqwxw0mw-nixos-test-driver-service-state-version.drv' failed
failed eval checks.aarch64-linux.syncthing-service —
error: … while evaluating the attribute 'drvPath' at «https://releases.nixos.org/nixos/26.05/nixos-26.05.11680.6fcc160353f6/nixexprs.tar.xz?narH …
error:
       … while evaluating the attribute 'drvPath'
         at «https://releases.nixos.org/nixos/26.05/nixos-26.05.11680.6fcc160353f6/nixexprs.tar.xz?narHash=sha256-tM6MAMxVwetta6uD2aMzoWQ9v5EAaLLmYumiE4jVZeg%3D»/lib/customisation.nix:427:7:
          426|     // {
          427|       drvPath =
             |       ^
          428|         assert condition;

       … while calling the 'derivationStrict' builtin
         at «nix-internal»/derivation-internal.nix:37:12:
           36|
           37|   strict = derivationStrict drvAttrs;
             |            ^
           38|

       … while evaluating the option `nodes.machine1.networking.interfaces':

       … while evaluating definitions from `/nix/store/k1vyrhach56zhxf4835z5whii9mdr485-source/nixos/modules/hardware/facter/networking':

       … while evaluating the option `nodes.machine1.hardware.facter.enable':

       … while evaluating the option `nodes.machine1.hardware.facter.report':

       … while evaluating the option `nodes.machine1.hardware.facter.reportPath':

       … while evaluating definitions from `/nix/store/49x637kiwh63f7fc071q93np9vil8j1k-source/nixosModules/clanCore/nixos-facter.nix':

       (stack trace truncated; use '--show-trace' to show the full, detailed trace)

       error: build of '/nix/store/s0ffyljja91iyibg12pivpxdj7ipj3lh-merged-test-dir-syncthing-service.drv^out' failed: error: gave up after 9 reschedules
failed checks.aarch64-linux.trusted-nix-caches 6m 2s
setup: a2d0xj6xzgjl7wp4h4vx72sh9fmqdqy0-command-not-found.drv: build01: the build this call attached to did not finish, retry, asking the scheduler again g66fdv …
setup:
a2d0xj6xzgjl7wp4h4vx72sh9fmqdqy0-command-not-found.drv: build01: the build this call attached to did not finish, retry, asking the scheduler again
g66fdvinfjr78qvdxgz9b314sw4gszc3-decrypt-age-secrets.drv: build01: build01: input not substitutable: error: path '/nix/store/xqmbsf4zbphr1657ibx6smxqy01k1p69-mount-secret-fs' is required, but there is no substituter that can build it, asking the scheduler again
a2d0xj6xzgjl7wp4h4vx72sh9fmqdqy0-command-not-found.drv: build01: build01: input not substitutable: error: path '/nix/store/5fdmcpd1nqkzidxc440jdix6z98n16gc-perl-5.42.3-env' is required, but there is no substituter that can build it, asking the scheduler again
g66fdvinfjr78qvdxgz9b314sw4gszc3-decrypt-age-secrets.drv: build01: build01: input not substitutable: error: path '/nix/store/xqmbsf4zbphr1657ibx6smxqy01k1p69-mount-secret-fs' is required, but there is no substituter that can build it, asking the scheduler again
a2d0xj6xzgjl7wp4h4vx72sh9fmqdqy0-command-not-found.drv: build01: build01: input not substitutable: error: path '/nix/store/5fdmcpd1nqkzidxc440jdix6z98n16gc-perl-5.42.3-env' is required, but there is no substituter that can build it, asking the scheduler again
g66fdvinfjr78qvdxgz9b314sw4gszc3-decrypt-age-secrets.drv: build01: the build this call attached to did not finish, retry, asking the scheduler again
a2d0xj6xzgjl7wp4h4vx72sh9fmqdqy0-command-not-found.drv: build01: the build this call attached to did not finish, retry, asking the scheduler again
error: dependency 'w7i6mjw854rv3rpb24sp2dnx1j1qdc5r-nixos-test-driver-trusted-nix-caches.drv' failed
failed eval checks.aarch64-linux.users —
error: … while evaluating the attribute 'drvPath' at «https://releases.nixos.org/nixos/26.05/nixos-26.05.11680.6fcc160353f6/nixexprs.tar.xz?narH …
error:
       … while evaluating the attribute 'drvPath'
         at «https://releases.nixos.org/nixos/26.05/nixos-26.05.11680.6fcc160353f6/nixexprs.tar.xz?narHash=sha256-tM6MAMxVwetta6uD2aMzoWQ9v5EAaLLmYumiE4jVZeg%3D»/lib/customisation.nix:427:7:
          426|     // {
          427|       drvPath =
             |       ^
          428|         assert condition;

       … while calling the 'derivationStrict' builtin
         at «nix-internal»/derivation-internal.nix:37:12:
           36|
           37|   strict = derivationStrict drvAttrs;
             |            ^
           38|

       … while evaluating the option `nodes.server.networking.interfaces':

       … while evaluating definitions from `/nix/store/k1vyrhach56zhxf4835z5whii9mdr485-source/nixos/modules/hardware/facter/networking':

       … while evaluating the option `nodes.server.hardware.facter.enable':

       … while evaluating the option `nodes.server.hardware.facter.report':

       … while evaluating the option `nodes.server.hardware.facter.reportPath':

       … while evaluating definitions from `/nix/store/49x637kiwh63f7fc071q93np9vil8j1k-source/nixosModules/clanCore/nixos-facter.nix':

       (stack trace truncated; use '--show-trace' to show the full, detailed trace)

       error: build of '/nix/store/wjj1csz796rsk9nfz1fb3ygmj54jqkb7-merged-test-dir-users.drv^out' failed: error: gave up after 9 reschedules
failed checks.aarch64-linux.wifi 56s
setup: a2d0xj6xzgjl7wp4h4vx72sh9fmqdqy0-command-not-found.drv: build01: build01: input not substitutable: error: path '/nix/store/5fdmcpd1nqkzidxc440jdix6z98n16 …
setup:
a2d0xj6xzgjl7wp4h4vx72sh9fmqdqy0-command-not-found.drv: build01: build01: input not substitutable: error: path '/nix/store/5fdmcpd1nqkzidxc440jdix6z98n16gc-perl-5.42.3-env' is required, but there is no substituter that can build it, asking the scheduler again
ahwky2imndrhg86zbs119ldh71fs54x8-X-Restart-Triggers-nix-daemon.drv: build01: build01: input not substitutable: error: path '/nix/store/9d7gg64nc7x6cp7p8baznwr3agibzmfr-nix.conf' is required, but there is no substituter that can build it, asking the scheduler again
cljvc6g85z4w8x35z51amz5dzp0aii4y-decrypt-age-secrets.drv: build01: build01: input not substitutable: error: path '/nix/store/l9isi1w9mkdb232r9qfmvv1y3wg7fjqx-merged-test-dir-wifi' is required, but there is no substituter that can build it, asking the scheduler again
q9j00p7q7d3sd08f04nipyhhikmb28db-decrypt-age-secrets.drv: build01: build01: input not substitutable: error: path '/nix/store/l9isi1w9mkdb232r9qfmvv1y3wg7fjqx-merged-test-dir-wifi' is required, but there is no substituter that can build it, asking the scheduler again
a2d0xj6xzgjl7wp4h4vx72sh9fmqdqy0-command-not-found.drv: build01: build01: input not substitutable: error: path '/nix/store/5fdmcpd1nqkzidxc440jdix6z98n16gc-perl-5.42.3-env' is required, but there is no substituter that can build it, asking the scheduler again
ahwky2imndrhg86zbs119ldh71fs54x8-X-Restart-Triggers-nix-daemon.drv: build01: build01: input not substitutable: error: path '/nix/store/9d7gg64nc7x6cp7p8baznwr3agibzmfr-nix.conf' is required, but there is no substituter that can build it, asking the scheduler again
cljvc6g85z4w8x35z51amz5dzp0aii4y-decrypt-age-secrets.drv: build01: build01: input not substitutable: error: path '/nix/store/l9isi1w9mkdb232r9qfmvv1y3wg7fjqx-merged-test-dir-wifi' is required, but there is no substituter that can build it, asking the scheduler again
error: dependency 'nzyh2v9lp5slljdvymn9vhf7fzizssxp-nixos-test-driver-wifi.drv' failed
failed eval checks.aarch64-linux.wireguard —
error: … while evaluating the attribute 'drvPath' at «https://releases.nixos.org/nixos/26.05/nixos-26.05.11680.6fcc160353f6/nixexprs.tar.xz?narH …
error:
       … while evaluating the attribute 'drvPath'
         at «https://releases.nixos.org/nixos/26.05/nixos-26.05.11680.6fcc160353f6/nixexprs.tar.xz?narHash=sha256-tM6MAMxVwetta6uD2aMzoWQ9v5EAaLLmYumiE4jVZeg%3D»/lib/customisation.nix:427:7:
          426|     // {
          427|       drvPath =
             |       ^
          428|         assert condition;

       … while calling the 'derivationStrict' builtin
         at «nix-internal»/derivation-internal.nix:37:12:
           36|
           37|   strict = derivationStrict drvAttrs;
             |            ^
           38|

       … while evaluating the option `nodes.controller1.networking.interfaces':

       … while evaluating definitions from `/nix/store/k1vyrhach56zhxf4835z5whii9mdr485-source/nixos/modules/hardware/facter/networking':

       … while evaluating the option `nodes.controller1.hardware.facter.enable':

       … while evaluating the option `nodes.controller1.hardware.facter.report':

       … while evaluating the option `nodes.controller1.hardware.facter.reportPath':

       … while evaluating definitions from `/nix/store/49x637kiwh63f7fc071q93np9vil8j1k-source/nixosModules/clanCore/nixos-facter.nix':

       (stack trace truncated; use '--show-trace' to show the full, detailed trace)

       error: build of '/nix/store/bqv8zsy58v6f6jyz0lmdjxq33jvbjfwi-merged-test-dir-wireguard.drv^out' failed: error: error: gRPC AddMultipleToStore on 'nix-store.geninf.io:50051' failed: error: path '/nix/store/d4gbc6i82ncm89gvjn4340valqjakhq8-generator-wireguard-network-wg-test-one.drv' is required, but there is no substituter that can build it
failed checks.aarch64-linux.yggdrasil 3m 20s
setup: a2d0xj6xzgjl7wp4h4vx72sh9fmqdqy0-command-not-found.drv: build01: build01: input not substitutable: error: path '/nix/store/5fdmcpd1nqkzidxc440jdix6z98n16 …
setup:
a2d0xj6xzgjl7wp4h4vx72sh9fmqdqy0-command-not-found.drv: build01: build01: input not substitutable: error: path '/nix/store/5fdmcpd1nqkzidxc440jdix6z98n16gc-perl-5.42.3-env' is required, but there is no substituter that can build it, asking the scheduler again
assnbwckmsxhz1iqqmwkiwwrphg76can-decrypt-age-secrets.drv: build01: build01: input not substitutable: error: path '/nix/store/xqmbsf4zbphr1657ibx6smxqy01k1p69-mount-secret-fs' is required, but there is no substituter that can build it, asking the scheduler again
ahwky2imndrhg86zbs119ldh71fs54x8-X-Restart-Triggers-nix-daemon.drv: build01: build01: input not substitutable: error: path '/nix/store/9d7gg64nc7x6cp7p8baznwr3agibzmfr-nix.conf' is required, but there is no substituter that can build it, asking the scheduler again
abjnba7xshybjiwhin9jwdfi3wqxjaa2-decrypt-age-secrets.drv: build01: build01: input not substitutable: error: path '/nix/store/xqmbsf4zbphr1657ibx6smxqy01k1p69-mount-secret-fs' is required, but there is no substituter that can build it, asking the scheduler again
kllm2dnfpjc997y43d5iknilc3930xmg-decrypt-age-secrets.drv: build01: build01: input not substitutable: error: path '/nix/store/xqmbsf4zbphr1657ibx6smxqy01k1p69-mount-secret-fs' is required, but there is no substituter that can build it, asking the scheduler again
ahwky2imndrhg86zbs119ldh71fs54x8-X-Restart-Triggers-nix-daemon.drv: build01: build01: input not substitutable: error: path '/nix/store/9d7gg64nc7x6cp7p8baznwr3agibzmfr-nix.conf' is required, but there is no substituter that can build it, asking the scheduler again
kllm2dnfpjc997y43d5iknilc3930xmg-decrypt-age-secrets.drv: build01: build01: input not substitutable: error: path '/nix/store/xqmbsf4zbphr1657ibx6smxqy01k1p69-mount-secret-fs' is required, but there is no substituter that can build it, asking the scheduler again
error: dependency 'nzgwrr4gcxvijamc4xwvlaim22h8h74r-nixos-test-driver-yggdrasil.drv' failed
failed checks.aarch64-linux.zerotier 4m 34s
setup: knlmkrqjahfqk2waflas2rvl1bag1rqa-decrypt-age-secrets.drv: build01: build01: input not substitutable: error: path '/nix/store/xqmbsf4zbphr1657ibx6smxqy01k …
setup:
knlmkrqjahfqk2waflas2rvl1bag1rqa-decrypt-age-secrets.drv: build01: build01: input not substitutable: error: path '/nix/store/xqmbsf4zbphr1657ibx6smxqy01k1p69-mount-secret-fs' is required, but there is no substituter that can build it, asking the scheduler again
vlv5s6wzzy28lq4lrlh1nm8akbw643q3-decrypt-age-secrets.drv: build01: build01: input not substitutable: error: path '/nix/store/xqmbsf4zbphr1657ibx6smxqy01k1p69-mount-secret-fs' is required, but there is no substituter that can build it, asking the scheduler again
ahwky2imndrhg86zbs119ldh71fs54x8-X-Restart-Triggers-nix-daemon.drv: build01: build01: input not substitutable: error: path '/nix/store/9d7gg64nc7x6cp7p8baznwr3agibzmfr-nix.conf' is required, but there is no substituter that can build it, asking the scheduler again
is5z7fr3ddby830v58hnhd51jcv9yx29-decrypt-age-secrets.drv: build01: build01: input not substitutable: error: path '/nix/store/xqmbsf4zbphr1657ibx6smxqy01k1p69-mount-secret-fs' is required, but there is no substituter that can build it, asking the scheduler again
xiphg4rjxnc76j7ywlxqv6mmkzsrjivc-decrypt-age-secrets.drv: build01: build01: input not substitutable: error: path '/nix/store/xqmbsf4zbphr1657ibx6smxqy01k1p69-mount-secret-fs' is required, but there is no substituter that can build it, asking the scheduler again
a2d0xj6xzgjl7wp4h4vx72sh9fmqdqy0-command-not-found.drv: build01: build01: input not substitutable: error: path '/nix/store/5fdmcpd1nqkzidxc440jdix6z98n16gc-perl-5.42.3-env' is required, but there is no substituter that can build it, asking the scheduler again
knlmkrqjahfqk2waflas2rvl1bag1rqa-decrypt-age-secrets.drv: build01: build01: input not substitutable: error: path '/nix/store/xqmbsf4zbphr1657ibx6smxqy01k1p69-mount-secret-fs' is required, but there is no substituter that can build it, asking the scheduler again
error: dependency '1vc934qwfs8rrz0x5f1nrajgv5z7622b-nixos-test-driver-zerotier.drv' failed
failed checks.aarch64-linux.zerotier-multi-instance 23s
setup: 8jlzycab74ppvwkpx8bmdnnsm09snmvq-decrypt-age-secrets.drv: build01: build01: input not substitutable: error: path '/nix/store/xqmbsf4zbphr1657ibx6smxqy01k …
setup:
8jlzycab74ppvwkpx8bmdnnsm09snmvq-decrypt-age-secrets.drv: build01: build01: input not substitutable: error: path '/nix/store/xqmbsf4zbphr1657ibx6smxqy01k1p69-mount-secret-fs' is required, but there is no substituter that can build it, asking the scheduler again
a2d0xj6xzgjl7wp4h4vx72sh9fmqdqy0-command-not-found.drv: build01: build01: input not substitutable: error: path '/nix/store/5fdmcpd1nqkzidxc440jdix6z98n16gc-perl-5.42.3-env' is required, but there is no substituter that can build it, asking the scheduler again
ahwky2imndrhg86zbs119ldh71fs54x8-X-Restart-Triggers-nix-daemon.drv: build01: build01: input not substitutable: error: path '/nix/store/9d7gg64nc7x6cp7p8baznwr3agibzmfr-nix.conf' is required, but there is no substituter that can build it, asking the scheduler again
s6b2dgx90f9jzi8pxg6bc463d96hg8yi-decrypt-age-secrets.drv: build01: build01: input not substitutable: error: path '/nix/store/xqmbsf4zbphr1657ibx6smxqy01k1p69-mount-secret-fs' is required, but there is no substituter that can build it, asking the scheduler again
8jlzycab74ppvwkpx8bmdnnsm09snmvq-decrypt-age-secrets.drv: build01: build01: input not substitutable: error: path '/nix/store/xqmbsf4zbphr1657ibx6smxqy01k1p69-mount-secret-fs' is required, but there is no substituter that can build it, asking the scheduler again
a2d0xj6xzgjl7wp4h4vx72sh9fmqdqy0-command-not-found.drv: build01: build01: input not substitutable: error: path '/nix/store/5fdmcpd1nqkzidxc440jdix6z98n16gc-perl-5.42.3-env' is required, but there is no substituter that can build it, asking the scheduler again
ahwky2imndrhg86zbs119ldh71fs54x8-X-Restart-Triggers-nix-daemon.drv: build01: build01: input not substitutable: error: path '/nix/store/9d7gg64nc7x6cp7p8baznwr3agibzmfr-nix.conf' is required, but there is no substituter that can build it, asking the scheduler again
error: dependency 'njjlicysn0wm9h2siykx6ah6c8bmfbv8-nixos-test-driver-zerotier-multi-instance.drv' failed
failed eval checks.x86_64-linux.all-packages —
error: … while calling the 'derivationStrict' builtin at «nix-internal»/derivation-internal.nix:37:12: 36| 37| strict = …
error:
       … while calling the 'derivationStrict' builtin
         at «nix-internal»/derivation-internal.nix:37:12:
           36|
           37|   strict = derivationStrict drvAttrs;
             |            ^
           38|

       … while evaluating derivation 'all-packages'
         whose name attribute is located at «https://releases.nixos.org/nixos/26.05/nixos-26.05.11680.6fcc160353f6/nixexprs.tar.xz?narHash=sha256-tM6MAMxVwetta6uD2aMzoWQ9v5EAaLLmYumiE4jVZeg%3D»/pkgs/stdenv/generic/make-derivation.nix:647:11

       … while evaluating attribute 'buildCommand' of derivation 'all-packages'
         at «https://releases.nixos.org/nixos/26.05/nixos-26.05.11680.6fcc160353f6/nixexprs.tar.xz?narHash=sha256-tM6MAMxVwetta6uD2aMzoWQ9v5EAaLLmYumiE4jVZeg%3D»/pkgs/build-support/trivial-builders/default.nix:81:17:
           80|         enableParallelBuilding = true;
           81|         inherit buildCommand name;
             |                 ^
           82|         passAsFile = [ "buildCommand" ] ++ (derivationArgs.passAsFile or [ ]);

       (stack trace truncated; use '--show-trace' to show the full, detailed trace)

       error: Refusing to evaluate package 'pnpm-10.34.0' in /nix/store/k1vyrhach56zhxf4835z5whii9mdr485-source/pkgs/development/tools/pnpm/generic.nix:170 because it is marked as insecure

       Known issues:
        - CVE-2026-55487
        - CVE-2026-55698
        - CVE-2026-55180
        - CVE-2026-55697
        - CVE-2026-59194
        - CVE-2026-59195
        - CVE-2026-59196
        - CVE-2026-82392
        - CVE-2026-82393

       You can install it anyway by allowing this package, using the
       following methods:

       a) To temporarily allow all insecure packages, you can use an environment
          variable for a single invocation of the nix tools:

            $ export NIXPKGS_ALLOW_INSECURE=1

          Note: When using `nix shell`, `nix build`, `nix develop`, etc with a flake,
                then pass `--impure` in order to allow use of environment variables.

       b) for `nixos-rebuild` you can add ‘pnpm-10.34.0’ to
          `nixpkgs.config.permittedInsecurePackages` in the configuration.nix,
          like so:

            {
              nixpkgs.config.permittedInsecurePackages = [
                "pnpm-10.34.0"
              ];
            }

       c) For `nix-env`, `nix-build`, `nix-shell` or any other Nix command you can add
          ‘pnpm-10.34.0’ to `permittedInsecurePackages` in
          ~/.config/nixpkgs/config.nix, like so:

            {
              permittedInsecurePackages = [
                "pnpm-10.34.0"
              ];
            }
failed eval checks.x86_64-linux.borgbackup —
error: … while evaluating the attribute 'drvPath' at «https://releases.nixos.org/nixos/26.05/nixos-26.05.11680.6fcc160353f6/nixexprs.tar.xz?narH …
error:
       … while evaluating the attribute 'drvPath'
         at «https://releases.nixos.org/nixos/26.05/nixos-26.05.11680.6fcc160353f6/nixexprs.tar.xz?narHash=sha256-tM6MAMxVwetta6uD2aMzoWQ9v5EAaLLmYumiE4jVZeg%3D»/lib/customisation.nix:427:7:
          426|     // {
          427|       drvPath =
             |       ^
          428|         assert condition;

       … while calling the 'derivationStrict' builtin
         at «nix-internal»/derivation-internal.nix:37:12:
           36|
           37|   strict = derivationStrict drvAttrs;
             |            ^
           38|

       … while evaluating the option `nodes.clientone.networking.interfaces':

       … while evaluating definitions from `/nix/store/k1vyrhach56zhxf4835z5whii9mdr485-source/nixos/modules/hardware/facter/networking':

       … while evaluating the option `nodes.clientone.hardware.facter.enable':

       … while evaluating the option `nodes.clientone.hardware.facter.report':

       … while evaluating the option `nodes.clientone.hardware.facter.reportPath':

       … while evaluating definitions from `/nix/store/49x637kiwh63f7fc071q93np9vil8j1k-source/nixosModules/clanCore/nixos-facter.nix':

       (stack trace truncated; use '--show-trace' to show the full, detailed trace)

       error: build of '/nix/store/iymk7adx6w7kdzk12m8yl90s7n15qava-merged-test-dir-borgbackup.drv^out' failed: error: gave up after 9 reschedules
failed eval checks.x86_64-linux.certificates —
error: … while evaluating the attribute 'drvPath' at «https://releases.nixos.org/nixos/26.05/nixos-26.05.11680.6fcc160353f6/nixexprs.tar.xz?narH …
error:
       … while evaluating the attribute 'drvPath'
         at «https://releases.nixos.org/nixos/26.05/nixos-26.05.11680.6fcc160353f6/nixexprs.tar.xz?narHash=sha256-tM6MAMxVwetta6uD2aMzoWQ9v5EAaLLmYumiE4jVZeg%3D»/lib/customisation.nix:427:7:
          426|     // {
          427|       drvPath =
             |       ^
          428|         assert condition;

       … while calling the 'derivationStrict' builtin
         at «nix-internal»/derivation-internal.nix:37:12:
           36|
           37|   strict = derivationStrict drvAttrs;
             |            ^
           38|

       … while evaluating the option `nodes.ca.networking.interfaces':

       … while evaluating definitions from `/nix/store/k1vyrhach56zhxf4835z5whii9mdr485-source/nixos/modules/hardware/facter/networking':

       … while evaluating the option `nodes.ca.hardware.facter.enable':

       … while evaluating the option `nodes.ca.hardware.facter.report':

       … while evaluating the option `nodes.ca.hardware.facter.reportPath':

       … while evaluating definitions from `/nix/store/49x637kiwh63f7fc071q93np9vil8j1k-source/nixosModules/clanCore/nixos-facter.nix':

       (stack trace truncated; use '--show-trace' to show the full, detailed trace)

       error: build of '/nix/store/4l0b6fay94iqq24kqzjr0340hb8isk8v-merged-test-dir-certificates.drv^out' failed: error: error: gRPC AddMultipleToStore on 'nix-store.geninf.io:50051' failed: error: path '/nix/store/pz095625cmjmg3l5p9p56psv3adsfs7h-generator-step-intermediate-key.drv' is required, but there is no substituter that can build it
failed eval checks.x86_64-linux.clan-site-lint —
error: … while calling the 'derivationStrict' builtin at «nix-internal»/derivation-internal.nix:37:12: 36| 37| strict = …
error:
       … while calling the 'derivationStrict' builtin
         at «nix-internal»/derivation-internal.nix:37:12:
           36|
           37|   strict = derivationStrict drvAttrs;
             |            ^
           38|

       … while evaluating derivation 'clan-site-lint'
         whose name attribute is located at «https://releases.nixos.org/nixos/26.05/nixos-26.05.11680.6fcc160353f6/nixexprs.tar.xz?narHash=sha256-tM6MAMxVwetta6uD2aMzoWQ9v5EAaLLmYumiE4jVZeg%3D»/pkgs/stdenv/generic/make-derivation.nix:647:11

       … while evaluating attribute 'nativeBuildInputs' of derivation 'clan-site-lint'
         at «https://releases.nixos.org/nixos/26.05/nixos-26.05.11680.6fcc160353f6/nixexprs.tar.xz?narHash=sha256-tM6MAMxVwetta6uD2aMzoWQ9v5EAaLLmYumiE4jVZeg%3D»/pkgs/stdenv/generic/make-derivation.nix:715:11:
          714|           depsBuildBuild = buildBuildOutputs;
          715|           nativeBuildInputs = buildHostOutputs;
             |           ^
          716|           depsBuildTarget = buildTargetOutputs;

       (stack trace truncated; use '--show-trace' to show the full, detailed trace)

       error: Refusing to evaluate package 'pnpm-10.34.0' in /nix/store/k1vyrhach56zhxf4835z5whii9mdr485-source/pkgs/development/tools/pnpm/generic.nix:170 because it is marked as insecure

       Known issues:
        - CVE-2026-55487
        - CVE-2026-55698
        - CVE-2026-55180
        - CVE-2026-55697
        - CVE-2026-59194
        - CVE-2026-59195
        - CVE-2026-59196
        - CVE-2026-82392
        - CVE-2026-82393

       You can install it anyway by allowing this package, using the
       following methods:

       a) To temporarily allow all insecure packages, you can use an environment
          variable for a single invocation of the nix tools:

            $ export NIXPKGS_ALLOW_INSECURE=1

          Note: When using `nix shell`, `nix build`, `nix develop`, etc with a flake,
                then pass `--impure` in order to allow use of environment variables.

       b) for `nixos-rebuild` you can add ‘pnpm-10.34.0’ to
          `nixpkgs.config.permittedInsecurePackages` in the configuration.nix,
          like so:

            {
              nixpkgs.config.permittedInsecurePackages = [
                "pnpm-10.34.0"
              ];
            }

       c) For `nix-env`, `nix-build`, `nix-shell` or any other Nix command you can add
          ‘pnpm-10.34.0’ to `permittedInsecurePackages` in
          ~/.config/nixpkgs/config.nix, like so:

            {
              permittedInsecurePackages = [
                "pnpm-10.34.0"
              ];
            }
failed checks.x86_64-linux.clan-test-update 5m 51s
setup: /nix/store/cdba8gkd7c9n89cgcq7fiasqc84fv73v-zlib-ng-2.3.3-dev /nix/store/1hjg44rywjpc52nnhs1z9iba9vgr2s3n-zstd-1.5.7-dev warning: ignoring the client …
setup:
  /nix/store/cdba8gkd7c9n89cgcq7fiasqc84fv73v-zlib-ng-2.3.3-dev
  /nix/store/1hjg44rywjpc52nnhs1z9iba9vgr2s3n-zstd-1.5.7-dev
warning: ignoring the client-specified setting 'store', because it is a restricted setting and you are not a trusted user
wra8fgkkamqz55ysav6grk1jwd3p4bk4-tmpfiles.d.drv: error: gRPC AddMultipleToStore on 'nix-store.geninf.io:50051' failed: error: path '/nix/store/mjvd8x5hx9l7w4cim8gqndflarrv597f-10-ssh-hostkey.conf.drv' is required, but there is no substituter that can build it
iq63cixyxxv4saba54s3znxxmcjdagk7-nix.conf.drv: error: gRPC BuildDerivation on 'nix-store.geninf.io:50051' failed: build-x86-01: missing: /nix/store/iq63cixyxxv4saba54s3znxxmcjdagk7-nix.conf.drv
mzh5slpw8k4f8icyd42qis87yn099gsa-clan-runtime.drv: build-x86-01: not scheduled here: mzh5slpw8k4f8icyd42qis87yn099gsa-clan-runtime.drv, asking the scheduler again
ak80mqrrrmsz79mmj4fnbav5skz8qslr-offline-flake-for-test-clan-test-update.drv: gi-build-x86-02: not scheduled here: ak80mqrrrmsz79mmj4fnbav5skz8qslr-offline-flake-for-test-clan-test-update.drv, asking the scheduler again
error: dependency 'ik2mmb5axih25967h2bp0x2igl3wq0w1-nixos-test-driver-clan-test-update.drv' failed
failed checks.x86_64-linux.darwin-test-darwin-machine 3m 9s
setup: q8j2d3gm7gwm3k0ail51fkbw9nyrpzaz-etc-registry.json.drv: no connected, non-draining worker for system 'aarch64-darwin' offers features {}, the workers off …
setup:
q8j2d3gm7gwm3k0ail51fkbw9nyrpzaz-etc-registry.json.drv: no connected, non-draining worker for system 'aarch64-darwin' offers features {}, the workers offer {}
qm4r6lgv1ld1pdf52ndlra10gsm97mr8-darwin-rebuild.drv: no connected, non-draining worker for system 'aarch64-darwin' offers features {}, the workers offer {}
rjrx4i80iwd7xri74wfsfxi8fsal8gbp-set-environment.drv: no connected, non-draining worker for system 'aarch64-darwin' offers features {}, the workers offer {}
w4afz2impwxc5cqv08bsa2vh6gr5pl3d-patches.drv: no connected, non-draining worker for system 'aarch64-darwin' offers features {}, the workers offer {}
y5f294bglikn7b7gcnlchbaj9j1qmfjf-etc-099-host-keys.conf.drv: no connected, non-draining worker for system 'aarch64-darwin' offers features {}, the workers offer {}
y6v0x6ql68q9080awrq8ab9mw6l1gavh-launchd.drv: no connected, non-draining worker for system 'aarch64-darwin' offers features {}, the workers offer {}
z9s1ywmxymywpbrgf5vr2x1q6ydvp5cx-darwin-version.json.drv: no connected, non-draining worker for system 'aarch64-darwin' offers features {}, the workers offer {}
error: dependency 'w4afz2impwxc5cqv08bsa2vh6gr5pl3d-patches.drv' failed
failed eval checks.x86_64-linux.data-mesher —
error: … while evaluating the attribute 'drvPath' at «https://releases.nixos.org/nixos/26.05/nixos-26.05.11680.6fcc160353f6/nixexprs.tar.xz?narH …
error:
       … while evaluating the attribute 'drvPath'
         at «https://releases.nixos.org/nixos/26.05/nixos-26.05.11680.6fcc160353f6/nixexprs.tar.xz?narHash=sha256-tM6MAMxVwetta6uD2aMzoWQ9v5EAaLLmYumiE4jVZeg%3D»/lib/customisation.nix:427:7:
          426|     // {
          427|       drvPath =
             |       ^
          428|         assert condition;

       … while calling the 'derivationStrict' builtin
         at «nix-internal»/derivation-internal.nix:37:12:
           36|
           37|   strict = derivationStrict drvAttrs;
             |            ^
           38|

       … while evaluating the option `nodes.alpha.networking.interfaces':

       … while evaluating definitions from `/nix/store/k1vyrhach56zhxf4835z5whii9mdr485-source/nixos/modules/hardware/facter/networking':

       … while evaluating the option `nodes.alpha.hardware.facter.enable':

       … while evaluating the option `nodes.alpha.hardware.facter.report':

       … while evaluating the option `nodes.alpha.hardware.facter.reportPath':

       … while evaluating definitions from `/nix/store/49x637kiwh63f7fc071q93np9vil8j1k-source/nixosModules/clanCore/nixos-facter.nix':

       (stack trace truncated; use '--show-trace' to show the full, detailed trace)

       error: path '/nix/store/06gndqwdcgxnblx7nr2jc6k0nzfj48jq-merged-test-dir-data-mesher' is not valid
failed eval checks.x86_64-linux.devShell-clan-site —
error: … while calling the 'derivationStrict' builtin at «nix-internal»/derivation-internal.nix:37:12: 36| 37| strict = …
error:
       … while calling the 'derivationStrict' builtin
         at «nix-internal»/derivation-internal.nix:37:12:
           36|
           37|   strict = derivationStrict drvAttrs;
             |            ^
           38|

       … while evaluating derivation 'nix-shell'
         whose name attribute is located at «https://releases.nixos.org/nixos/26.05/nixos-26.05.11680.6fcc160353f6/nixexprs.tar.xz?narHash=sha256-tM6MAMxVwetta6uD2aMzoWQ9v5EAaLLmYumiE4jVZeg%3D»/pkgs/stdenv/generic/make-derivation.nix:647:11

       … while evaluating attribute 'nativeBuildInputs' of derivation 'nix-shell'
         at «https://releases.nixos.org/nixos/26.05/nixos-26.05.11680.6fcc160353f6/nixexprs.tar.xz?narHash=sha256-tM6MAMxVwetta6uD2aMzoWQ9v5EAaLLmYumiE4jVZeg%3D»/pkgs/stdenv/generic/make-derivation.nix:715:11:
          714|           depsBuildBuild = buildBuildOutputs;
          715|           nativeBuildInputs = buildHostOutputs;
             |           ^
          716|           depsBuildTarget = buildTargetOutputs;

       (stack trace truncated; use '--show-trace' to show the full, detailed trace)

       error: Refusing to evaluate package 'pnpm-10.34.0' in /nix/store/k1vyrhach56zhxf4835z5whii9mdr485-source/pkgs/development/tools/pnpm/generic.nix:170 because it is marked as insecure

       Known issues:
        - CVE-2026-55487
        - CVE-2026-55698
        - CVE-2026-55180
        - CVE-2026-55697
        - CVE-2026-59194
        - CVE-2026-59195
        - CVE-2026-59196
        - CVE-2026-82392
        - CVE-2026-82393

       You can install it anyway by allowing this package, using the
       following methods:

       a) To temporarily allow all insecure packages, you can use an environment
          variable for a single invocation of the nix tools:

            $ export NIXPKGS_ALLOW_INSECURE=1

          Note: When using `nix shell`, `nix build`, `nix develop`, etc with a flake,
                then pass `--impure` in order to allow use of environment variables.

       b) for `nixos-rebuild` you can add ‘pnpm-10.34.0’ to
          `nixpkgs.config.permittedInsecurePackages` in the configuration.nix,
          like so:

            {
              nixpkgs.config.permittedInsecurePackages = [
                "pnpm-10.34.0"
              ];
            }

       c) For `nix-env`, `nix-build`, `nix-shell` or any other Nix command you can add
          ‘pnpm-10.34.0’ to `permittedInsecurePackages` in
          ~/.config/nixpkgs/config.nix, like so:

            {
              permittedInsecurePackages = [
                "pnpm-10.34.0"
              ];
            }
failed eval checks.x86_64-linux.devShell-docs —
error: … while calling the 'derivationStrict' builtin at «nix-internal»/derivation-internal.nix:37:12: 36| 37| strict = …
error:
       … while calling the 'derivationStrict' builtin
         at «nix-internal»/derivation-internal.nix:37:12:
           36|
           37|   strict = derivationStrict drvAttrs;
             |            ^
           38|

       … while evaluating derivation 'nix-shell'
         whose name attribute is located at «https://releases.nixos.org/nixos/26.05/nixos-26.05.11680.6fcc160353f6/nixexprs.tar.xz?narHash=sha256-tM6MAMxVwetta6uD2aMzoWQ9v5EAaLLmYumiE4jVZeg%3D»/pkgs/stdenv/generic/make-derivation.nix:647:11

       … while evaluating attribute 'nativeBuildInputs' of derivation 'nix-shell'
         at «https://releases.nixos.org/nixos/26.05/nixos-26.05.11680.6fcc160353f6/nixexprs.tar.xz?narHash=sha256-tM6MAMxVwetta6uD2aMzoWQ9v5EAaLLmYumiE4jVZeg%3D»/pkgs/stdenv/generic/make-derivation.nix:715:11:
          714|           depsBuildBuild = buildBuildOutputs;
          715|           nativeBuildInputs = buildHostOutputs;
             |           ^
          716|           depsBuildTarget = buildTargetOutputs;

       (stack trace truncated; use '--show-trace' to show the full, detailed trace)

       error: Refusing to evaluate package 'pnpm-10.34.0' in /nix/store/k1vyrhach56zhxf4835z5whii9mdr485-source/pkgs/development/tools/pnpm/generic.nix:170 because it is marked as insecure

       Known issues:
        - CVE-2026-55487
        - CVE-2026-55698
        - CVE-2026-55180
        - CVE-2026-55697
        - CVE-2026-59194
        - CVE-2026-59195
        - CVE-2026-59196
        - CVE-2026-82392
        - CVE-2026-82393

       You can install it anyway by allowing this package, using the
       following methods:

       a) To temporarily allow all insecure packages, you can use an environment
          variable for a single invocation of the nix tools:

            $ export NIXPKGS_ALLOW_INSECURE=1

          Note: When using `nix shell`, `nix build`, `nix develop`, etc with a flake,
                then pass `--impure` in order to allow use of environment variables.

       b) for `nixos-rebuild` you can add ‘pnpm-10.34.0’ to
          `nixpkgs.config.permittedInsecurePackages` in the configuration.nix,
          like so:

            {
              nixpkgs.config.permittedInsecurePackages = [
                "pnpm-10.34.0"
              ];
            }

       c) For `nix-env`, `nix-build`, `nix-shell` or any other Nix command you can add
          ‘pnpm-10.34.0’ to `permittedInsecurePackages` in
          ~/.config/nixpkgs/config.nix, like so:

            {
              permittedInsecurePackages = [
                "pnpm-10.34.0"
              ];
            }
failed checks.x86_64-linux.dyndns 1m 43s
setup: /nix/store/yvblbka1is0bafkkxxv846wjrvbyv2a2-python3.13-jinja2-3.1.6 /nix/store/wd3a6wzjn56dsm0fsjm5h59kv3281zg7-python3.13-markupsafe-3.0.3 /nix/st …
setup:
  /nix/store/yvblbka1is0bafkkxxv846wjrvbyv2a2-python3.13-jinja2-3.1.6
  /nix/store/wd3a6wzjn56dsm0fsjm5h59kv3281zg7-python3.13-markupsafe-3.0.3
  /nix/store/96mrw546sc39lyyvcwfb43bigrl1r5bb-python3.13-pyparsing-2.4.7
  /nix/store/yg20cdcdcv3rjnlr0nkvgrrgh8hdinys-systemd-default-tmpfiles
  /nix/store/hy6bayiprypyi6g2sq6vc3y35x2y9b1v-vars-check-dyndns
warning: ignoring the client-specified setting 'store', because it is a restricted setting and you are not a trusted user
6c9fdpkvfz340jxhpcmj5sdyv78jj905-unit-acme-renew-test.example.com.timer.drv: error: gRPC BuildDerivation on 'nix-store.geninf.io:50051' failed: build-x86-01: missing: /nix/store/6c9fdpkvfz340jxhpcmj5sdyv78jj905-unit-acme-renew-test.example.com.timer.drv
error: dependency '8l5x35xfpzkk5jz6j74p819621y7a967-nixos-test-driver-dyndns.drv' failed
failed checks.x86_64-linux.kde 3m 17s
setup: don't know how to build these paths: /nix/store/41idnkxjz3wia3j06khrvl7gnzbf687j-container-test-run-kde.drv warning: ignoring the client-specified sett …
setup:
don't know how to build these paths:
  /nix/store/41idnkxjz3wia3j06khrvl7gnzbf687j-container-test-run-kde.drv
warning: ignoring the client-specified setting 'store', because it is a restricted setting and you are not a trusted user
pcb6idc1zmnjb663c1kvl28l63p5a03j-unit-polkit.service.drv: error: gRPC AddMultipleToStore on 'nix-store.geninf.io:50051' failed: error: some references of path '/nix/store/agc7mfry54igl6jw8g9gfjk8nxxz0ngy-X-Reload-Triggers-polkit.drv' could not be realised
error: dependency 'pmw0k2cy1icsqnasl85i1g92x09g4jwd-nixos-test-driver-kde.drv' failed
failed eval checks.x86_64-linux.nixos-test-password-store-mounts —
error: … while evaluating the attribute 'drvPath' at «https://releases.nixos.org/nixos/26.05/nixos-26.05.11680.6fcc160353f6/nixexprs.tar.xz?narH …
error:
       … while evaluating the attribute 'drvPath'
         at «https://releases.nixos.org/nixos/26.05/nixos-26.05.11680.6fcc160353f6/nixexprs.tar.xz?narHash=sha256-tM6MAMxVwetta6uD2aMzoWQ9v5EAaLLmYumiE4jVZeg%3D»/lib/customisation.nix:427:7:
          426|     // {
          427|       drvPath =
             |       ^
          428|         assert condition;

       … while calling the 'derivationStrict' builtin
         at «nix-internal»/derivation-internal.nix:37:12:
           36|
           37|   strict = derivationStrict drvAttrs;
             |            ^
           38|

       … while evaluating the option `driverConfiguration.vlans':

       … while evaluating definitions from `/nix/store/k1vyrhach56zhxf4835z5whii9mdr485-source/nixos/lib/testing/driver-configuration.nix':

       … while evaluating the option `nodes.machine.networking.interfaces':

       … while evaluating definitions from `/nix/store/k1vyrhach56zhxf4835z5whii9mdr485-source/nixos/modules/hardware/facter/networking':

       … while evaluating the option `nodes.machine.hardware.facter.enable':

       … while evaluating the option `nodes.machine.hardware.facter.report':

       … while evaluating the option `nodes.machine.hardware.facter.reportPath':

       … while evaluating definitions from `/nix/store/49x637kiwh63f7fc071q93np9vil8j1k-source/nixosModules/clanCore/nixos-facter.nix':

       (stack trace truncated; use '--show-trace' to show the full, detailed trace)

       error: hash mismatch importing path '/nix/store/zkzazxi1yx3z6i12sxg59p6kxxiymkjg-merged-test-dir-nixos-test-password-store-mounts';
         specified: sha256-FhXs8hNWMCH42XVZyJiTiJO+8Z+QsGYV+xtVkH5IH9Y=
         got:       sha256-QPczPYXyw20mokxX24vLfzqE+W0zgimOK2NtS4zQ4no=
failed eval checks.x86_64-linux.p2p-ssh-iroh —
error: … while evaluating the attribute 'drvPath' at «https://releases.nixos.org/nixos/26.05/nixos-26.05.11680.6fcc160353f6/nixexprs.tar.xz?narH …
error:
       … while evaluating the attribute 'drvPath'
         at «https://releases.nixos.org/nixos/26.05/nixos-26.05.11680.6fcc160353f6/nixexprs.tar.xz?narHash=sha256-tM6MAMxVwetta6uD2aMzoWQ9v5EAaLLmYumiE4jVZeg%3D»/lib/customisation.nix:427:7:
          426|     // {
          427|       drvPath =
             |       ^
          428|         assert condition;

       … while calling the 'derivationStrict' builtin
         at «nix-internal»/derivation-internal.nix:37:12:
           36|
           37|   strict = derivationStrict drvAttrs;
             |            ^
           38|

       … while evaluating the option `nodes.client.networking.interfaces':

       … while evaluating definitions from `/nix/store/k1vyrhach56zhxf4835z5whii9mdr485-source/nixos/modules/hardware/facter/networking':

       … while evaluating the option `nodes.client.hardware.facter.enable':

       … while evaluating the option `nodes.client.hardware.facter.report':

       … while evaluating the option `nodes.client.hardware.facter.reportPath':

       … while evaluating definitions from `/nix/store/49x637kiwh63f7fc071q93np9vil8j1k-source/nixosModules/clanCore/nixos-facter.nix':

       (stack trace truncated; use '--show-trace' to show the full, detailed trace)

       error: gRPC FetchNars failed: error: path '/nix/store/pl2jypwax5dgng2lldc7f6c4nqcv6x1x-merged-test-dir-clan-test-p2p-ssh-iroh' is required, but there is no substituter that can build it
failed checks.x86_64-linux.packages 16s
setup: don't know how to build these paths: /nix/store/30vak15sppv09k9483n9y608f0c31qy6-container-test-run-packages.drv warning: ignoring the client-specified …
setup:
don't know how to build these paths:
  /nix/store/30vak15sppv09k9483n9y608f0c31qy6-container-test-run-packages.drv
warning: ignoring the client-specified setting 'store', because it is a restricted setting and you are not a trusted user
sd9gb4li4qq1xd74prjlxj8x6d9597cv-system-path.drv: error: gRPC AddMultipleToStore on 'nix-store.geninf.io:50051' failed: error: some references of path '/nix/store/cgl8ccfsm0dcisaiz0y3qa8qb4n50kfz-cbonsai-1.4.2.drv' could not be realised
error: dependency '3j92sf3l7nwdn7y0x7fxy1pk16g76fhp-nixos-test-driver-packages.drv' failed
failed eval checks.x86_64-linux.syncthing-service —
error: … while evaluating the attribute 'drvPath' at «https://releases.nixos.org/nixos/26.05/nixos-26.05.11680.6fcc160353f6/nixexprs.tar.xz?narH …
error:
       … while evaluating the attribute 'drvPath'
         at «https://releases.nixos.org/nixos/26.05/nixos-26.05.11680.6fcc160353f6/nixexprs.tar.xz?narHash=sha256-tM6MAMxVwetta6uD2aMzoWQ9v5EAaLLmYumiE4jVZeg%3D»/lib/customisation.nix:427:7:
          426|     // {
          427|       drvPath =
             |       ^
          428|         assert condition;

       … while calling the 'derivationStrict' builtin
         at «nix-internal»/derivation-internal.nix:37:12:
           36|
           37|   strict = derivationStrict drvAttrs;
             |            ^
           38|

       … while evaluating the option `nodes.machine1.networking.interfaces':

       … while evaluating definitions from `/nix/store/k1vyrhach56zhxf4835z5whii9mdr485-source/nixos/modules/hardware/facter/networking':

       … while evaluating the option `nodes.machine1.hardware.facter.enable':

       … while evaluating the option `nodes.machine1.hardware.facter.report':

       … while evaluating the option `nodes.machine1.hardware.facter.reportPath':

       … while evaluating definitions from `/nix/store/49x637kiwh63f7fc071q93np9vil8j1k-source/nixosModules/clanCore/nixos-facter.nix':

       (stack trace truncated; use '--show-trace' to show the full, detailed trace)

       error: build of '/nix/store/s0ffyljja91iyibg12pivpxdj7ipj3lh-merged-test-dir-syncthing-service.drv^out' failed: error: gave up after 9 reschedules
failed eval checks.x86_64-linux.users —
error: … while evaluating the attribute 'drvPath' at «https://releases.nixos.org/nixos/26.05/nixos-26.05.11680.6fcc160353f6/nixexprs.tar.xz?narH …
error:
       … while evaluating the attribute 'drvPath'
         at «https://releases.nixos.org/nixos/26.05/nixos-26.05.11680.6fcc160353f6/nixexprs.tar.xz?narHash=sha256-tM6MAMxVwetta6uD2aMzoWQ9v5EAaLLmYumiE4jVZeg%3D»/lib/customisation.nix:427:7:
          426|     // {
          427|       drvPath =
             |       ^
          428|         assert condition;

       … while calling the 'derivationStrict' builtin
         at «nix-internal»/derivation-internal.nix:37:12:
           36|
           37|   strict = derivationStrict drvAttrs;
             |            ^
           38|

       … while evaluating the option `nodes.server.networking.interfaces':

       … while evaluating definitions from `/nix/store/k1vyrhach56zhxf4835z5whii9mdr485-source/nixos/modules/hardware/facter/networking':

       … while evaluating the option `nodes.server.hardware.facter.enable':

       … while evaluating the option `nodes.server.hardware.facter.report':

       … while evaluating the option `nodes.server.hardware.facter.reportPath':

       … while evaluating definitions from `/nix/store/49x637kiwh63f7fc071q93np9vil8j1k-source/nixosModules/clanCore/nixos-facter.nix':

       (stack trace truncated; use '--show-trace' to show the full, detailed trace)

       error: build of '/nix/store/wjj1csz796rsk9nfz1fb3ygmj54jqkb7-merged-test-dir-users.drv^out' failed: error: gave up after 9 reschedules
failed checks.x86_64-linux.wifi 1m 44s
setup: don't know how to build these paths: /nix/store/yxdshl0qihxh2kqg3x188kkn80n60569-vm-test-run-wifi.drv warning: ignoring the client-specified setting 's …
setup:
don't know how to build these paths:
  /nix/store/yxdshl0qihxh2kqg3x188kkn80n60569-vm-test-run-wifi.drv
warning: ignoring the client-specified setting 'store', because it is a restricted setting and you are not a trusted user
2fwdjyip7skb2wk8yamnx81p99s1l1fp-nixos-system-second-test.drv: error: gRPC AddMultipleToStore on 'nix-store.geninf.io:50051' failed: error: some references of path '/nix/store/b0ic3rbpvlmaf6q214qj2q8vbscbq83n-boot.json.drv' could not be realised
parbb11xiyz0pk81zfjjh729plx7c1zf-nixos-system-test-test.drv: error: gRPC AddMultipleToStore on 'nix-store.geninf.io:50051' failed: error: some references of path '/nix/store/97m1hb5fp7cp0dnjw271cirfbsvmss03-initrd-linux-6.18.55.drv' could not be realised
error: dependency 'aaisgys99i4dyklmjdyvfy73ld3vqgrg-nixos-test-driver-wifi.drv' failed
failed eval checks.x86_64-linux.wireguard —
error: … while evaluating the attribute 'drvPath' at «https://releases.nixos.org/nixos/26.05/nixos-26.05.11680.6fcc160353f6/nixexprs.tar.xz?narH …
error:
       … while evaluating the attribute 'drvPath'
         at «https://releases.nixos.org/nixos/26.05/nixos-26.05.11680.6fcc160353f6/nixexprs.tar.xz?narHash=sha256-tM6MAMxVwetta6uD2aMzoWQ9v5EAaLLmYumiE4jVZeg%3D»/lib/customisation.nix:427:7:
          426|     // {
          427|       drvPath =
             |       ^
          428|         assert condition;

       … while calling the 'derivationStrict' builtin
         at «nix-internal»/derivation-internal.nix:37:12:
           36|
           37|   strict = derivationStrict drvAttrs;
             |            ^
           38|

       … while evaluating the option `nodes.controller1.networking.interfaces':

       … while evaluating definitions from `/nix/store/k1vyrhach56zhxf4835z5whii9mdr485-source/nixos/modules/hardware/facter/networking':

       … while evaluating the option `nodes.controller1.hardware.facter.enable':

       … while evaluating the option `nodes.controller1.hardware.facter.report':

       … while evaluating the option `nodes.controller1.hardware.facter.reportPath':

       … while evaluating definitions from `/nix/store/49x637kiwh63f7fc071q93np9vil8j1k-source/nixosModules/clanCore/nixos-facter.nix':

       (stack trace truncated; use '--show-trace' to show the full, detailed trace)

       error: build of '/nix/store/bqv8zsy58v6f6jyz0lmdjxq33jvbjfwi-merged-test-dir-wireguard.drv^out' failed: error: gave up after 9 reschedules
63 succeeded
succeeded attributes
status attribute duration
loading…
20 already built
skipped attributes
status attribute duration
loading…