clan/clan-core build #983 failed ← #982 #984 →
eval warnings
2 kinds
· 4 occurrences
- warn 'targetPlatform' has been renamed to/replaced by 'stdenv.targetPlatform' ×2
- warn stdenv.isDarwin is deprecated, use stdenv.hostPlatform.isDarwin instead ×2
5 failed
| status | attribute | duration |
|---|---|---|
checks.aarch64-darwin.clan-pytest-without-core
|
11s | |
clan-pytest-without-core: 0.16s call clan_lib/nix/tests/test_nix_invocations.py::test_resolve_package_returns_resolved_package 0.16s call clan_lib/nix/t …clan-pytest-without-core: 0.16s call clan_lib/nix/tests/test_nix_invocations.py::test_resolve_package_returns_resolved_package 0.16s call clan_lib/nix/tests/test_nix_invocations.py::test_resolve_package_detects_broken_symlink 0.16s call clan_lib/nix/tests/test_nix_invocations.py::test_resolve_multi_package_cache_hit_skips_gcroot_creation 0.15s call clan_cli/tests/test_git.py::test_clan_flake_in_subdir 0.13s call clan_cli/tests/test_ssh_local.py::test_timeout =========================== short test summary info ============================ FAILED clan_cli/machines/build_test.py::test_build_machine_skips_injection_for_format_without_add_files_script - AssertionError: assert PosixPath('/nix/var/nix/builds/nix-11344-1347498755/... ================== 1 failed, 350 passed, 15 skipped in 1.91s =================== |
||
checks.aarch64-linux.clan-pytest-with-core
|
9m 42s | |
clan-pytest-with-core: ++ local hookName=failureHook ++ declare -F failureHook ++ type -p failureHook ++ '[' -n '' ']' ++ return 0 + return 0 + '[' -n '' ']' + …clan-pytest-with-core: ++ local hookName=failureHook ++ declare -F failureHook ++ type -p failureHook ++ '[' -n '' ']' ++ return 0 + return 0 + '[' -n '' ']' + return 1 |
||
checks.aarch64-linux.clan-pytest-without-core
|
15s | |
clan-pytest-without-core: 0.56s setup clan_lib/ssh/remote_test.py::test_run_exception 0.44s setup clan_lib/ssh/remote_test.py::test_run 0.27s setup cla …clan-pytest-without-core: 0.56s setup clan_lib/ssh/remote_test.py::test_run_exception 0.44s setup clan_lib/ssh/remote_test.py::test_run 0.27s setup clan_lib/ssh/remote_test.py::test_run_no_shell 0.26s setup clan_lib/ssh/remote_test.py::test_run_environment 0.26s setup clan_lib/ssh/remote_test.py::test_timeout =========================== short test summary info ============================ FAILED clan_cli/machines/build_test.py::test_build_machine_skips_injection_for_format_without_add_files_script - AssertionError: assert PosixPath('/build/store/build/pytest-of-nixbld/pytes... =================== 1 failed, 382 passed, 1 skipped in 4.98s =================== |
||
checks.x86_64-linux.clan-pytest-with-core
|
6m 58s | |
clan-pytest-with-core: ++ local hookName=failureHook ++ declare -F failureHook ++ type -p failureHook ++ '[' -n '' ']' ++ return 0 + return 0 + '[' -n '' ']' + …clan-pytest-with-core: ++ local hookName=failureHook ++ declare -F failureHook ++ type -p failureHook ++ '[' -n '' ']' ++ return 0 + return 0 + '[' -n '' ']' + return 1 |
||
checks.x86_64-linux.clan-pytest-without-core
|
38s | |
clan-pytest-without-core: 0.39s setup clan_lib/ssh/remote_test.py::test_run_exception 0.28s setup clan_lib/ssh/remote_test.py::test_run 0.22s setup cla …clan-pytest-without-core: 0.39s setup clan_lib/ssh/remote_test.py::test_run_exception 0.28s setup clan_lib/ssh/remote_test.py::test_run 0.22s setup clan_lib/ssh/remote_test.py::test_run_function 0.22s setup clan_lib/ssh/remote_test.py::test_run_function_exception 0.22s setup clan_lib/ssh/remote_test.py::test_run_environment =========================== short test summary info ============================ FAILED clan_cli/machines/build_test.py::test_build_machine_skips_injection_for_format_without_add_files_script - AssertionError: assert PosixPath('/build/store/build/pytest-of-nixbld/pytes... =================== 1 failed, 382 passed, 1 skipped in 2.88s =================== |
||
36 succeeded ⚠ 4
111 already built
| status | attribute | duration |
|---|---|---|
| loading… | ||