nixbot

builds

clan/clan-core build #985 cancelled

branch main · PR #7767 · commit 61bf39e602 · · took 35s

eval warnings 1 kind · 1 occurrence
  • warn stdenv.isDarwin is deprecated, use stdenv.hostPlatform.isDarwin instead ×1

2 failed
failed attributes
status attribute duration
failed checks.aarch64-darwin.clan-pytest-without-core 10s
clan-pytest-without-core: 0.35s call clan_cli/tests/test_api_dataclass_compat.py::test_all_dataclasses 0.33s call clan_cli/vars/cp_test.py::test_cp_comm …
clan-pytest-without-core:
0.35s call     clan_cli/tests/test_api_dataclass_compat.py::test_all_dataclasses
0.33s call     clan_cli/vars/cp_test.py::test_cp_command_no_flake
0.32s call     clan_cli/vars/upload_test.py::test_upload_command_no_flake
0.23s call     clan_cli/vars/check_test.py::test_check_command_no_flake
0.22s call     clan_cli/tests/test_ssh_local.py::test_timeout
=========================== short test summary info ============================
FAILED clan_cli/machines/update_test.py::test_flake_store_path_falls_back_to_prefetch - AssertionError: assert '/nix/var/nix...2325008/store' == '/some/flake'
================== 1 failed, 350 passed, 15 skipped in 3.33s ===================
failed checks.aarch64-linux.clan-pytest-without-core 12s
clan-pytest-without-core: 0.57s setup clan_lib/ssh/remote_test.py::test_run_exception 0.46s setup clan_lib/ssh/remote_test.py::test_run 0.26s setup cla …
clan-pytest-without-core:
0.57s setup    clan_lib/ssh/remote_test.py::test_run_exception
0.46s setup    clan_lib/ssh/remote_test.py::test_run
0.26s setup    clan_lib/ssh/remote_test.py::test_timeout
0.25s setup    clan_lib/ssh/remote_test.py::test_run_environment
0.22s call     clan_cli/tests/test_api_dataclass_compat.py::test_all_dataclasses
=========================== short test summary info ============================
FAILED clan_cli/machines/update_test.py::test_flake_store_path_falls_back_to_prefetch - AssertionError: assert '/build/store' == '/some/flake'
=================== 1 failed, 382 passed, 1 skipped in 4.78s ===================
14 cancelled ⚠ 1
cancelled attributes
status attribute duration
cancelled checks.aarch64-linux.all-packages
  • stdenv.isDarwin is deprecated, use stdenv.hostPlatform.isDarwin instead
23s
cancelled checks.aarch64-darwin.all-packages 23s
cancelled checks.aarch64-darwin.clan-pytest-with-core 27s
cancelled checks.aarch64-darwin.devShell-clan-site 23s
cancelled checks.aarch64-darwin.eval-tests 27s
cancelled checks.aarch64-linux.borgbackup 3s
cancelled checks.aarch64-linux.clan-pytest-with-core 23s
cancelled checks.aarch64-linux.clan-site-lint 23s
cancelled checks.aarch64-linux.clan-test-iso 8s
cancelled checks.aarch64-linux.devShell-clan-site 23s
cancelled checks.aarch64-linux.devShell-docs 23s
cancelled checks.aarch64-linux.nixos-documentation 8s
cancelled checks.aarch64-linux.service-dummy-test-from-flake 3s
cancelled checks.aarch64-linux.treefmt 3s
4 succeeded
succeeded attributes
status attribute duration
loading…
49 already built
skipped attributes
status attribute duration
loading…