clan/clan-website build #25 failed ← #24 #26 →
eval warnings
2 kinds
· 10 occurrences
- error ×5
- error Nixpkgs 26.11 has dropped support for x86_64-darwin. ×5
14 failed
| status | attribute | duration |
|---|---|---|
checks.aarch64-darwin.devShell-default
|
2m 2s | |
setup: warning: ignoring the client-specified setting 'store', because it is a restricted setting and you are not a trusted user warning: h8mcm1n2xh5bz0mimpg65a …setup: warning: ignoring the client-specified setting 'store', because it is a restricted setting and you are not a trusted user warning: h8mcm1n2xh5bz0mimpg65a2vji2wrwpr-node-modules-hook.sh.drv: no connected, non-draining worker for system 'aarch64-darwin' offers features {}, the workers offer {}, waiting up to 120s for a worker warning: hg8qbqcfsnkwpnmvylh8jpgf89jg0vq0-npm-config-hook.drv: no connected, non-draining worker for system 'aarch64-darwin' offers features {}, the workers offer {}, waiting up to 120s for a worker warning: i5ylv4m2z8dhvsq7bg66lwvzwkpphk1g-website-1.0.0-sources.drv: no connected, non-draining worker for system 'aarch64-darwin' offers features {}, the workers offer {}, waiting up to 120s for a worker h8mcm1n2xh5bz0mimpg65a2vji2wrwpr-node-modules-hook.sh.drv: no connected, non-draining worker for system 'aarch64-darwin' offers features {}, the workers offer {} hg8qbqcfsnkwpnmvylh8jpgf89jg0vq0-npm-config-hook.drv: no connected, non-draining worker for system 'aarch64-darwin' offers features {}, the workers offer {} i5ylv4m2z8dhvsq7bg66lwvzwkpphk1g-website-1.0.0-sources.drv: no connected, non-draining worker for system 'aarch64-darwin' offers features {}, the workers offer {} error: dependency 'h8mcm1n2xh5bz0mimpg65a2vji2wrwpr-node-modules-hook.sh.drv' failed |
||
checks.aarch64-darwin.package-default
|
2m 6s | |
setup: don't know how to build these paths: /nix/store/kf21k28jrzqc8m5c38n3040z8addqw9f-website.drv warning: ignoring the client-specified setting 'store', be …setup: don't know how to build these paths: /nix/store/kf21k28jrzqc8m5c38n3040z8addqw9f-website.drv warning: ignoring the client-specified setting 'store', because it is a restricted setting and you are not a trusted user warning: hg8qbqcfsnkwpnmvylh8jpgf89jg0vq0-npm-config-hook.drv: no connected, non-draining worker for system 'aarch64-darwin' offers features {}, the workers offer {}, waiting up to 120s for a worker warning: i5ylv4m2z8dhvsq7bg66lwvzwkpphk1g-website-1.0.0-sources.drv: no connected, non-draining worker for system 'aarch64-darwin' offers features {}, the workers offer {}, waiting up to 120s for a worker hg8qbqcfsnkwpnmvylh8jpgf89jg0vq0-npm-config-hook.drv: no connected, non-draining worker for system 'aarch64-darwin' offers features {}, the workers offer {} i5ylv4m2z8dhvsq7bg66lwvzwkpphk1g-website-1.0.0-sources.drv: no connected, non-draining worker for system 'aarch64-darwin' offers features {}, the workers offer {} error: dependency 'hg8qbqcfsnkwpnmvylh8jpgf89jg0vq0-npm-config-hook.drv' failed |
||
checks.aarch64-darwin.package-dev
|
2m 1s | |
setup: don't know how to build these paths: /nix/store/w3ibkz9vp2a9al6mbd4ippnbwcd5vm3w-dev.drv warning: ignoring the client-specified setting 'store', becaus …setup: don't know how to build these paths: /nix/store/w3ibkz9vp2a9al6mbd4ippnbwcd5vm3w-dev.drv warning: ignoring the client-specified setting 'store', because it is a restricted setting and you are not a trusted user warning: 0j42m1n3bhjbn89parbpl0clw9csm9my-process-compose-dev.json.drv: no connected, non-draining worker for system 'aarch64-darwin' offers features {}, the workers offer {}, waiting up to 120s for a worker 0j42m1n3bhjbn89parbpl0clw9csm9my-process-compose-dev.json.drv: no connected, non-draining worker for system 'aarch64-darwin' offers features {}, the workers offer {} error: dependency '0j42m1n3bhjbn89parbpl0clw9csm9my-process-compose-dev.json.drv' failed |
||
checks.aarch64-darwin.package-website
|
2m 1s | |
setup: don't know how to build these paths: /nix/store/kf21k28jrzqc8m5c38n3040z8addqw9f-website.drv warning: ignoring the client-specified setting 'store', be …setup: don't know how to build these paths: /nix/store/kf21k28jrzqc8m5c38n3040z8addqw9f-website.drv warning: ignoring the client-specified setting 'store', because it is a restricted setting and you are not a trusted user warning: hg8qbqcfsnkwpnmvylh8jpgf89jg0vq0-npm-config-hook.drv: no connected, non-draining worker for system 'aarch64-darwin' offers features {}, the workers offer {}, waiting up to 120s for a worker warning: i5ylv4m2z8dhvsq7bg66lwvzwkpphk1g-website-1.0.0-sources.drv: no connected, non-draining worker for system 'aarch64-darwin' offers features {}, the workers offer {}, waiting up to 120s for a worker hg8qbqcfsnkwpnmvylh8jpgf89jg0vq0-npm-config-hook.drv: no connected, non-draining worker for system 'aarch64-darwin' offers features {}, the workers offer {} i5ylv4m2z8dhvsq7bg66lwvzwkpphk1g-website-1.0.0-sources.drv: no connected, non-draining worker for system 'aarch64-darwin' offers features {}, the workers offer {} error: dependency 'hg8qbqcfsnkwpnmvylh8jpgf89jg0vq0-npm-config-hook.drv' failed |
||
checks.aarch64-darwin.treefmt
|
2m 5s | |
setup: don't know how to build these paths: /nix/store/xrvpqp9vkm151nhqk307bg7dkldvlf2j-treefmt-check.drv warning: ignoring the client-specified setting 'stor …setup: don't know how to build these paths: /nix/store/xrvpqp9vkm151nhqk307bg7dkldvlf2j-treefmt-check.drv warning: ignoring the client-specified setting 'store', because it is a restricted setting and you are not a trusted user warning: pfbnlxvpmnhjcz5y77f61jpmi1ng6gik-treefmt.toml.drv: no connected, non-draining worker for system 'aarch64-darwin' offers features {}, the workers offer {}, waiting up to 120s for a worker pfbnlxvpmnhjcz5y77f61jpmi1ng6gik-treefmt.toml.drv: no connected, non-draining worker for system 'aarch64-darwin' offers features {}, the workers offer {} error: dependency 'lms93wzagnx4san7fxl4xqbdvw9f5gvk-treefmt.drv' failed |
||
checks.aarch64-linux.devShell-default
|
15s | |
setup: don't know how to build these paths: /nix/store/sxfmb7snb6anmylm2hks1fq5jlmpqsyr-nix-shell.drv warning: ignoring the client-specified setting 'store', …setup: don't know how to build these paths: /nix/store/sxfmb7snb6anmylm2hks1fq5jlmpqsyr-nix-shell.drv warning: ignoring the client-specified setting 'store', because it is a restricted setting and you are not a trusted user h03w7a8i1gc3gyh4z69vhiiwkvs9hk0a-node-modules-hook.sh.drv: error: gRPC AddMultipleToStore on 'nix-store.geninf.io:50051' failed: error: path '/nix/store/4pfaf1vijsqqgs5l2l9fxjn2jp5l2s9k-link-node-modules.js' is required, but there is no substituter that can build it error: dependency 'h03w7a8i1gc3gyh4z69vhiiwkvs9hk0a-node-modules-hook.sh.drv' failed |
||
checks.aarch64-linux.package-default
|
25s | |
setup: don't know how to build these paths: /nix/store/yl9w275v0asyv0ymvajy3gjblz78ndhc-website.drv warning: ignoring the client-specified setting 'store', be …setup: don't know how to build these paths: /nix/store/yl9w275v0asyv0ymvajy3gjblz78ndhc-website.drv warning: ignoring the client-specified setting 'store', because it is a restricted setting and you are not a trusted user 2yw0zsj8qimc658w82cjwhccg2lfq8rw-website-1.0.0-sources.drv: build01: not scheduled here: 2yw0zsj8qimc658w82cjwhccg2lfq8rw-website-1.0.0-sources.drv, asking the scheduler again yl9w275v0asyv0ymvajy3gjblz78ndhc-website.drv: error: gRPC AddMultipleToStore on 'nix-store.geninf.io:50051' failed: error: a concurrent upload of '/nix/store/yl9w275v0asyv0ymvajy3gjblz78ndhc-website.drv' failed error: error: gRPC AddMultipleToStore on 'nix-store.geninf.io:50051' failed: error: a concurrent upload of '/nix/store/yl9w275v0asyv0ymvajy3gjblz78ndhc-website.drv' failed |
||
checks.aarch64-linux.package-website
|
26s | |
setup: don't know how to build these paths: /nix/store/yl9w275v0asyv0ymvajy3gjblz78ndhc-website.drv warning: ignoring the client-specified setting 'store', be …setup: don't know how to build these paths: /nix/store/yl9w275v0asyv0ymvajy3gjblz78ndhc-website.drv warning: ignoring the client-specified setting 'store', because it is a restricted setting and you are not a trusted user yl9w275v0asyv0ymvajy3gjblz78ndhc-website.drv: error: gRPC AddMultipleToStore on 'nix-store.geninf.io:50051' failed: error: some references of path '/nix/store/9wnwpadrib9k7a7n7bfalk1rqqlzhhca-hugo-0.152.2.drv' could not be realised error: error: gRPC AddMultipleToStore on 'nix-store.geninf.io:50051' failed: error: some references of path '/nix/store/9wnwpadrib9k7a7n7bfalk1rqqlzhhca-hugo-0.152.2.drv' could not be realised |
||
checks.x86_64-darwin.devShell-default
|
— | |
error: … while evaluating a branch condition at «string»:25:5: 24| v: 25| if !builtins.isAttrs v || isDrv v then …error:
… while evaluating a branch condition
at «string»:25:5:
24| v:
25| if !builtins.isAttrs v || isDrv v then
| ^
26| v
… in the left operand of the OR (||) operator
at «string»:25:28:
24| v:
25| if !builtins.isAttrs v || isDrv v then
| ^
26| v
… while evaluating definitions from `/nix/store/6xr58mfvs42ixw6428x3vm9l5h88l2z7-source/modules/transposition.nix':
… while evaluating definitions from `/nix/store/2l0n16pjqix45h3pf7rn68gsvkdpd3np-source/flake.nix, via option perSystem':
… while evaluating definitions from `/nix/store/6xr58mfvs42ixw6428x3vm9l5h88l2z7-source/modules/transposition.nix':
… while evaluating definitions from `/nix/store/2l0n16pjqix45h3pf7rn68gsvkdpd3np-source/nix/devShells/flake-module.nix, via option perSystem':
… while evaluating the module argument `pkgs' in ":anon-14:anon-1":
… noting that argument `pkgs` is not externally provided, so querying `_module.args` instead, requiring `config`
… while evaluating definitions from `/nix/store/2l0n16pjqix45h3pf7rn68gsvkdpd3np-source/flake.nix, via option perSystem':
(stack trace truncated; use '--show-trace' to show the full, detailed trace)
error: Nixpkgs 26.11 has dropped support for x86_64-darwin.
The 26.05 stable branch still supports x86_64-darwin, and will
receive security fixes until the end of 2026. If you use channels,
you can switch to 26.05 as follows:
$ sudo nix-channel --add https://nixos.org/channels/nixpkgs-26.05-darwin nixpkgs
$ sudo nix-channel --update
If this doesn’t work, you may need to run:
# Lack of sudo is deliberate:
$ nix-channel --remove nixpkgs
If you use flakes, switch your flake input:
inputs.nixpkgs = {
url = "github:NixOS/nixpkgs/nixpkgs-26.05-darwin";
};
See the release notes for more information and alternatives:
https://nixos.org/manual/nixpkgs/unstable/release-notes#x86_64-darwin-26.11
|
||
checks.x86_64-darwin.package-default
|
— | |
error: … while evaluating a branch condition at «string»:25:5: 24| v: 25| if !builtins.isAttrs v || isDrv v then …error:
… while evaluating a branch condition
at «string»:25:5:
24| v:
25| if !builtins.isAttrs v || isDrv v then
| ^
26| v
… in the left operand of the OR (||) operator
at «string»:25:28:
24| v:
25| if !builtins.isAttrs v || isDrv v then
| ^
26| v
… while evaluating definitions from `/nix/store/6xr58mfvs42ixw6428x3vm9l5h88l2z7-source/modules/transposition.nix':
… while evaluating definitions from `/nix/store/2l0n16pjqix45h3pf7rn68gsvkdpd3np-source/flake.nix, via option perSystem':
… while evaluating definitions from `/nix/store/6xr58mfvs42ixw6428x3vm9l5h88l2z7-source/modules/transposition.nix':
… while evaluating definitions from `/nix/store/2l0n16pjqix45h3pf7rn68gsvkdpd3np-source/nix/packages/flake-module.nix, via option perSystem':
… while evaluating definitions from `/nix/store/6xr58mfvs42ixw6428x3vm9l5h88l2z7-source/modules/transposition.nix':
… while evaluating definitions from `/nix/store/2l0n16pjqix45h3pf7rn68gsvkdpd3np-source/nix/packages/flake-module.nix, via option perSystem':
… while evaluating the module argument `pkgs' in ":anon-13:anon-1":
… noting that argument `pkgs` is not externally provided, so querying `_module.args` instead, requiring `config`
… while evaluating definitions from `/nix/store/2l0n16pjqix45h3pf7rn68gsvkdpd3np-source/flake.nix, via option perSystem':
(stack trace truncated; use '--show-trace' to show the full, detailed trace)
error: Nixpkgs 26.11 has dropped support for x86_64-darwin.
The 26.05 stable branch still supports x86_64-darwin, and will
receive security fixes until the end of 2026. If you use channels,
you can switch to 26.05 as follows:
$ sudo nix-channel --add https://nixos.org/channels/nixpkgs-26.05-darwin nixpkgs
$ sudo nix-channel --update
If this doesn’t work, you may need to run:
# Lack of sudo is deliberate:
$ nix-channel --remove nixpkgs
If you use flakes, switch your flake input:
inputs.nixpkgs = {
url = "github:NixOS/nixpkgs/nixpkgs-26.05-darwin";
};
See the release notes for more information and alternatives:
https://nixos.org/manual/nixpkgs/unstable/release-notes#x86_64-darwin-26.11
|
||
checks.x86_64-darwin.package-dev
|
— | |
error: … while evaluating a branch condition at «string»:25:5: 24| v: 25| if !builtins.isAttrs v || isDrv v then …error:
… while evaluating a branch condition
at «string»:25:5:
24| v:
25| if !builtins.isAttrs v || isDrv v then
| ^
26| v
… in the left operand of the OR (||) operator
at «string»:25:28:
24| v:
25| if !builtins.isAttrs v || isDrv v then
| ^
26| v
… while evaluating definitions from `/nix/store/6xr58mfvs42ixw6428x3vm9l5h88l2z7-source/modules/transposition.nix':
… while evaluating definitions from `/nix/store/2l0n16pjqix45h3pf7rn68gsvkdpd3np-source/flake.nix, via option perSystem':
… while evaluating definitions from `/nix/store/6xr58mfvs42ixw6428x3vm9l5h88l2z7-source/modules/transposition.nix':
… while evaluating definitions from `/nix/store/18kqjlbmkk4a44r0hqa7x3d5h4yhmv1w-source/nix/flake-module.nix':
… while evaluating the option `perSystem.x86_64-darwin.process-compose.dev.outputs.package':
… while evaluating definitions from `/nix/store/18kqjlbmkk4a44r0hqa7x3d5h4yhmv1w-source/nix/process-compose':
… while evaluating the module argument `pkgs' in "/nix/store/18kqjlbmkk4a44r0hqa7x3d5h4yhmv1w-source/nix/process-compose":
… while evaluating the module argument `pkgs' in ":anon-11:anon-1":
… noting that argument `pkgs` is not externally provided, so querying `_module.args` instead, requiring `config`
… while evaluating definitions from `/nix/store/2l0n16pjqix45h3pf7rn68gsvkdpd3np-source/flake.nix, via option perSystem':
(stack trace truncated; use '--show-trace' to show the full, detailed trace)
error: Nixpkgs 26.11 has dropped support for x86_64-darwin.
The 26.05 stable branch still supports x86_64-darwin, and will
receive security fixes until the end of 2026. If you use channels,
you can switch to 26.05 as follows:
$ sudo nix-channel --add https://nixos.org/channels/nixpkgs-26.05-darwin nixpkgs
$ sudo nix-channel --update
If this doesn’t work, you may need to run:
# Lack of sudo is deliberate:
$ nix-channel --remove nixpkgs
If you use flakes, switch your flake input:
inputs.nixpkgs = {
url = "github:NixOS/nixpkgs/nixpkgs-26.05-darwin";
};
See the release notes for more information and alternatives:
https://nixos.org/manual/nixpkgs/unstable/release-notes#x86_64-darwin-26.11
|
||
checks.x86_64-darwin.package-website
|
— | |
error: … while evaluating a branch condition at «string»:25:5: 24| v: 25| if !builtins.isAttrs v || isDrv v then …error:
… while evaluating a branch condition
at «string»:25:5:
24| v:
25| if !builtins.isAttrs v || isDrv v then
| ^
26| v
… in the left operand of the OR (||) operator
at «string»:25:28:
24| v:
25| if !builtins.isAttrs v || isDrv v then
| ^
26| v
… while evaluating definitions from `/nix/store/6xr58mfvs42ixw6428x3vm9l5h88l2z7-source/modules/transposition.nix':
… while evaluating definitions from `/nix/store/2l0n16pjqix45h3pf7rn68gsvkdpd3np-source/flake.nix, via option perSystem':
… while evaluating definitions from `/nix/store/6xr58mfvs42ixw6428x3vm9l5h88l2z7-source/modules/transposition.nix':
… while evaluating definitions from `/nix/store/2l0n16pjqix45h3pf7rn68gsvkdpd3np-source/nix/packages/flake-module.nix, via option perSystem':
… while evaluating the module argument `pkgs' in ":anon-13:anon-1":
… noting that argument `pkgs` is not externally provided, so querying `_module.args` instead, requiring `config`
… while evaluating definitions from `/nix/store/2l0n16pjqix45h3pf7rn68gsvkdpd3np-source/flake.nix, via option perSystem':
(stack trace truncated; use '--show-trace' to show the full, detailed trace)
error: Nixpkgs 26.11 has dropped support for x86_64-darwin.
The 26.05 stable branch still supports x86_64-darwin, and will
receive security fixes until the end of 2026. If you use channels,
you can switch to 26.05 as follows:
$ sudo nix-channel --add https://nixos.org/channels/nixpkgs-26.05-darwin nixpkgs
$ sudo nix-channel --update
If this doesn’t work, you may need to run:
# Lack of sudo is deliberate:
$ nix-channel --remove nixpkgs
If you use flakes, switch your flake input:
inputs.nixpkgs = {
url = "github:NixOS/nixpkgs/nixpkgs-26.05-darwin";
};
See the release notes for more information and alternatives:
https://nixos.org/manual/nixpkgs/unstable/release-notes#x86_64-darwin-26.11
|
||
checks.x86_64-darwin.treefmt
|
— | |
error: … while evaluating a branch condition at «string»:25:5: 24| v: 25| if !builtins.isAttrs v || isDrv v then …error:
… while evaluating a branch condition
at «string»:25:5:
24| v:
25| if !builtins.isAttrs v || isDrv v then
| ^
26| v
… in the left operand of the OR (||) operator
at «string»:25:28:
24| v:
25| if !builtins.isAttrs v || isDrv v then
| ^
26| v
… while evaluating definitions from `/nix/store/6xr58mfvs42ixw6428x3vm9l5h88l2z7-source/modules/transposition.nix':
… while evaluating definitions from `/nix/store/7sjy8935654h3220n5gbaclf5nfw4nzx-source/flake-module.nix':
… while evaluating definitions from `/nix/store/7sjy8935654h3220n5gbaclf5nfw4nzx-source/module-options.nix':
… while evaluating the module argument `pkgs' in "/nix/store/7sjy8935654h3220n5gbaclf5nfw4nzx-source/module-options.nix":
… noting that argument `pkgs` is not externally provided, so querying `_module.args` instead, requiring `config`
… while evaluating definitions from `/nix/store/7sjy8935654h3220n5gbaclf5nfw4nzx-source/flake-module.nix':
… while evaluating the option `perSystem.x86_64-darwin.treefmt.pkgs':
… while evaluating the module argument `pkgs' in ":anon-10:anon-1":
… noting that argument `pkgs` is not externally provided, so querying `_module.args` instead, requiring `config`
… while evaluating definitions from `/nix/store/2l0n16pjqix45h3pf7rn68gsvkdpd3np-source/flake.nix, via option perSystem':
(stack trace truncated; use '--show-trace' to show the full, detailed trace)
error: Nixpkgs 26.11 has dropped support for x86_64-darwin.
The 26.05 stable branch still supports x86_64-darwin, and will
receive security fixes until the end of 2026. If you use channels,
you can switch to 26.05 as follows:
$ sudo nix-channel --add https://nixos.org/channels/nixpkgs-26.05-darwin nixpkgs
$ sudo nix-channel --update
If this doesn’t work, you may need to run:
# Lack of sudo is deliberate:
$ nix-channel --remove nixpkgs
If you use flakes, switch your flake input:
inputs.nixpkgs = {
url = "github:NixOS/nixpkgs/nixpkgs-26.05-darwin";
};
See the release notes for more information and alternatives:
https://nixos.org/manual/nixpkgs/unstable/release-notes#x86_64-darwin-26.11
|
||
checks.x86_64-linux.devShell-default
|
10s | |
setup: don't know how to build these paths: /nix/store/490b9xgv5snq38fsj462hbms6hji19nq-nix-shell.drv warning: ignoring the client-specified setting 'store', …setup: don't know how to build these paths: /nix/store/490b9xgv5snq38fsj462hbms6hji19nq-nix-shell.drv warning: ignoring the client-specified setting 'store', because it is a restricted setting and you are not a trusted user kfmdjm0q2bk0i04zvqhknlndxwlx5azx-node-modules-hook.sh.drv: error: gRPC BuildDerivation on 'nix-store.geninf.io:50051' failed: build-x86-01: missing: /nix/store/kfmdjm0q2bk0i04zvqhknlndxwlx5azx-node-modules-hook.sh.drv error: dependency 'kfmdjm0q2bk0i04zvqhknlndxwlx5azx-node-modules-hook.sh.drv' failed |
||
6 succeeded
| status | attribute | duration |
|---|---|---|
| loading… | ||