nixbot

builds

clan/clan-website build #27 failed

branch main · PR #337 · commit 741055fa69 · · took 2m 15s · eval 10s

eval warnings 1 kind · 5 occurrences
  • warn Nixpkgs 26.05 will be the last release to support x86_64-darwin; see https://nixos.org/… ×5

8 failed
failed attributes
status attribute duration
failed checks.aarch64-darwin.package-default 2m 3s
setup: /nix/store/rlgk7f4spf3jjc419pyg6j7nhirgb776-lndir-1.0.5 /nix/store/2di2pwl630hsjlhn517wj4wz6sniwm1m-stdenv-darwin warning: ignoring the client-specif …
setup:
  /nix/store/rlgk7f4spf3jjc419pyg6j7nhirgb776-lndir-1.0.5
  /nix/store/2di2pwl630hsjlhn517wj4wz6sniwm1m-stdenv-darwin
warning: ignoring the client-specified setting 'store', because it is a restricted setting and you are not a trusted user
warning: gny0qs3v8xd49811mwjfw2wlrc9sbir9-npm-config-hook.drv: no connected, non-draining worker for system 'aarch64-darwin' offers features {}, the workers offer {}, waiting up to 120s for a worker
warning: pf52pi18x05ydlk58m3c1b16d9cccjf1-website-1.0.0-sources.drv: no connected, non-draining worker for system 'aarch64-darwin' offers features {}, the workers offer {}, waiting up to 120s for a worker
gny0qs3v8xd49811mwjfw2wlrc9sbir9-npm-config-hook.drv: no connected, non-draining worker for system 'aarch64-darwin' offers features {}, the workers offer {}
pf52pi18x05ydlk58m3c1b16d9cccjf1-website-1.0.0-sources.drv: no connected, non-draining worker for system 'aarch64-darwin' offers features {}, the workers offer {}
error: dependency 'gny0qs3v8xd49811mwjfw2wlrc9sbir9-npm-config-hook.drv' failed
failed checks.aarch64-darwin.package-website 2m 2s
setup: don't know how to build these paths: /nix/store/kp5fisfdlpaxx58z6xdb7rgr36fvdda9-website.drv warning: ignoring the client-specified setting 'store', be …
setup:
don't know how to build these paths:
  /nix/store/kp5fisfdlpaxx58z6xdb7rgr36fvdda9-website.drv
warning: ignoring the client-specified setting 'store', because it is a restricted setting and you are not a trusted user
warning: gny0qs3v8xd49811mwjfw2wlrc9sbir9-npm-config-hook.drv: no connected, non-draining worker for system 'aarch64-darwin' offers features {}, the workers offer {}, waiting up to 120s for a worker
warning: pf52pi18x05ydlk58m3c1b16d9cccjf1-website-1.0.0-sources.drv: no connected, non-draining worker for system 'aarch64-darwin' offers features {}, the workers offer {}, waiting up to 120s for a worker
gny0qs3v8xd49811mwjfw2wlrc9sbir9-npm-config-hook.drv: no connected, non-draining worker for system 'aarch64-darwin' offers features {}, the workers offer {}
pf52pi18x05ydlk58m3c1b16d9cccjf1-website-1.0.0-sources.drv: no connected, non-draining worker for system 'aarch64-darwin' offers features {}, the workers offer {}
error: dependency 'gny0qs3v8xd49811mwjfw2wlrc9sbir9-npm-config-hook.drv' failed
failed checks.aarch64-darwin.treefmt 2m 2s
setup: don't know how to build these paths: /nix/store/qy0bshf25nsfrhbmxwyzpd8frd81py1l-treefmt-check.drv warning: ignoring the client-specified setting 'stor …
setup:
don't know how to build these paths:
  /nix/store/qy0bshf25nsfrhbmxwyzpd8frd81py1l-treefmt-check.drv
warning: ignoring the client-specified setting 'store', because it is a restricted setting and you are not a trusted user
warning: wsa5z7byb54l2xqmk5fzqkpmxh5ch0qb-treefmt.toml.drv: no connected, non-draining worker for system 'aarch64-darwin' offers features {}, the workers offer {}, waiting up to 120s for a worker
wsa5z7byb54l2xqmk5fzqkpmxh5ch0qb-treefmt.toml.drv: no connected, non-draining worker for system 'aarch64-darwin' offers features {}, the workers offer {}
error: dependency 'gc5hnmdzjhiqccg1b01wc9jmik5sbfw6-treefmt.drv' failed
failed checks.aarch64-linux.devShell-default 17s
setup: don't know how to build these paths: /nix/store/6njkklmafk00qyv900bv3v8bpg3xzfk3-nix-shell.drv warning: ignoring the client-specified setting 'store', …
setup:
don't know how to build these paths:
  /nix/store/6njkklmafk00qyv900bv3v8bpg3xzfk3-nix-shell.drv
warning: ignoring the client-specified setting 'store', because it is a restricted setting and you are not a trusted user
92r4fb3y2fh30y6qvi7iwa4q4dnvaniq-node-modules-hook.sh.drv: error: gRPC AddMultipleToStore on 'nix-store.geninf.io:50051' failed: error: path '/nix/store/9k8hv9q70ppbhhsiqcapixb61hqrm5fh-link-node-modules-hook.sh' is required, but there is no substituter that can build it
error: dependency '92r4fb3y2fh30y6qvi7iwa4q4dnvaniq-node-modules-hook.sh.drv' failed
failed checks.aarch64-linux.package-default 15s
setup: /nix/store/65yr9amcpgps44q8hhm4zgw4kjjzvh2f-libmpc-1.4.0 /nix/store/xir9zqp1bd4njvmvgklkrrsa5az3ajbw-lndir-1.0.5 /nix/store/6cir3r3pl77an8kszay8vkf …
setup:
  /nix/store/65yr9amcpgps44q8hhm4zgw4kjjzvh2f-libmpc-1.4.0
  /nix/store/xir9zqp1bd4njvmvgklkrrsa5az3ajbw-lndir-1.0.5
  /nix/store/6cir3r3pl77an8kszay8vkf3zjjfc8hg-mpfr-4.2.2
  /nix/store/kfk0f1b3imbn7ns2syvs90v941p6qf6m-stdenv-linux
  /nix/store/jjph74r5knlhf93jj1ap04blvfnlpd34-website-1.0.0-sources
warning: ignoring the client-specified setting 'store', because it is a restricted setting and you are not a trusted user
np1aw82132pgim9bnzqnrx325bkj66ks-website.drv: error: gRPC AddMultipleToStore on 'nix-store.geninf.io:50051' failed: error: a concurrent upload of '/nix/store/np1aw82132pgim9bnzqnrx325bkj66ks-website.drv' failed
error: error: gRPC AddMultipleToStore on 'nix-store.geninf.io:50051' failed: error: a concurrent upload of '/nix/store/np1aw82132pgim9bnzqnrx325bkj66ks-website.drv' failed
failed checks.aarch64-linux.package-website 14s
setup: don't know how to build these paths: /nix/store/np1aw82132pgim9bnzqnrx325bkj66ks-website.drv warning: ignoring the client-specified setting 'store', be …
setup:
don't know how to build these paths:
  /nix/store/np1aw82132pgim9bnzqnrx325bkj66ks-website.drv
warning: ignoring the client-specified setting 'store', because it is a restricted setting and you are not a trusted user
np1aw82132pgim9bnzqnrx325bkj66ks-website.drv: error: gRPC AddMultipleToStore on 'nix-store.geninf.io:50051' failed: error: some references of path '/nix/store/9wnwpadrib9k7a7n7bfalk1rqqlzhhca-hugo-0.152.2.drv' could not be realised
error: error: gRPC AddMultipleToStore on 'nix-store.geninf.io:50051' failed: error: some references of path '/nix/store/9wnwpadrib9k7a7n7bfalk1rqqlzhhca-hugo-0.152.2.drv' could not be realised
failed checks.x86_64-linux.package-default 4s
setup: don't know how to build these paths: /nix/store/9a9z51fgwbrsl2ajxxq3kg6hsm698z7c-website.drv warning: ignoring the client-specified setting 'store', be …
setup:
don't know how to build these paths:
  /nix/store/9a9z51fgwbrsl2ajxxq3kg6hsm698z7c-website.drv
warning: ignoring the client-specified setting 'store', because it is a restricted setting and you are not a trusted user
9a9z51fgwbrsl2ajxxq3kg6hsm698z7c-website.drv: error: gRPC AddMultipleToStore on 'nix-store.geninf.io:50051' failed: error: some references of path '/nix/store/d2a7lzh4xhwfjnsr50fzp8wfgxvjh0bd-website-1.0.0-sources.drv' could not be realised
error: error: gRPC AddMultipleToStore on 'nix-store.geninf.io:50051' failed: error: some references of path '/nix/store/d2a7lzh4xhwfjnsr50fzp8wfgxvjh0bd-website-1.0.0-sources.drv' could not be realised
failed checks.x86_64-linux.package-website 4s
setup: don't know how to build these paths: /nix/store/9a9z51fgwbrsl2ajxxq3kg6hsm698z7c-website.drv warning: ignoring the client-specified setting 'store', be …
setup:
don't know how to build these paths:
  /nix/store/9a9z51fgwbrsl2ajxxq3kg6hsm698z7c-website.drv
warning: ignoring the client-specified setting 'store', because it is a restricted setting and you are not a trusted user
9a9z51fgwbrsl2ajxxq3kg6hsm698z7c-website.drv: error: gRPC AddMultipleToStore on 'nix-store.geninf.io:50051' failed: error: some references of path '/nix/store/d2a7lzh4xhwfjnsr50fzp8wfgxvjh0bd-website-1.0.0-sources.drv' could not be realised
error: error: gRPC AddMultipleToStore on 'nix-store.geninf.io:50051' failed: error: some references of path '/nix/store/d2a7lzh4xhwfjnsr50fzp8wfgxvjh0bd-website-1.0.0-sources.drv' could not be realised
2 succeeded
succeeded attributes
status attribute duration
loading…
5 already built
skipped attributes
status attribute duration
loading…