nixbot

builds

clan/data-mesher build #110 failed

branch main · PR #487 · commit 58dad239ae · · took 3m 21s · eval 19s

8 failed
failed attributes
status attribute duration
failed checks.aarch64-darwin.treefmt 2m 3s
setup: don't know how to build these paths: /nix/store/4wjhgvmsj68x5glf8jwzp37jadabkmzl-treefmt-check.drv warning: ignoring the client-specified setting 'stor …
setup:
don't know how to build these paths:
  /nix/store/4wjhgvmsj68x5glf8jwzp37jadabkmzl-treefmt-check.drv
warning: ignoring the client-specified setting 'store', because it is a restricted setting and you are not a trusted user
warning: wi86nmgmrdrn3iawy3ibckfv1djr0rvx-treefmt.toml.drv: no connected, non-draining worker for system 'aarch64-darwin' offers features {}, the workers offer {}, waiting up to 120s for a worker
wi86nmgmrdrn3iawy3ibckfv1djr0rvx-treefmt.toml.drv: no connected, non-draining worker for system 'aarch64-darwin' offers features {}, the workers offer {}
error: dependency 'qf8ms1xvda2z8sjqyxax0x5ppw459ccm-treefmt.drv' failed
failed checks.aarch64-linux.nixos-data-mesher-multi-network 2m 59s
setup: h9c0rhhbfxikf08a1sv23jf3dndz59b4-system-units.drv: build01: build01: input not substitutable: error: some references of path '/nix/store/9b6yjsrwgawbdvrf …
setup:
h9c0rhhbfxikf08a1sv23jf3dndz59b4-system-units.drv: build01: build01: input not substitutable: error: some references of path '/nix/store/9b6yjsrwgawbdvrfvwf0sjyk85sm01rq-unit-firewall.service' could not be realised, asking the scheduler again
h9c0rhhbfxikf08a1sv23jf3dndz59b4-system-units.drv: build01: build01: input not substitutable: error: some references of path '/nix/store/9b6yjsrwgawbdvrfvwf0sjyk85sm01rq-unit-firewall.service' could not be realised, asking the scheduler again
h9c0rhhbfxikf08a1sv23jf3dndz59b4-system-units.drv: build01: build01: input not substitutable: error: some references of path '/nix/store/9b6yjsrwgawbdvrfvwf0sjyk85sm01rq-unit-firewall.service' could not be realised, asking the scheduler again
h9c0rhhbfxikf08a1sv23jf3dndz59b4-system-units.drv: build01: build01: input not substitutable: error: some references of path '/nix/store/9b6yjsrwgawbdvrfvwf0sjyk85sm01rq-unit-firewall.service' could not be realised, asking the scheduler again
h9c0rhhbfxikf08a1sv23jf3dndz59b4-system-units.drv: build01: build01: input not substitutable: error: some references of path '/nix/store/9b6yjsrwgawbdvrfvwf0sjyk85sm01rq-unit-firewall.service' could not be realised, asking the scheduler again
h9c0rhhbfxikf08a1sv23jf3dndz59b4-system-units.drv: build01: build01: input not substitutable: error: some references of path '/nix/store/9b6yjsrwgawbdvrfvwf0sjyk85sm01rq-unit-firewall.service' could not be realised, asking the scheduler again
h9c0rhhbfxikf08a1sv23jf3dndz59b4-system-units.drv: build01: build01: input not substitutable: error: some references of path '/nix/store/9b6yjsrwgawbdvrfvwf0sjyk85sm01rq-unit-firewall.service' could not be realised, asking the scheduler again
error: dependency 'cncy0c4zlc3174mfidkd0gz7m1kd6kkb-nixos-test-driver-data-mesher-multi-network.drv' failed
failed checks.aarch64-linux.pkg-data-mesher-test-golangci-lint 23s
data-mesher-0.1.0: }) pkg/model/signature.go:16:25: directive `//nolint:recvcheck` is unused for linter "recvcheck" (nolintlint) type SignatureType byte //noli …
data-mesher-0.1.0:
	})
pkg/model/signature.go:16:25: directive `//nolint:recvcheck` is unused for linter "recvcheck" (nolintlint)
type SignatureType byte //nolint:recvcheck
                        ^
52 issues:
* exhaustruct_v5: 50
* gosec: 1
* nolintlint: 1
failed checks.aarch64-linux.pkg-default-test-golangci-lint 23s
data-mesher-0.1.0: }) pkg/model/signature.go:16:25: directive `//nolint:recvcheck` is unused for linter "recvcheck" (nolintlint) type SignatureType byte //noli …
data-mesher-0.1.0:
	})
pkg/model/signature.go:16:25: directive `//nolint:recvcheck` is unused for linter "recvcheck" (nolintlint)
type SignatureType byte //nolint:recvcheck
                        ^
52 issues:
* exhaustruct_v5: 50
* gosec: 1
* nolintlint: 1
failed checks.aarch64-linux.treefmt 11s
setup: w6rz1qpwz7rd1ndbhzv4rh69qpzmwd91-treefmt.toml.drv: build01: build01: input not substitutable: error: path '/nix/store/pqz4czqvvpm2h611k7vglkz4k775xl1a-md …
setup:
w6rz1qpwz7rd1ndbhzv4rh69qpzmwd91-treefmt.toml.drv: build01: build01: input not substitutable: error: path '/nix/store/pqz4czqvvpm2h611k7vglkz4k775xl1a-mdformat-wrapped' is required, but there is no substituter that can build it, asking the scheduler again
w6rz1qpwz7rd1ndbhzv4rh69qpzmwd91-treefmt.toml.drv: build01: build01: input not substitutable: error: path '/nix/store/pqz4czqvvpm2h611k7vglkz4k775xl1a-mdformat-wrapped' is required, but there is no substituter that can build it, asking the scheduler again
w6rz1qpwz7rd1ndbhzv4rh69qpzmwd91-treefmt.toml.drv: build01: build01: input not substitutable: error: path '/nix/store/pqz4czqvvpm2h611k7vglkz4k775xl1a-mdformat-wrapped' is required, but there is no substituter that can build it, asking the scheduler again
w6rz1qpwz7rd1ndbhzv4rh69qpzmwd91-treefmt.toml.drv: build01: build01: input not substitutable: error: path '/nix/store/pqz4czqvvpm2h611k7vglkz4k775xl1a-mdformat-wrapped' is required, but there is no substituter that can build it, asking the scheduler again
w6rz1qpwz7rd1ndbhzv4rh69qpzmwd91-treefmt.toml.drv: build01: build01: input not substitutable: error: path '/nix/store/pqz4czqvvpm2h611k7vglkz4k775xl1a-mdformat-wrapped' is required, but there is no substituter that can build it, asking the scheduler again
w6rz1qpwz7rd1ndbhzv4rh69qpzmwd91-treefmt.toml.drv: build01: build01: input not substitutable: error: path '/nix/store/pqz4czqvvpm2h611k7vglkz4k775xl1a-mdformat-wrapped' is required, but there is no substituter that can build it, asking the scheduler again
w6rz1qpwz7rd1ndbhzv4rh69qpzmwd91-treefmt.toml.drv: build01: build01: input not substitutable: error: path '/nix/store/pqz4czqvvpm2h611k7vglkz4k775xl1a-mdformat-wrapped' is required, but there is no substituter that can build it, asking the scheduler again
error: dependency 'm8cn93f9a6l9hnf9bn0kixrq91pnc7zp-treefmt.drv' failed
failed checks.x86_64-linux.nixos-data-mesher-multi-network 31s
setup: a2harnpbnlbw1psnivfckzxd0qz5i3im-nixos-system-a2-test.drv: build-x86-01: build-x86-01: input not substitutable: error: path '/nix/store/fprz81fvq67cvxfgy …
setup:
a2harnpbnlbw1psnivfckzxd0qz5i3im-nixos-system-a2-test.drv: build-x86-01: build-x86-01: input not substitutable: error: path '/nix/store/fprz81fvq67cvxfgyplfrplw2363dqp6-boot.json' is required, but there is no substituter that can build it, asking the scheduler again
a2harnpbnlbw1psnivfckzxd0qz5i3im-nixos-system-a2-test.drv: build-x86-01: build-x86-01: input not substitutable: error: path '/nix/store/fprz81fvq67cvxfgyplfrplw2363dqp6-boot.json' is required, but there is no substituter that can build it, asking the scheduler again
a2harnpbnlbw1psnivfckzxd0qz5i3im-nixos-system-a2-test.drv: build-x86-01: build-x86-01: input not substitutable: error: path '/nix/store/fprz81fvq67cvxfgyplfrplw2363dqp6-boot.json' is required, but there is no substituter that can build it, asking the scheduler again
a2harnpbnlbw1psnivfckzxd0qz5i3im-nixos-system-a2-test.drv: build-x86-01: build-x86-01: input not substitutable: error: path '/nix/store/fprz81fvq67cvxfgyplfrplw2363dqp6-boot.json' is required, but there is no substituter that can build it, asking the scheduler again
a2harnpbnlbw1psnivfckzxd0qz5i3im-nixos-system-a2-test.drv: build-x86-01: build-x86-01: input not substitutable: error: path '/nix/store/fprz81fvq67cvxfgyplfrplw2363dqp6-boot.json' is required, but there is no substituter that can build it, asking the scheduler again
a2harnpbnlbw1psnivfckzxd0qz5i3im-nixos-system-a2-test.drv: build-x86-01: build-x86-01: input not substitutable: error: path '/nix/store/fprz81fvq67cvxfgyplfrplw2363dqp6-boot.json' is required, but there is no substituter that can build it, asking the scheduler again
a2harnpbnlbw1psnivfckzxd0qz5i3im-nixos-system-a2-test.drv: build-x86-01: build-x86-01: input not substitutable: error: path '/nix/store/fprz81fvq67cvxfgyplfrplw2363dqp6-boot.json' is required, but there is no substituter that can build it, asking the scheduler again
error: dependency 'whzjbwb3n5zx1rd4bd0gqd7yp3s95vbq-nixos-test-driver-data-mesher-multi-network.drv' failed
failed checks.x86_64-linux.pkg-data-mesher-test-golangci-lint 12s
data-mesher-0.1.0: }) pkg/model/signature.go:16:25: directive `//nolint:recvcheck` is unused for linter "recvcheck" (nolintlint) type SignatureType byte //noli …
data-mesher-0.1.0:
	})
pkg/model/signature.go:16:25: directive `//nolint:recvcheck` is unused for linter "recvcheck" (nolintlint)
type SignatureType byte //nolint:recvcheck
                        ^
52 issues:
* exhaustruct_v5: 50
* gosec: 1
* nolintlint: 1
failed checks.x86_64-linux.pkg-default-test-golangci-lint 12s
data-mesher-0.1.0: }) pkg/model/signature.go:16:25: directive `//nolint:recvcheck` is unused for linter "recvcheck" (nolintlint) type SignatureType byte //noli …
data-mesher-0.1.0:
	})
pkg/model/signature.go:16:25: directive `//nolint:recvcheck` is unused for linter "recvcheck" (nolintlint)
type SignatureType byte //nolint:recvcheck
                        ^
52 issues:
* exhaustruct_v5: 50
* gosec: 1
* nolintlint: 1
1 succeeded
succeeded attributes
status attribute duration
loading…
2 already built
skipped attributes
status attribute duration
loading…