nixbot

builds

clan/data-mesher build #114 failed

branch main · PR #487 · commit 662e5c0baf · · took 2m 20s · eval 15s

8 failed
failed attributes
status attribute duration
failed checks.aarch64-darwin.treefmt 2m 4s
setup: /nix/store/ldslzfb5v9a0ppq1knrpq78n2rbzh1iw-shfmt-3.14.1 /nix/store/l5hdhmp9pscsdps4849zlc2h6iac9xln-sizelint.toml /nix/store/925b3zxz1j0984ywkl3y3 …
setup:
  /nix/store/ldslzfb5v9a0ppq1knrpq78n2rbzh1iw-shfmt-3.14.1
  /nix/store/l5hdhmp9pscsdps4849zlc2h6iac9xln-sizelint.toml
  /nix/store/925b3zxz1j0984ywkl3y35v0bbrda2k9-statix-0.5.8-unstable-2026-07-17
  /nix/store/hchd254sqhgwfvv0vvxld3adb5mh5ig8-statix.toml
warning: ignoring the client-specified setting 'store', because it is a restricted setting and you are not a trusted user
warning: pj3k9nc4r9wfk85x6g9cbzg3h6cn6qkp-treefmt.toml.drv: no connected, non-draining worker for system 'aarch64-darwin' offers features {}, the workers offer {}, waiting up to 120s for a worker
pj3k9nc4r9wfk85x6g9cbzg3h6cn6qkp-treefmt.toml.drv: no connected, non-draining worker for system 'aarch64-darwin' offers features {}, the workers offer {}
error: dependency 'x1wl3i1ds7f6ifg3c6wsi16lasack9fm-treefmt.drv' failed
failed checks.aarch64-linux.nixos-data-mesher-basic 29s
setup: g9xdj5bvjs6p9z6a9hgkxxd40hjqlpg4-system-units.drv: build01: build01: input not substitutable: error: some references of path '/nix/store/3r1glazm3kjgvadn …
setup:
g9xdj5bvjs6p9z6a9hgkxxd40hjqlpg4-system-units.drv: build01: build01: input not substitutable: error: some references of path '/nix/store/3r1glazm3kjgvadn6nwfdbi9mnhyqj69-unit-dbus-broker.service' could not be realised, asking the scheduler again
nyzwjx5bl0c04dcm4c63aixkdizs58xr-system-units.drv: build01: build01: input not substitutable: error: some references of path '/nix/store/3r1glazm3kjgvadn6nwfdbi9mnhyqj69-unit-dbus-broker.service' could not be realised, asking the scheduler again
khchpc7fvgh7a1p4avjx91dr1q8sxd49-system-units.drv: build01: build01: input not substitutable: error: some references of path '/nix/store/3r1glazm3kjgvadn6nwfdbi9mnhyqj69-unit-dbus-broker.service' could not be realised, asking the scheduler again
g9xdj5bvjs6p9z6a9hgkxxd40hjqlpg4-system-units.drv: build01: build01: input not substitutable: error: some references of path '/nix/store/3r1glazm3kjgvadn6nwfdbi9mnhyqj69-unit-dbus-broker.service' could not be realised, asking the scheduler again
nyzwjx5bl0c04dcm4c63aixkdizs58xr-system-units.drv: build01: build01: input not substitutable: error: some references of path '/nix/store/3r1glazm3kjgvadn6nwfdbi9mnhyqj69-unit-dbus-broker.service' could not be realised, asking the scheduler again
khchpc7fvgh7a1p4avjx91dr1q8sxd49-system-units.drv: build01: build01: input not substitutable: error: some references of path '/nix/store/3r1glazm3kjgvadn6nwfdbi9mnhyqj69-unit-dbus-broker.service' could not be realised, asking the scheduler again
nyzwjx5bl0c04dcm4c63aixkdizs58xr-system-units.drv: build01: build01: input not substitutable: error: some references of path '/nix/store/3r1glazm3kjgvadn6nwfdbi9mnhyqj69-unit-dbus-broker.service' could not be realised, asking the scheduler again
error: dependency 'q3nwj7f95wkjpkkzswl8hpj64lx09xf8-nixos-test-driver-data-mesher-basic.drv' failed
failed checks.aarch64-linux.nixos-data-mesher-multi-network 16s
setup: n009r96m13nv8lval8yx4g1k6zsx8k9d-system-units.drv: build01: build01: input not substitutable: error: some references of path '/nix/store/9b6yjsrwgawbdvrf …
setup:
n009r96m13nv8lval8yx4g1k6zsx8k9d-system-units.drv: build01: build01: input not substitutable: error: some references of path '/nix/store/9b6yjsrwgawbdvrfvwf0sjyk85sm01rq-unit-firewall.service' could not be realised, asking the scheduler again
gj8af5kp92b12i5g5kjkzlv7k8cw87g6-system-units.drv: build01: build01: input not substitutable: error: some references of path '/nix/store/9b6yjsrwgawbdvrfvwf0sjyk85sm01rq-unit-firewall.service' could not be realised, asking the scheduler again
dc97bvhvs770cqa61x35nbj28lbn02d4-system-units.drv: build01: build01: input not substitutable: error: some references of path '/nix/store/9b6yjsrwgawbdvrfvwf0sjyk85sm01rq-unit-firewall.service' could not be realised, asking the scheduler again
3kqi0dx74s7wb34rpxfr77748s7b4yc1-system-units.drv: build01: build01: input not substitutable: error: some references of path '/nix/store/9b6yjsrwgawbdvrfvwf0sjyk85sm01rq-unit-firewall.service' could not be realised, asking the scheduler again
h9c0rhhbfxikf08a1sv23jf3dndz59b4-system-units.drv: build01: build01: input not substitutable: error: some references of path '/nix/store/9b6yjsrwgawbdvrfvwf0sjyk85sm01rq-unit-firewall.service' could not be realised, asking the scheduler again
sin0ybf2fgvmd70ghmrw7m3mjq1iy5ja-system-units.drv: build01: build01: input not substitutable: error: some references of path '/nix/store/9b6yjsrwgawbdvrfvwf0sjyk85sm01rq-unit-firewall.service' could not be realised, asking the scheduler again
h9c0rhhbfxikf08a1sv23jf3dndz59b4-system-units.drv: build01: build01: input not substitutable: error: some references of path '/nix/store/9b6yjsrwgawbdvrfvwf0sjyk85sm01rq-unit-firewall.service' could not be realised, asking the scheduler again
error: dependency 'cncy0c4zlc3174mfidkd0gz7m1kd6kkb-nixos-test-driver-data-mesher-multi-network.drv' failed
failed checks.aarch64-linux.pkg-data-mesher-test-golangci-lint 24s
data-mesher-0.1.0: }) pkg/model/signature.go:16:25: directive `//nolint:recvcheck` is unused for linter "recvcheck" (nolintlint) type SignatureType byte //noli …
data-mesher-0.1.0:
	})
pkg/model/signature.go:16:25: directive `//nolint:recvcheck` is unused for linter "recvcheck" (nolintlint)
type SignatureType byte //nolint:recvcheck
                        ^
52 issues:
* exhaustruct_v5: 50
* gosec: 1
* nolintlint: 1
failed checks.aarch64-linux.pkg-default-test-golangci-lint 24s
data-mesher-0.1.0: }) pkg/model/signature.go:16:25: directive `//nolint:recvcheck` is unused for linter "recvcheck" (nolintlint) type SignatureType byte //noli …
data-mesher-0.1.0:
	})
pkg/model/signature.go:16:25: directive `//nolint:recvcheck` is unused for linter "recvcheck" (nolintlint)
type SignatureType byte //nolint:recvcheck
                        ^
52 issues:
* exhaustruct_v5: 50
* gosec: 1
* nolintlint: 1
failed checks.aarch64-linux.treefmt 14s
setup: bx5hsjf6l3p40fgshn6vdywz6mdii05j-treefmt.toml.drv: build01: build01: input not substitutable: error: path '/nix/store/pqz4czqvvpm2h611k7vglkz4k775xl1a-md …
setup:
bx5hsjf6l3p40fgshn6vdywz6mdii05j-treefmt.toml.drv: build01: build01: input not substitutable: error: path '/nix/store/pqz4czqvvpm2h611k7vglkz4k775xl1a-mdformat-wrapped' is required, but there is no substituter that can build it, asking the scheduler again
bx5hsjf6l3p40fgshn6vdywz6mdii05j-treefmt.toml.drv: build01: build01: input not substitutable: error: path '/nix/store/pqz4czqvvpm2h611k7vglkz4k775xl1a-mdformat-wrapped' is required, but there is no substituter that can build it, asking the scheduler again
bx5hsjf6l3p40fgshn6vdywz6mdii05j-treefmt.toml.drv: build01: build01: input not substitutable: error: path '/nix/store/pqz4czqvvpm2h611k7vglkz4k775xl1a-mdformat-wrapped' is required, but there is no substituter that can build it, asking the scheduler again
bx5hsjf6l3p40fgshn6vdywz6mdii05j-treefmt.toml.drv: build01: build01: input not substitutable: error: path '/nix/store/pqz4czqvvpm2h611k7vglkz4k775xl1a-mdformat-wrapped' is required, but there is no substituter that can build it, asking the scheduler again
bx5hsjf6l3p40fgshn6vdywz6mdii05j-treefmt.toml.drv: build01: build01: input not substitutable: error: path '/nix/store/pqz4czqvvpm2h611k7vglkz4k775xl1a-mdformat-wrapped' is required, but there is no substituter that can build it, asking the scheduler again
bx5hsjf6l3p40fgshn6vdywz6mdii05j-treefmt.toml.drv: build01: build01: input not substitutable: error: path '/nix/store/pqz4czqvvpm2h611k7vglkz4k775xl1a-mdformat-wrapped' is required, but there is no substituter that can build it, asking the scheduler again
bx5hsjf6l3p40fgshn6vdywz6mdii05j-treefmt.toml.drv: build01: build01: input not substitutable: error: path '/nix/store/pqz4czqvvpm2h611k7vglkz4k775xl1a-mdformat-wrapped' is required, but there is no substituter that can build it, asking the scheduler again
error: dependency 'l0wx93m0jd9pkrwm51vvy580h5v3kzv5-treefmt.drv' failed
failed checks.x86_64-linux.pkg-data-mesher-test-golangci-lint 14s
data-mesher-0.1.0: }) pkg/model/signature.go:16:25: directive `//nolint:recvcheck` is unused for linter "recvcheck" (nolintlint) type SignatureType byte //noli …
data-mesher-0.1.0:
	})
pkg/model/signature.go:16:25: directive `//nolint:recvcheck` is unused for linter "recvcheck" (nolintlint)
type SignatureType byte //nolint:recvcheck
                        ^
52 issues:
* exhaustruct_v5: 50
* gosec: 1
* nolintlint: 1
failed checks.x86_64-linux.pkg-default-test-golangci-lint 15s
data-mesher-0.1.0: }) pkg/model/signature.go:16:25: directive `//nolint:recvcheck` is unused for linter "recvcheck" (nolintlint) type SignatureType byte //noli …
data-mesher-0.1.0:
	})
pkg/model/signature.go:16:25: directive `//nolint:recvcheck` is unused for linter "recvcheck" (nolintlint)
type SignatureType byte //nolint:recvcheck
                        ^
52 issues:
* exhaustruct_v5: 50
* gosec: 1
* nolintlint: 1
1 succeeded
succeeded attributes
status attribute duration
loading…
2 already built
skipped attributes
status attribute duration
loading…