nixbot

builds

clan/dvt-lite build #104 failed

branch main · PR #82 · commit 13644bf223 · · took 35m 7s · eval 27m 48s

eval warnings 2 kinds · 12 occurrences
  • warn stdenv.isLinux is deprecated, use stdenv.hostPlatform.isLinux instead ×5
  • warn stdenv.isDarwin is deprecated, use stdenv.hostPlatform.isDarwin instead ×7

4 failed ⚠ 1
failed attributes
status attribute duration
failed checks.x86_64-linux.integration-test-besu-grandine
  • stdenv.isLinux is deprecated, use stdenv.hostPlatform.isLinux instead
  • stdenv.isDarwin is deprecated, use stdenv.hostPlatform.isDarwin instead
4m 8s
setup: g4z1wh7mkghd72k6714hg9wr5rr1njp1-cargo-vendor-dir.drv: build-x86-01: the build this call attached to did not finish, retry, asking the scheduler again g4 …
setup:
g4z1wh7mkghd72k6714hg9wr5rr1njp1-cargo-vendor-dir.drv: build-x86-01: the build this call attached to did not finish, retry, asking the scheduler again
g4z1wh7mkghd72k6714hg9wr5rr1njp1-cargo-vendor-dir.drv: build-x86-01: the build this call attached to did not finish, retry, asking the scheduler again
g4z1wh7mkghd72k6714hg9wr5rr1njp1-cargo-vendor-dir.drv: build-x86-01: the build this call attached to did not finish, retry, asking the scheduler again
g4z1wh7mkghd72k6714hg9wr5rr1njp1-cargo-vendor-dir.drv: build-x86-01: the build this call attached to did not finish, retry, asking the scheduler again
g4z1wh7mkghd72k6714hg9wr5rr1njp1-cargo-vendor-dir.drv: build-x86-01: the build this call attached to did not finish, retry, asking the scheduler again
wqrla8ij6q2662dnn21s8rim7v1mmrwv-dirk-prepare.drv: gi-build-x86-02: not scheduled here: wqrla8ij6q2662dnn21s8rim7v1mmrwv-dirk-prepare.drv, asking the scheduler again
p2d96gsxdv3zznlrhilwnjvyh7sky1hh-unit-dbus-broker.service.drv: gi-build-x86-02: not scheduled here: p2d96gsxdv3zznlrhilwnjvyh7sky1hh-unit-dbus-broker.service.drv, asking the scheduler again
error: dependency 'j959yfbwfm0m3ysqhmzhhfpwvhw875fh-nixos-test-driver-dvt-besu-grandine.drv' failed
failed checks.x86_64-linux.integration-test-geth-lighthouse 3m 53s
setup: g4z1wh7mkghd72k6714hg9wr5rr1njp1-cargo-vendor-dir.drv: build-x86-01: build-x86-01: input not substitutable: error: path '/nix/store/48r8c1hyv2x2pdgvn8nl2 …
setup:
g4z1wh7mkghd72k6714hg9wr5rr1njp1-cargo-vendor-dir.drv: build-x86-01: build-x86-01: input not substitutable: error: path '/nix/store/48r8c1hyv2x2pdgvn8nl2hm6dwqiiar0-png-0.17.16' is required, but there is no substituter that can build it, asking the scheduler again
g4z1wh7mkghd72k6714hg9wr5rr1njp1-cargo-vendor-dir.drv: build-x86-01: the build this call attached to did not finish, retry, asking the scheduler again
bjf02rbf8k9immgwq5klfhnvjhind73m-unit-vouch-validator.service.drv: build-x86-01: not scheduled here: bjf02rbf8k9immgwq5klfhnvjhind73m-unit-vouch-validator.service.drv, asking the scheduler again
jwrns5h6xqgpq4xg38v2kzphgq495mix-ethdo.drv: build-x86-01: not scheduled here: jwrns5h6xqgpq4xg38v2kzphgq495mix-ethdo.drv, asking the scheduler again
cc0c5131pi0y1rx9qxnvslhhz7xqksqq-ethdo.drv: build-x86-01: not scheduled here: cc0c5131pi0y1rx9qxnvslhhz7xqksqq-ethdo.drv, asking the scheduler again
vngclqys8kydjx3m3hdblcwa3qir4gsk-user-units.drv: build-x86-01: not scheduled here: vngclqys8kydjx3m3hdblcwa3qir4gsk-user-units.drv, asking the scheduler again
qhw91nk07kagjsjajqvni0apwhlzdar4-user-units.drv: build-x86-01: not scheduled here: qhw91nk07kagjsjajqvni0apwhlzdar4-user-units.drv, asking the scheduler again
error: dependency 'ml9rqj9s5rsckljm4aardff8vw10324i-nixos-test-driver-dvt-geth-lighthouse.drv' failed
failed checks.x86_64-linux.integration-test-geth-prysm 2m 46s
setup: g4z1wh7mkghd72k6714hg9wr5rr1njp1-cargo-vendor-dir.drv: build-x86-01: the build this call attached to did not finish, retry, asking the scheduler again g4 …
setup:
g4z1wh7mkghd72k6714hg9wr5rr1njp1-cargo-vendor-dir.drv: build-x86-01: the build this call attached to did not finish, retry, asking the scheduler again
g4z1wh7mkghd72k6714hg9wr5rr1njp1-cargo-vendor-dir.drv: build-x86-01: the build this call attached to did not finish, retry, asking the scheduler again
g4z1wh7mkghd72k6714hg9wr5rr1njp1-cargo-vendor-dir.drv: build-x86-01: the build this call attached to did not finish, retry, asking the scheduler again
g4z1wh7mkghd72k6714hg9wr5rr1njp1-cargo-vendor-dir.drv: build-x86-01: build-x86-01: input not substitutable: error: path '/nix/store/48r8c1hyv2x2pdgvn8nl2hm6dwqiiar0-png-0.17.16' is required, but there is no substituter that can build it, asking the scheduler again
g4z1wh7mkghd72k6714hg9wr5rr1njp1-cargo-vendor-dir.drv: build-x86-01: build-x86-01: input not substitutable: error: path '/nix/store/48r8c1hyv2x2pdgvn8nl2hm6dwqiiar0-png-0.17.16' is required, but there is no substituter that can build it, asking the scheduler again
jwrns5h6xqgpq4xg38v2kzphgq495mix-ethdo.drv: build-x86-01: not scheduled here: jwrns5h6xqgpq4xg38v2kzphgq495mix-ethdo.drv, asking the scheduler again
3w9jx9pbgaacgys2gsxy82vqm3jai26g-unit-dirk.service.drv: build-x86-01: not scheduled here: 3w9jx9pbgaacgys2gsxy82vqm3jai26g-unit-dirk.service.drv, asking the scheduler again
error: dependency 'wiaywmqqic92arbnr43mgc3pxg23x7z0-nixos-test-driver-dvt-geth-prysm.drv' failed
failed checks.x86_64-linux.integration-test-reth-teku 4m 41s
setup: g4z1wh7mkghd72k6714hg9wr5rr1njp1-cargo-vendor-dir.drv: build-x86-01: build-x86-01: input not substitutable: error: path '/nix/store/48r8c1hyv2x2pdgvn8nl2 …
setup:
g4z1wh7mkghd72k6714hg9wr5rr1njp1-cargo-vendor-dir.drv: build-x86-01: build-x86-01: input not substitutable: error: path '/nix/store/48r8c1hyv2x2pdgvn8nl2hm6dwqiiar0-png-0.17.16' is required, but there is no substituter that can build it, asking the scheduler again
g4z1wh7mkghd72k6714hg9wr5rr1njp1-cargo-vendor-dir.drv: build-x86-01: the build this call attached to did not finish, retry, asking the scheduler again
g4z1wh7mkghd72k6714hg9wr5rr1njp1-cargo-vendor-dir.drv: build-x86-01: build-x86-01: input not substitutable: error: path '/nix/store/48r8c1hyv2x2pdgvn8nl2hm6dwqiiar0-png-0.17.16' is required, but there is no substituter that can build it, asking the scheduler again
g4z1wh7mkghd72k6714hg9wr5rr1njp1-cargo-vendor-dir.drv: build-x86-01: the build this call attached to did not finish, retry, asking the scheduler again
g4z1wh7mkghd72k6714hg9wr5rr1njp1-cargo-vendor-dir.drv: build-x86-01: build-x86-01: input not substitutable: error: path '/nix/store/48r8c1hyv2x2pdgvn8nl2hm6dwqiiar0-png-0.17.16' is required, but there is no substituter that can build it, asking the scheduler again
g4z1wh7mkghd72k6714hg9wr5rr1njp1-cargo-vendor-dir.drv: build-x86-01: the build this call attached to did not finish, retry, asking the scheduler again
qhw91nk07kagjsjajqvni0apwhlzdar4-user-units.drv: build-x86-01: not scheduled here: qhw91nk07kagjsjajqvni0apwhlzdar4-user-units.drv, asking the scheduler again
error: dependency '46j42ln1439xcwmy0gc23206750f0rb2-nixos-test-driver-dvt-reth-teku.drv' failed
15 succeeded ⚠ 3
succeeded attributes
status attribute duration
succeeded checks.x86_64-linux.besu
  • stdenv.isLinux is deprecated, use stdenv.hostPlatform.isLinux instead
  • stdenv.isDarwin is deprecated, use stdenv.hostPlatform.isDarwin instead
2m 58s
succeeded checks.x86_64-linux.integration-test-besu-nimbus
  • stdenv.isLinux is deprecated, use stdenv.hostPlatform.isLinux instead
  • stdenv.isDarwin is deprecated, use stdenv.hostPlatform.isDarwin instead
6m 50s
succeeded checks.x86_64-linux.integration-test-geth-nimbus-vero
  • stdenv.isDarwin is deprecated, use stdenv.hostPlatform.isDarwin instead
  • stdenv.isDarwin is deprecated, use stdenv.hostPlatform.isDarwin instead
  • stdenv.isLinux is deprecated, use stdenv.hostPlatform.isLinux instead
11m 3s
succeeded checks.x86_64-linux.erigon 5m 23s
succeeded checks.x86_64-linux.haproxy-beacon 1m 55s
succeeded checks.x86_64-linux.integration-test-erigon-lodestar 2m 47s
succeeded checks.x86_64-linux.integration-test-geth-mixed-cl 2m 37s
succeeded checks.x86_64-linux.lodestar-beacon 3m 23s
succeeded checks.x86_64-linux.lodestar-flatten 2m 7s
succeeded checks.x86_64-linux.nethermind 5m 11s
succeeded checks.x86_64-linux.nix-unit 3m 2s
succeeded checks.x86_64-linux.prysm-beacon 3m 29s
succeeded checks.x86_64-linux.reth 12m 25s
succeeded checks.x86_64-linux.teku-beacon 3m 0s
succeeded checks.x86_64-linux.treefmt 39s