nixbot

builds

Enzime/hyperconfig build #1142 failed

branch next · PR #1084 · commit 6b3108dfa9 · · took 5m 5s · eval 1m 15s

eval warnings 1 kind · 2 occurrences
  • warn A legacy Nextcloud install (from before NixOS 26.11) may be installed. ×2

14 failed ⚠ 1
failed attributes
status attribute duration
failed checks.x86_64-linux.nixos-phi-nixos
  • A legacy Nextcloud install (from before NixOS 26.11) may be installed. After nextcloud33 is installed successfully, you can safely upgrade to 34. The latest version available is Nextcloud35. Please note that Nextcloud doesn't support upgrades across multiple major versions (i.e. an upgrade from 16 is possible to 17, but not 16 to 18). The package can be upgraded by explicitly declaring the service-option `services.nextcloud.package`.
  • A legacy Nextcloud install (from before NixOS 26.11) may be installed. After nextcloud34 is installed successfully, you can safely upgrade to 35. The latest version available is Nextcloud35. Please note that Nextcloud doesn't support upgrades across multiple major versions (i.e. an upgrade from 16 is possible to 17, but not 16 to 18). The package can be upgraded by explicitly declaring the service-option `services.nextcloud.package`.
3m 38s
setup: don't know how to build these paths: /nix/store/nic7ji5z1cbjg9ia0kimy9r2lsln21xx-nixos-system-phi-nixos-26.11.20261007.7dd199b.drv warning: ignoring th …
setup:
don't know how to build these paths:
  /nix/store/nic7ji5z1cbjg9ia0kimy9r2lsln21xx-nixos-system-phi-nixos-26.11.20261007.7dd199b.drv
warning: ignoring the client-specified setting 'store', because it is a restricted setting and you are not a trusted user
g8gar8mh7z71vza1d25picsi8wbl2lz0-system-units.drv: error: gRPC AddMultipleToStore on 'nix-store.geninf.io:50051' failed: error: path '/nix/store/90h1jrm83phwwfdmgkgxyiv3s3dlb1ic-home-manager-path.drv' is required, but there is no substituter that can build it
error: dependency 'qd966v94n0da64hhw5gj2iw3s7mwk3z8-etc.drv' failed
failed checks.aarch64-darwin."home-manager-enzime@hyperion-macos" 2m 14s
setup: warning: ignoring the client-specified setting 'store', because it is a restricted setting and you are not a trusted user warning: 07wq8kb4l5k246bkgssli6 …
setup:
warning: ignoring the client-specified setting 'store', because it is a restricted setting and you are not a trusted user
warning: 07wq8kb4l5k246bkgssli6xya6acajcz-home-manager-path.drv: no connected, non-draining worker for system 'aarch64-darwin' offers features {}, the workers offer {}, waiting up to 120s for a worker
warning: m1s7ava6msnw886wi58l9p31gabqqpq7-home-manager-fonts.drv: no connected, non-draining worker for system 'aarch64-darwin' offers features {}, the workers offer {}, waiting up to 120s for a worker
warning: nx9p4ykxwq34sl2smaikg9hxlxcv6zzk-home-manager-applications.drv: no connected, non-draining worker for system 'aarch64-darwin' offers features {}, the workers offer {}, waiting up to 120s for a worker
07wq8kb4l5k246bkgssli6xya6acajcz-home-manager-path.drv: no connected, non-draining worker for system 'aarch64-darwin' offers features {}, the workers offer {}
m1s7ava6msnw886wi58l9p31gabqqpq7-home-manager-fonts.drv: no connected, non-draining worker for system 'aarch64-darwin' offers features {}, the workers offer {}
nx9p4ykxwq34sl2smaikg9hxlxcv6zzk-home-manager-applications.drv: no connected, non-draining worker for system 'aarch64-darwin' offers features {}, the workers offer {}
error: dependency '07wq8kb4l5k246bkgssli6xya6acajcz-home-manager-path.drv' failed
failed checks.aarch64-darwin.nix-darwin-hyperion-macos 2m 5s
setup: warning: rq4hh33yykbhszvr57nc8mjy6q6dgkdl-home-manager-fonts.drv: no connected, non-draining worker for system 'aarch64-darwin' offers features {}, the w …
setup:
warning: rq4hh33yykbhszvr57nc8mjy6q6dgkdl-home-manager-fonts.drv: no connected, non-draining worker for system 'aarch64-darwin' offers features {}, the workers offer {}, waiting up to 120s for a worker
warning: zmm7cys24y96i6scdifbhi0rpaxc69li-etc-registry.json.drv: no connected, non-draining worker for system 'aarch64-darwin' offers features {}, the workers offer {}, waiting up to 120s for a worker
6q1fgid5m9bxxw2iz5llrl7czm5x2y1m-home-manager-applications.drv: no connected, non-draining worker for system 'aarch64-darwin' offers features {}, the workers offer {}
i9isnavgfx4mzm9hfw9d4h6xjngg65dm-home-manager-path.drv: no connected, non-draining worker for system 'aarch64-darwin' offers features {}, the workers offer {}
m7bldn74jwnfwmd9dcvh03s34ligykkw-darwin-version.json.drv: no connected, non-draining worker for system 'aarch64-darwin' offers features {}, the workers offer {}
rq4hh33yykbhszvr57nc8mjy6q6dgkdl-home-manager-fonts.drv: no connected, non-draining worker for system 'aarch64-darwin' offers features {}, the workers offer {}
zmm7cys24y96i6scdifbhi0rpaxc69li-etc-registry.json.drv: no connected, non-draining worker for system 'aarch64-darwin' offers features {}, the workers offer {}
error: dependency 'm7bldn74jwnfwmd9dcvh03s34ligykkw-darwin-version.json.drv' failed
failed checks.aarch64-darwin.package-gaia-vm 2m 4s
setup: don't know how to build these paths: /nix/store/kz07f3xgpbn8gvq7ahdi8qp6jba9iwb9-run-gaia-vm-on-aarch64-darwin.drv warning: ignoring the client-specifi …
setup:
don't know how to build these paths:
  /nix/store/kz07f3xgpbn8gvq7ahdi8qp6jba9iwb9-run-gaia-vm-on-aarch64-darwin.drv
warning: ignoring the client-specified setting 'store', because it is a restricted setting and you are not a trusted user
warning: kz07f3xgpbn8gvq7ahdi8qp6jba9iwb9-run-gaia-vm-on-aarch64-darwin.drv: no connected, non-draining worker for system 'aarch64-darwin' offers features {}, the workers offer {}, waiting up to 120s for a worker
kz07f3xgpbn8gvq7ahdi8qp6jba9iwb9-run-gaia-vm-on-aarch64-darwin.drv: no connected, non-draining worker for system 'aarch64-darwin' offers features {}, the workers offer {}
error: no connected, non-draining worker for system 'aarch64-darwin' offers features {}, the workers offer {}
failed checks.aarch64-darwin.package-phi-nixos-vm 2m 2s
setup: this derivation will be built: /nix/store/rd7yd9hd034q3j9nlnm5iqx09czv15bs-run-phi-nixos-vm-on-aarch64-darwin.drv warning: ignoring the client-specifie …
setup:
this derivation will be built:
  /nix/store/rd7yd9hd034q3j9nlnm5iqx09czv15bs-run-phi-nixos-vm-on-aarch64-darwin.drv
warning: ignoring the client-specified setting 'store', because it is a restricted setting and you are not a trusted user
warning: rd7yd9hd034q3j9nlnm5iqx09czv15bs-run-phi-nixos-vm-on-aarch64-darwin.drv: no connected, non-draining worker for system 'aarch64-darwin' offers features {}, the workers offer {}, waiting up to 120s for a worker
rd7yd9hd034q3j9nlnm5iqx09czv15bs-run-phi-nixos-vm-on-aarch64-darwin.drv: no connected, non-draining worker for system 'aarch64-darwin' offers features {}, the workers offer {}
error: no connected, non-draining worker for system 'aarch64-darwin' offers features {}, the workers offer {}
failed checks.aarch64-darwin.package-sigma-vm 2m 9s
setup: don't know how to build these paths: /nix/store/wf685hspzqskgphny8cil303cii1rs25-run-sigma-vm-on-aarch64-darwin.drv warning: ignoring the client-specif …
setup:
don't know how to build these paths:
  /nix/store/wf685hspzqskgphny8cil303cii1rs25-run-sigma-vm-on-aarch64-darwin.drv
warning: ignoring the client-specified setting 'store', because it is a restricted setting and you are not a trusted user
warning: wf685hspzqskgphny8cil303cii1rs25-run-sigma-vm-on-aarch64-darwin.drv: no connected, non-draining worker for system 'aarch64-darwin' offers features {}, the workers offer {}, waiting up to 120s for a worker
wf685hspzqskgphny8cil303cii1rs25-run-sigma-vm-on-aarch64-darwin.drv: no connected, non-draining worker for system 'aarch64-darwin' offers features {}, the workers offer {}
error: no connected, non-draining worker for system 'aarch64-darwin' offers features {}, the workers offer {}
failed checks.aarch64-darwin.package-tf-apply 2m 4s
setup: don't know how to build these paths: /nix/store/pgl242q37zh417xv03xs1l2xlwny3pc3-tf-apply.drv warning: ignoring the client-specified setting 'store', b …
setup:
don't know how to build these paths:
  /nix/store/pgl242q37zh417xv03xs1l2xlwny3pc3-tf-apply.drv
warning: ignoring the client-specified setting 'store', because it is a restricted setting and you are not a trusted user
warning: c9nvx0k0sb7amj6wbdw16pby69qn7g0z-get-clan-secret.drv: no connected, non-draining worker for system 'aarch64-darwin' offers features {}, the workers offer {}, waiting up to 120s for a worker
warning: jly31slxnxn6wi4q6yalpb8mg89gj6jp-opentofu-external-key-provider.drv: no connected, non-draining worker for system 'aarch64-darwin' offers features {}, the workers offer {}, waiting up to 120s for a worker
c9nvx0k0sb7amj6wbdw16pby69qn7g0z-get-clan-secret.drv: no connected, non-draining worker for system 'aarch64-darwin' offers features {}, the workers offer {}
jly31slxnxn6wi4q6yalpb8mg89gj6jp-opentofu-external-key-provider.drv: no connected, non-draining worker for system 'aarch64-darwin' offers features {}, the workers offer {}
error: dependency 'wsz0j307svrcd6abx37n6hh27m051v8l-config.tf.json.drv' failed
failed checks.aarch64-darwin.treefmt 2m 3s
setup: don't know how to build these paths: /nix/store/7iynsijm41cw1zz06anl7i0hpqp7h52a-treefmt-check.drv warning: ignoring the client-specified setting 'stor …
setup:
don't know how to build these paths:
  /nix/store/7iynsijm41cw1zz06anl7i0hpqp7h52a-treefmt-check.drv
warning: ignoring the client-specified setting 'store', because it is a restricted setting and you are not a trusted user
warning: 5hgxdzmp1jj6p6ypl1vg4mld3srm4i23-treefmt.toml.drv: no connected, non-draining worker for system 'aarch64-darwin' offers features {}, the workers offer {}, waiting up to 120s for a worker
5hgxdzmp1jj6p6ypl1vg4mld3srm4i23-treefmt.toml.drv: no connected, non-draining worker for system 'aarch64-darwin' offers features {}, the workers offer {}
error: dependency '787gwwlv7nj1zqq3k1627a3r6gp2kdqa-treefmt.drv' failed
failed checks.aarch64-linux.treefmt 5s
setup: don't know how to build these paths: /nix/store/gq8vkxg1dbnn9pg32lba9c3b8m83yyvr-treefmt-check.drv warning: ignoring the client-specified setting 'stor …
setup:
don't know how to build these paths:
  /nix/store/gq8vkxg1dbnn9pg32lba9c3b8m83yyvr-treefmt-check.drv
warning: ignoring the client-specified setting 'store', because it is a restricted setting and you are not a trusted user
gq8vkxg1dbnn9pg32lba9c3b8m83yyvr-treefmt-check.drv: error: gRPC AddMultipleToStore on 'nix-store.geninf.io:50051' failed: error: some references of path '/nix/store/rnbix0f1rip6cc9h99h2p6rw436y0v0x-actionlint-1.7.12.drv' could not be realised
error: error: gRPC AddMultipleToStore on 'nix-store.geninf.io:50051' failed: error: some references of path '/nix/store/rnbix0f1rip6cc9h99h2p6rw436y0v0x-actionlint-1.7.12.drv' could not be realised
failed checks.x86_64-linux."home-manager-enzime@gaia" 3s
setup: don't know how to build these paths: /nix/store/1nnbcd5d74cwz1nl9shrvxqcxm4cf1fs-home-manager-generation.drv warning: ignoring the client-specified set …
setup:
don't know how to build these paths:
  /nix/store/1nnbcd5d74cwz1nl9shrvxqcxm4cf1fs-home-manager-generation.drv
warning: ignoring the client-specified setting 'store', because it is a restricted setting and you are not a trusted user
2w9biwir12z0pbrf6lw0wi8yji9c9c7c-neovim-0.12.5.drv: error: gRPC AddMultipleToStore on 'nix-store.geninf.io:50051' failed: error: some references of path '/nix/store/40ky95xs7hzv829fkx27y5s0ysijc1yy-vim-command-check-hook.drv' could not be realised
error: dependency '6pz3azaxds60cc05ngk5cj794l5lyibm-home-manager-path.drv' failed
failed checks.x86_64-linux."home-manager-enzime@phi-nixos" 22s
setup: don't know how to build these paths: /nix/store/px98s765b541vv52dkc0fzd8rvlv87mh-home-manager-generation.drv warning: ignoring the client-specified set …
setup:
don't know how to build these paths:
  /nix/store/px98s765b541vv52dkc0fzd8rvlv87mh-home-manager-generation.drv
warning: ignoring the client-specified setting 'store', because it is a restricted setting and you are not a trusted user
px98s765b541vv52dkc0fzd8rvlv87mh-home-manager-generation.drv: error: gRPC AddMultipleToStore on 'nix-store.geninf.io:50051' failed: error: some references of path '/nix/store/hr14sf2vkx43ci0ymrgi6zpl5qfp5kpw-python3.14-sqlalchemy-2.0.51.drv' could not be realised
error: error: gRPC AddMultipleToStore on 'nix-store.geninf.io:50051' failed: error: some references of path '/nix/store/hr14sf2vkx43ci0ymrgi6zpl5qfp5kpw-python3.14-sqlalchemy-2.0.51.drv' could not be realised
failed checks.x86_64-linux.nixos-gaia 1m 7s
setup: /nix/store/k7n7k5axjlj9aifb58fiz8pcjxyiz72w-wayvnc-0.10.2 /nix/store/q8dr0mbn9r3kfqi41a4zfmii0cwl8ivw-xdg-desktop-portal-1.22.1 /nix/store/137nydmz …
setup:
  /nix/store/k7n7k5axjlj9aifb58fiz8pcjxyiz72w-wayvnc-0.10.2
  /nix/store/q8dr0mbn9r3kfqi41a4zfmii0cwl8ivw-xdg-desktop-portal-1.22.1
  /nix/store/137nydmzzxfk2gdwa8h3rxkfrv82g7y6-xdg-desktop-portal-gtk-1.15.3
  /nix/store/9a2jkw3hdk3h8jmh8yicfv346c2b4g4a-xkb-validated
warning: ignoring the client-specified setting 'store', because it is a restricted setting and you are not a trusted user
5x8kknspw9ndvbfx1zx8gbwmmrmhjfg8-home-manager-generation.drv: error: gRPC AddMultipleToStore on 'nix-store.geninf.io:50051' failed: error: some references of path '/nix/store/l861wkfggh3gf9lch7n72rxazg75lvi9-hm-putter.json.drv' could not be realised
0m21irbd31jnz2pwbz73pkdsi6d2awm6-system-path.drv: error: gRPC AddMultipleToStore on 'nix-store.geninf.io:50051' failed: error: path '/nix/store/2zwrqsqly1jf2dnx3x7zw0j8lg6vrgky-locale-binary-path.patch.drv' is required, but there is no substituter that can build it
error: dependency '0m21irbd31jnz2pwbz73pkdsi6d2awm6-system-path.drv' failed
failed checks.x86_64-linux.nixos-sigma 2m 0s
setup: /nix/store/k7n7k5axjlj9aifb58fiz8pcjxyiz72w-wayvnc-0.10.2 /nix/store/q8dr0mbn9r3kfqi41a4zfmii0cwl8ivw-xdg-desktop-portal-1.22.1 /nix/store/137nydmz …
setup:
  /nix/store/k7n7k5axjlj9aifb58fiz8pcjxyiz72w-wayvnc-0.10.2
  /nix/store/q8dr0mbn9r3kfqi41a4zfmii0cwl8ivw-xdg-desktop-portal-1.22.1
  /nix/store/137nydmzzxfk2gdwa8h3rxkfrv82g7y6-xdg-desktop-portal-gtk-1.15.3
  /nix/store/9a2jkw3hdk3h8jmh8yicfv346c2b4g4a-xkb-validated
warning: ignoring the client-specified setting 'store', because it is a restricted setting and you are not a trusted user
56lplclgc05p6nh0ciwi3l3jrhbwv5k7-system-path.drv: error: gRPC AddMultipleToStore on 'nix-store.geninf.io:50051' failed: error: some references of path '/nix/store/c5r6n3sqxnqyj75x49ra4953lsizcp25-captive-browser.drv' could not be realised
2xmpiv12jp9nazjypfk7aggwrhagg5pf-unit-home-manager-enzime.service.drv: error: gRPC AddMultipleToStore on 'nix-store.geninf.io:50051' failed: error: path '/nix/store/zgvx6sh67maajka4ik4sh1xdyphdx3mi-hm-setup-env.drv' is required, but there is no substituter that can build it
error: dependency '56lplclgc05p6nh0ciwi3l3jrhbwv5k7-system-path.drv' failed
failed checks.x86_64-linux.treefmt 7s
setup: /nix/store/x5d9jl8wk20i2fc6w1lbvdp1awb82xyl-python3.14-pyflakes-3.4.0 /nix/store/7hvzxd0qgfw70brc9cvrl914a46n442f-statix-0.5.8-unstable-2026-07-17 …
setup:
  /nix/store/x5d9jl8wk20i2fc6w1lbvdp1awb82xyl-python3.14-pyflakes-3.4.0
  /nix/store/7hvzxd0qgfw70brc9cvrl914a46n442f-statix-0.5.8-unstable-2026-07-17
  /nix/store/fqmf9qkqmdzjw4vvqc56grhbinkzvbkj-statix-config
  /nix/store/58409vv55wxf9h3m14ll3a1z15apsmjx-statix-fix
  /nix/store/9h8b5xam2ldyg2ih4866lcfnn9mv18k7-treefmt.toml
warning: ignoring the client-specified setting 'store', because it is a restricted setting and you are not a trusted user
3zk0cvkcpwlvvkh9flwp9r3vbv29k3y3-treefmt-check.drv: error: gRPC AddMultipleToStore on 'nix-store.geninf.io:50051' failed: error: path '/nix/store/a37w8j7s35czzwads2bk8nxg8mlyl8w4-nil.drv' is required, but there is no substituter that can build it
error: error: gRPC AddMultipleToStore on 'nix-store.geninf.io:50051' failed: error: path '/nix/store/a37w8j7s35czzwads2bk8nxg8mlyl8w4-nil.drv' is required, but there is no substituter that can build it
9 succeeded
succeeded attributes
status attribute duration
loading…
36 already built
skipped attributes
status attribute duration
loading…