nixbot

builds

Enzime/hyperconfig build #1143 failed

branch next · PR #1085 · commit d1d02055b4 · · took 6m 27s · eval 31s

eval warnings 1 kind · 2 occurrences
  • warn A legacy Nextcloud install (from before NixOS 26.11) may be installed. ×2

12 failed
failed attributes
status attribute duration
failed checks.aarch64-darwin.devShell-default 2m 2s
setup: don't know how to build these paths: /nix/store/h7vipsak3qzl8cvr8r1l0sfh99m5r0dy-nix-shell.drv warning: ignoring the client-specified setting 'store', …
setup:
don't know how to build these paths:
  /nix/store/h7vipsak3qzl8cvr8r1l0sfh99m5r0dy-nix-shell.drv
warning: ignoring the client-specified setting 'store', because it is a restricted setting and you are not a trusted user
warning: 79lb25n3gy5iy6hmqs5l8plgz0sxws94-home-manager.drv: no connected, non-draining worker for system 'aarch64-darwin' offers features {}, the workers offer {}, waiting up to 120s for a worker
79lb25n3gy5iy6hmqs5l8plgz0sxws94-home-manager.drv: no connected, non-draining worker for system 'aarch64-darwin' offers features {}, the workers offer {}
error: dependency '79lb25n3gy5iy6hmqs5l8plgz0sxws94-home-manager.drv' failed
failed checks.aarch64-darwin."home-manager-enzime@hyperion-macos" 2m 13s
setup: don't know how to build these paths: /nix/store/m1j5psrrcaiciw340dwrdmah68832k35-home-manager-generation.drv warning: ignoring the client-specified set …
setup:
don't know how to build these paths:
  /nix/store/m1j5psrrcaiciw340dwrdmah68832k35-home-manager-generation.drv
warning: ignoring the client-specified setting 'store', because it is a restricted setting and you are not a trusted user
warning: 79lb25n3gy5iy6hmqs5l8plgz0sxws94-home-manager.drv: no connected, non-draining worker for system 'aarch64-darwin' offers features {}, the workers offer {}, waiting up to 120s for a worker
warning: skckdyv09x09dafnkrqdgvkcmcl2hgkv-options.json.drv: no connected, non-draining worker for system 'aarch64-darwin' offers features {}, the workers offer {}, waiting up to 120s for a worker
79lb25n3gy5iy6hmqs5l8plgz0sxws94-home-manager.drv: no connected, non-draining worker for system 'aarch64-darwin' offers features {}, the workers offer {}
skckdyv09x09dafnkrqdgvkcmcl2hgkv-options.json.drv: no connected, non-draining worker for system 'aarch64-darwin' offers features {}, the workers offer {}
error: dependency 'w622l9dpca9zicrdpjy9j88pk8cqm2i5-home-manager-path.drv' failed
failed checks.aarch64-darwin.nix-darwin-hyperion-macos 2m 12s
setup: warning: 9gkh5i818cr7vcdj7j9j5qy3zgb0b35b-etc-registry.json.drv: no connected, non-draining worker for system 'aarch64-darwin' offers features {}, the wo …
setup:
warning: 9gkh5i818cr7vcdj7j9j5qy3zgb0b35b-etc-registry.json.drv: no connected, non-draining worker for system 'aarch64-darwin' offers features {}, the workers offer {}, waiting up to 120s for a worker
warning: krzm7j38sjkjyl1nzdfdb9741jym0ch4-darwin-version.json.drv: no connected, non-draining worker for system 'aarch64-darwin' offers features {}, the workers offer {}, waiting up to 120s for a worker
warning: skckdyv09x09dafnkrqdgvkcmcl2hgkv-options.json.drv: no connected, non-draining worker for system 'aarch64-darwin' offers features {}, the workers offer {}, waiting up to 120s for a worker
79lb25n3gy5iy6hmqs5l8plgz0sxws94-home-manager.drv: no connected, non-draining worker for system 'aarch64-darwin' offers features {}, the workers offer {}
9gkh5i818cr7vcdj7j9j5qy3zgb0b35b-etc-registry.json.drv: no connected, non-draining worker for system 'aarch64-darwin' offers features {}, the workers offer {}
krzm7j38sjkjyl1nzdfdb9741jym0ch4-darwin-version.json.drv: no connected, non-draining worker for system 'aarch64-darwin' offers features {}, the workers offer {}
skckdyv09x09dafnkrqdgvkcmcl2hgkv-options.json.drv: no connected, non-draining worker for system 'aarch64-darwin' offers features {}, the workers offer {}
error: dependency 'krzm7j38sjkjyl1nzdfdb9741jym0ch4-darwin-version.json.drv' failed
failed checks.aarch64-darwin.package-gaia-vm 2m 1s
setup: don't know how to build these paths: /nix/store/6n5l12ka15bly21fcah0wb58icrpjd79-run-gaia-vm-on-aarch64-darwin.drv warning: ignoring the client-specifi …
setup:
don't know how to build these paths:
  /nix/store/6n5l12ka15bly21fcah0wb58icrpjd79-run-gaia-vm-on-aarch64-darwin.drv
warning: ignoring the client-specified setting 'store', because it is a restricted setting and you are not a trusted user
warning: 6n5l12ka15bly21fcah0wb58icrpjd79-run-gaia-vm-on-aarch64-darwin.drv: no connected, non-draining worker for system 'aarch64-darwin' offers features {}, the workers offer {}, waiting up to 120s for a worker
6n5l12ka15bly21fcah0wb58icrpjd79-run-gaia-vm-on-aarch64-darwin.drv: no connected, non-draining worker for system 'aarch64-darwin' offers features {}, the workers offer {}
error: no connected, non-draining worker for system 'aarch64-darwin' offers features {}, the workers offer {}
failed checks.aarch64-darwin.package-phi-nixos-vm 2m 2s
setup: don't know how to build these paths: /nix/store/7xy50d3q60a44n8rawfmp2hmqfc2hpbf-run-phi-nixos-vm-on-aarch64-darwin.drv warning: ignoring the client-sp …
setup:
don't know how to build these paths:
  /nix/store/7xy50d3q60a44n8rawfmp2hmqfc2hpbf-run-phi-nixos-vm-on-aarch64-darwin.drv
warning: ignoring the client-specified setting 'store', because it is a restricted setting and you are not a trusted user
warning: 7xy50d3q60a44n8rawfmp2hmqfc2hpbf-run-phi-nixos-vm-on-aarch64-darwin.drv: no connected, non-draining worker for system 'aarch64-darwin' offers features {}, the workers offer {}, waiting up to 120s for a worker
7xy50d3q60a44n8rawfmp2hmqfc2hpbf-run-phi-nixos-vm-on-aarch64-darwin.drv: no connected, non-draining worker for system 'aarch64-darwin' offers features {}, the workers offer {}
error: no connected, non-draining worker for system 'aarch64-darwin' offers features {}, the workers offer {}
failed checks.aarch64-darwin.package-sigma-vm 2m 2s
setup: this derivation will be built: /nix/store/9pfj9kffs66hwxjx153kf5qwinyx3r44-run-sigma-vm-on-aarch64-darwin.drv warning: ignoring the client-specified se …
setup:
this derivation will be built:
  /nix/store/9pfj9kffs66hwxjx153kf5qwinyx3r44-run-sigma-vm-on-aarch64-darwin.drv
warning: ignoring the client-specified setting 'store', because it is a restricted setting and you are not a trusted user
warning: 9pfj9kffs66hwxjx153kf5qwinyx3r44-run-sigma-vm-on-aarch64-darwin.drv: no connected, non-draining worker for system 'aarch64-darwin' offers features {}, the workers offer {}, waiting up to 120s for a worker
9pfj9kffs66hwxjx153kf5qwinyx3r44-run-sigma-vm-on-aarch64-darwin.drv: no connected, non-draining worker for system 'aarch64-darwin' offers features {}, the workers offer {}
error: no connected, non-draining worker for system 'aarch64-darwin' offers features {}, the workers offer {}
failed checks.aarch64-darwin.treefmt 2m 2s
setup: don't know how to build these paths: /nix/store/galpgcg6cpxb12w9dcvscb13ki8l2kbj-treefmt-check.drv warning: ignoring the client-specified setting 'stor …
setup:
don't know how to build these paths:
  /nix/store/galpgcg6cpxb12w9dcvscb13ki8l2kbj-treefmt-check.drv
warning: ignoring the client-specified setting 'store', because it is a restricted setting and you are not a trusted user
warning: 5hgxdzmp1jj6p6ypl1vg4mld3srm4i23-treefmt.toml.drv: no connected, non-draining worker for system 'aarch64-darwin' offers features {}, the workers offer {}, waiting up to 120s for a worker
5hgxdzmp1jj6p6ypl1vg4mld3srm4i23-treefmt.toml.drv: no connected, non-draining worker for system 'aarch64-darwin' offers features {}, the workers offer {}
error: dependency '787gwwlv7nj1zqq3k1627a3r6gp2kdqa-treefmt.drv' failed
failed checks.aarch64-linux.devShell-default 6s
setup: don't know how to build these paths: /nix/store/zx8m6b0m2nnbfmfk10zjggw970g8nv5n-nix-shell.drv warning: ignoring the client-specified setting 'store', …
setup:
don't know how to build these paths:
  /nix/store/zx8m6b0m2nnbfmfk10zjggw970g8nv5n-nix-shell.drv
warning: ignoring the client-specified setting 'store', because it is a restricted setting and you are not a trusted user
pkj9hw918rpm0xdmrxmgdyk4dvpy208i-home-manager.drv: error: gRPC AddMultipleToStore on 'nix-store.geninf.io:50051' failed: error: some references of path '/nix/store/7ix3jswjcl56qkc937hcm7y9igmhvvzc-inetutils-2.7.drv' could not be realised
error: dependency 'pkj9hw918rpm0xdmrxmgdyk4dvpy208i-home-manager.drv' failed
failed checks.aarch64-linux.treefmt 22s
setup: /nix/store/dk6y51p9l3c0sgwvj494i1jq6rnfhzjp-python3.14-pyflakes-3.4.0 /nix/store/w9s5sw6pdlfwnpxh2s1jmbmlwligwwa2-statix-0.5.8-unstable-2026-07-17 …
setup:
  /nix/store/dk6y51p9l3c0sgwvj494i1jq6rnfhzjp-python3.14-pyflakes-3.4.0
  /nix/store/w9s5sw6pdlfwnpxh2s1jmbmlwligwwa2-statix-0.5.8-unstable-2026-07-17
  /nix/store/rdh9wsj7wvmrbrxmcbzajdk5sym7wlcf-statix-config
  /nix/store/wv2fcngsm61yczsh9ddaj9q9bi7wkzra-statix-fix
  /nix/store/i1b9pzkjf5v57dm6xs7a925c4kyia5rh-treefmt.toml
warning: ignoring the client-specified setting 'store', because it is a restricted setting and you are not a trusted user
5nrjndswr2ribi5d3d7q9dlzk2prr2cg-treefmt-check.drv: error: gRPC AddMultipleToStore on 'nix-store.geninf.io:50051' failed: error: some references of path '/nix/store/rnbix0f1rip6cc9h99h2p6rw436y0v0x-actionlint-1.7.12.drv' could not be realised
error: error: gRPC AddMultipleToStore on 'nix-store.geninf.io:50051' failed: error: some references of path '/nix/store/rnbix0f1rip6cc9h99h2p6rw436y0v0x-actionlint-1.7.12.drv' could not be realised
failed checks.x86_64-linux."home-manager-enzime@gaia" 1m 40s
setup: don't know how to build these paths: /nix/store/yhgmi1d9k0vxbyj60igvpk66457jxb49-home-manager-generation.drv warning: ignoring the client-specified set …
setup:
don't know how to build these paths:
  /nix/store/yhgmi1d9k0vxbyj60igvpk66457jxb49-home-manager-generation.drv
warning: ignoring the client-specified setting 'store', because it is a restricted setting and you are not a trusted user
9jvv2d6sk88j50ziak55nc9gaxc5x0pl-home-manager-files.drv: error: gRPC AddMultipleToStore on 'nix-store.geninf.io:50051' failed: error: path '/nix/store/6r6jccqi098bldjcansx1gwf2w6wx2ql-hm_..zprofile.drv' is required, but there is no substituter that can build it
error: dependency '9jvv2d6sk88j50ziak55nc9gaxc5x0pl-home-manager-files.drv' failed
failed checks.x86_64-linux.nixos-gaia 5m 2s
setup: /nix/store/v3hgx51b94r4hda8r3sjs5fl2s1sdw9w-system-generators /nix/store/zw1l32vxiy0hcdcix06sq9pn8ckwqcvj-system-shutdown /nix/store/77lp2im2k4f5yp …
setup:
  /nix/store/v3hgx51b94r4hda8r3sjs5fl2s1sdw9w-system-generators
  /nix/store/zw1l32vxiy0hcdcix06sq9pn8ckwqcvj-system-shutdown
  /nix/store/77lp2im2k4f5ypgb1w1582z9vbcz3670-user-generators
  /nix/store/8qgj3ykbglavj3ss8ykwyl00c2xk0snn-wayvnc-headless.service
  /nix/store/9a2jkw3hdk3h8jmh8yicfv346c2b4g4a-xkb-validated
warning: ignoring the client-specified setting 'store', because it is a restricted setting and you are not a trusted user
4a6mrprqyass83xwm3p94g87nrwc7q9j-system-units.drv: error: gRPC AddMultipleToStore on 'nix-store.geninf.io:50051' failed: error: some references of path '/nix/store/3ybqsinclswrd51p80jhha5zg36f58vd-templ-0.3.1020.drv' could not be realised
error: dependency 'miy2qw3ld5jfydplv7djx3zaw5xqjkq9-etc.drv' failed
failed checks.x86_64-linux.nixos-sigma 4m 58s
setup: don't know how to build these paths: /nix/store/0lwp644f81ipflrya3fgwkbz01rf764z-nixos-system-sigma-26.11.20261007.7dd199b.drv warning: ignoring the cl …
setup:
don't know how to build these paths:
  /nix/store/0lwp644f81ipflrya3fgwkbz01rf764z-nixos-system-sigma-26.11.20261007.7dd199b.drv
warning: ignoring the client-specified setting 'store', because it is a restricted setting and you are not a trusted user
fd4yl9nfajbdqi1x1ads49fxnik0cyhs-unit-polkit.service.drv: error: gRPC AddMultipleToStore on 'nix-store.geninf.io:50051' failed: error: some references of path '/nix/store/py2f9axcbpd2zr5fmxs8zvd6knv2cqm9-X-Reload-Triggers-polkit.drv' could not be realised
02ir2wa7c2zpp6wabgyia2qlz0pkrpsm-user-units.drv: error: gRPC AddMultipleToStore on 'nix-store.geninf.io:50051' failed: error: path '/nix/store/81bnk1vpwiqg9r3fmyh2ipc1wpd1vcca-unit-geoclue-agent.service.drv' is required, but there is no substituter that can build it
error: dependency 'vn9nwn1irg00w06bfv4wbrsjhq9ffv5f-etc.drv' failed
11 succeeded ⚠ 1
succeeded attributes
status attribute duration
succeeded checks.x86_64-linux.nixos-phi-nixos
  • A legacy Nextcloud install (from before NixOS 26.11) may be installed. After nextcloud33 is installed successfully, you can safely upgrade to 34. The latest version available is Nextcloud35. Please note that Nextcloud doesn't support upgrades across multiple major versions (i.e. an upgrade from 16 is possible to 17, but not 16 to 18). The package can be upgraded by explicitly declaring the service-option `services.nextcloud.package`.
  • A legacy Nextcloud install (from before NixOS 26.11) may be installed. After nextcloud34 is installed successfully, you can safely upgrade to 35. The latest version available is Nextcloud35. Please note that Nextcloud doesn't support upgrades across multiple major versions (i.e. an upgrade from 16 is possible to 17, but not 16 to 18). The package can be upgraded by explicitly declaring the service-option `services.nextcloud.package`.
5m 51s
succeeded checks.aarch64-linux.package-gaia-vm 4s
succeeded checks.aarch64-linux.package-phi-nixos-vm 6s
succeeded checks.aarch64-linux.package-sigma-vm 5s
succeeded checks.x86_64-linux.devShell-default 10s
succeeded checks.x86_64-linux."home-manager-enzime@phi-nixos" 3m 24s
succeeded checks.x86_64-linux."home-manager-enzime@sigma" 3m 12s
succeeded checks.x86_64-linux.package-gaia-vm 5s
succeeded checks.x86_64-linux.package-phi-nixos-vm 4s
succeeded checks.x86_64-linux.package-sigma-vm 25s
succeeded checks.x86_64-linux.treefmt 6s
36 already built
skipped attributes
status attribute duration
loading…