nixbot

builds

Enzime/hyperconfig build #1146 failed

branch next · PR #1088 · commit ed9b0b7cbb · · took 3m 20s · eval 43s

eval warnings 1 kind · 2 occurrences
  • warn A legacy Nextcloud install (from before NixOS 26.11) may be installed. ×2

16 failed ⚠ 1
failed attributes
status attribute duration
failed checks.x86_64-linux.nixos-phi-nixos
  • A legacy Nextcloud install (from before NixOS 26.11) may be installed. After nextcloud33 is installed successfully, you can safely upgrade to 34. The latest version available is Nextcloud35. Please note that Nextcloud doesn't support upgrades across multiple major versions (i.e. an upgrade from 16 is possible to 17, but not 16 to 18). The package can be upgraded by explicitly declaring the service-option `services.nextcloud.package`.
  • A legacy Nextcloud install (from before NixOS 26.11) may be installed. After nextcloud34 is installed successfully, you can safely upgrade to 35. The latest version available is Nextcloud35. Please note that Nextcloud doesn't support upgrades across multiple major versions (i.e. an upgrade from 16 is possible to 17, but not 16 to 18). The package can be upgraded by explicitly declaring the service-option `services.nextcloud.package`.
2m 24s
setup: don't know how to build these paths: /nix/store/2z7yfp6ir4i7iy4k10yjphihb3b6lxr2-nixos-system-phi-nixos-26.11.20261007.7dd199b.drv warning: ignoring th …
setup:
don't know how to build these paths:
  /nix/store/2z7yfp6ir4i7iy4k10yjphihb3b6lxr2-nixos-system-phi-nixos-26.11.20261007.7dd199b.drv
warning: ignoring the client-specified setting 'store', because it is a restricted setting and you are not a trusted user
f1a6b35kjvqgyncq3w44r0mhcj2xdqf5-activate.drv: error: gRPC AddMultipleToStore on 'nix-store.geninf.io:50051' failed: error: path '/nix/store/589zzba9rd59fzakv4ksb76aqgi2mdqi-manifest-for-users.json.drv' is required, but there is no substituter that can build it
error: dependency 'f1a6b35kjvqgyncq3w44r0mhcj2xdqf5-activate.drv' failed
failed checks.aarch64-darwin."home-manager-enzime@hyperion-macos" 2m 12s
setup: warning: ignoring the client-specified setting 'store', because it is a restricted setting and you are not a trusted user warning: 07wq8kb4l5k246bkgssli6 …
setup:
warning: ignoring the client-specified setting 'store', because it is a restricted setting and you are not a trusted user
warning: 07wq8kb4l5k246bkgssli6xya6acajcz-home-manager-path.drv: no connected, non-draining worker for system 'aarch64-darwin' offers features {}, the workers offer {}, waiting up to 120s for a worker
warning: m1s7ava6msnw886wi58l9p31gabqqpq7-home-manager-fonts.drv: no connected, non-draining worker for system 'aarch64-darwin' offers features {}, the workers offer {}, waiting up to 120s for a worker
warning: nx9p4ykxwq34sl2smaikg9hxlxcv6zzk-home-manager-applications.drv: no connected, non-draining worker for system 'aarch64-darwin' offers features {}, the workers offer {}, waiting up to 120s for a worker
07wq8kb4l5k246bkgssli6xya6acajcz-home-manager-path.drv: no connected, non-draining worker for system 'aarch64-darwin' offers features {}, the workers offer {}
m1s7ava6msnw886wi58l9p31gabqqpq7-home-manager-fonts.drv: no connected, non-draining worker for system 'aarch64-darwin' offers features {}, the workers offer {}
nx9p4ykxwq34sl2smaikg9hxlxcv6zzk-home-manager-applications.drv: no connected, non-draining worker for system 'aarch64-darwin' offers features {}, the workers offer {}
error: dependency '07wq8kb4l5k246bkgssli6xya6acajcz-home-manager-path.drv' failed
failed checks.aarch64-darwin.nix-darwin-hyperion-macos 2m 3s
setup: warning: ignoring the client-specified setting 'store', because it is a restricted setting and you are not a trusted user warning: 4j5y3pfp96r3hksdb0x3hk …
setup:
warning: ignoring the client-specified setting 'store', because it is a restricted setting and you are not a trusted user
warning: 4j5y3pfp96r3hksdb0x3hkxip2y5j3d7-etc-registry.json.drv: no connected, non-draining worker for system 'aarch64-darwin' offers features {}, the workers offer {}, waiting up to 120s for a worker
warning: 9dvqy3ndpq9v2nvcwic58n5wcj9xpa6z-home-manager-generation.drv: no connected, non-draining worker for system 'aarch64-darwin' offers features {}, the workers offer {}, waiting up to 120s for a worker
warning: vl51rv0glfr6vygjssh8m1inacavvx0b-darwin-version.json.drv: no connected, non-draining worker for system 'aarch64-darwin' offers features {}, the workers offer {}, waiting up to 120s for a worker
4j5y3pfp96r3hksdb0x3hkxip2y5j3d7-etc-registry.json.drv: no connected, non-draining worker for system 'aarch64-darwin' offers features {}, the workers offer {}
9dvqy3ndpq9v2nvcwic58n5wcj9xpa6z-home-manager-generation.drv: no connected, non-draining worker for system 'aarch64-darwin' offers features {}, the workers offer {}
vl51rv0glfr6vygjssh8m1inacavvx0b-darwin-version.json.drv: no connected, non-draining worker for system 'aarch64-darwin' offers features {}, the workers offer {}
error: dependency 'pwcd7df4pd2lxwqd2n3d5si5s6wy02lp-activation-enzime.drv' failed
failed checks.aarch64-darwin.package-gaia-vm 2m 4s
setup: don't know how to build these paths: /nix/store/5x3n9sxlwm7sn7g1yy0i1a8nan8avgyp-run-gaia-vm-on-aarch64-darwin.drv warning: ignoring the client-specifi …
setup:
don't know how to build these paths:
  /nix/store/5x3n9sxlwm7sn7g1yy0i1a8nan8avgyp-run-gaia-vm-on-aarch64-darwin.drv
warning: ignoring the client-specified setting 'store', because it is a restricted setting and you are not a trusted user
warning: 5x3n9sxlwm7sn7g1yy0i1a8nan8avgyp-run-gaia-vm-on-aarch64-darwin.drv: no connected, non-draining worker for system 'aarch64-darwin' offers features {}, the workers offer {}, waiting up to 120s for a worker
5x3n9sxlwm7sn7g1yy0i1a8nan8avgyp-run-gaia-vm-on-aarch64-darwin.drv: no connected, non-draining worker for system 'aarch64-darwin' offers features {}, the workers offer {}
error: no connected, non-draining worker for system 'aarch64-darwin' offers features {}, the workers offer {}
failed checks.aarch64-darwin.package-phi-nixos-vm 2m 2s
setup: don't know how to build these paths: /nix/store/i0ldjfr2m3rnj1x0nfini1cliwkkci9y-run-phi-nixos-vm-on-aarch64-darwin.drv warning: ignoring the client-sp …
setup:
don't know how to build these paths:
  /nix/store/i0ldjfr2m3rnj1x0nfini1cliwkkci9y-run-phi-nixos-vm-on-aarch64-darwin.drv
warning: ignoring the client-specified setting 'store', because it is a restricted setting and you are not a trusted user
warning: i0ldjfr2m3rnj1x0nfini1cliwkkci9y-run-phi-nixos-vm-on-aarch64-darwin.drv: no connected, non-draining worker for system 'aarch64-darwin' offers features {}, the workers offer {}, waiting up to 120s for a worker
i0ldjfr2m3rnj1x0nfini1cliwkkci9y-run-phi-nixos-vm-on-aarch64-darwin.drv: no connected, non-draining worker for system 'aarch64-darwin' offers features {}, the workers offer {}
error: no connected, non-draining worker for system 'aarch64-darwin' offers features {}, the workers offer {}
failed checks.aarch64-darwin.package-sigma-vm 2m 0s
setup: don't know how to build these paths: /nix/store/qjz3ms6pv99k6q44a4xadm5sm7w63m23-run-sigma-vm-on-aarch64-darwin.drv warning: ignoring the client-specif …
setup:
don't know how to build these paths:
  /nix/store/qjz3ms6pv99k6q44a4xadm5sm7w63m23-run-sigma-vm-on-aarch64-darwin.drv
warning: ignoring the client-specified setting 'store', because it is a restricted setting and you are not a trusted user
warning: qjz3ms6pv99k6q44a4xadm5sm7w63m23-run-sigma-vm-on-aarch64-darwin.drv: no connected, non-draining worker for system 'aarch64-darwin' offers features {}, the workers offer {}, waiting up to 120s for a worker
qjz3ms6pv99k6q44a4xadm5sm7w63m23-run-sigma-vm-on-aarch64-darwin.drv: no connected, non-draining worker for system 'aarch64-darwin' offers features {}, the workers offer {}
error: no connected, non-draining worker for system 'aarch64-darwin' offers features {}, the workers offer {}
failed checks.aarch64-darwin.package-tf-init 2m 5s
setup: don't know how to build these paths: /nix/store/8v97s1gm1rqxa4hfmmwnn2cw8zjad837-tf-init.drv warning: ignoring the client-specified setting 'store', be …
setup:
don't know how to build these paths:
  /nix/store/8v97s1gm1rqxa4hfmmwnn2cw8zjad837-tf-init.drv
warning: ignoring the client-specified setting 'store', because it is a restricted setting and you are not a trusted user
warning: wsz0j307svrcd6abx37n6hh27m051v8l-config.tf.json.drv: no connected, non-draining worker for system 'aarch64-darwin' offers features {}, the workers offer {}, waiting up to 120s for a worker
wsz0j307svrcd6abx37n6hh27m051v8l-config.tf.json.drv: no connected, non-draining worker for system 'aarch64-darwin' offers features {}, the workers offer {}
error: dependency 'wsz0j307svrcd6abx37n6hh27m051v8l-config.tf.json.drv' failed
failed checks.aarch64-darwin.treefmt 2m 3s
setup: /nix/store/925b3zxz1j0984ywkl3y35v0bbrda2k9-statix-0.5.8-unstable-2026-07-17 /nix/store/775mmr2czhrfc7p45i9rwp5imkb7wcvd-statix-config /nix/store/q …
setup:
  /nix/store/925b3zxz1j0984ywkl3y35v0bbrda2k9-statix-0.5.8-unstable-2026-07-17
  /nix/store/775mmr2czhrfc7p45i9rwp5imkb7wcvd-statix-config
  /nix/store/q3s56vfx8n9d3l5pp9jl7kq3ncpa0fw4-statix-fix
  /nix/store/m965417sqcxjj5dj6wmhd4a57a1nx6jk-treefmt.toml
warning: ignoring the client-specified setting 'store', because it is a restricted setting and you are not a trusted user
warning: 5hgxdzmp1jj6p6ypl1vg4mld3srm4i23-treefmt.toml.drv: no connected, non-draining worker for system 'aarch64-darwin' offers features {}, the workers offer {}, waiting up to 120s for a worker
5hgxdzmp1jj6p6ypl1vg4mld3srm4i23-treefmt.toml.drv: no connected, non-draining worker for system 'aarch64-darwin' offers features {}, the workers offer {}
error: dependency '787gwwlv7nj1zqq3k1627a3r6gp2kdqa-treefmt.drv' failed
failed checks.aarch64-linux.devShell-default 11s
setup: don't know how to build these paths: /nix/store/r4mb68hv8pxykxfkkqmkz59yh41wwcrh-nix-shell.drv warning: ignoring the client-specified setting 'store', …
setup:
don't know how to build these paths:
  /nix/store/r4mb68hv8pxykxfkkqmkz59yh41wwcrh-nix-shell.drv
warning: ignoring the client-specified setting 'store', because it is a restricted setting and you are not a trusted user
r4mb68hv8pxykxfkkqmkz59yh41wwcrh-nix-shell.drv: error: gRPC AddMultipleToStore on 'nix-store.geninf.io:50051' failed: error: a concurrent upload of '/nix/store/fi17140nscf5wcvwp0ix7d33cgpr6bgr-opentofu-1.13.1.drv' failed
error: error: gRPC AddMultipleToStore on 'nix-store.geninf.io:50051' failed: error: a concurrent upload of '/nix/store/fi17140nscf5wcvwp0ix7d33cgpr6bgr-opentofu-1.13.1.drv' failed
failed checks.aarch64-linux.package-tf-apply 17s
setup: 25kss3zw4bm1rnyhl3nsj8wcpy8xs1sf-config.tf.json.drv: build01: build01: input not substitutable: error: path '/nix/store/3aw2mzjm25zdndvnynizc4dx8jvw51y2- …
setup:
25kss3zw4bm1rnyhl3nsj8wcpy8xs1sf-config.tf.json.drv: build01: build01: input not substitutable: error: path '/nix/store/3aw2mzjm25zdndvnynizc4dx8jvw51y2-opentofu-external-key-provider' is required, but there is no substituter that can build it, asking the scheduler again
25kss3zw4bm1rnyhl3nsj8wcpy8xs1sf-config.tf.json.drv: build01: build01: input not substitutable: error: path '/nix/store/3aw2mzjm25zdndvnynizc4dx8jvw51y2-opentofu-external-key-provider' is required, but there is no substituter that can build it, asking the scheduler again
25kss3zw4bm1rnyhl3nsj8wcpy8xs1sf-config.tf.json.drv: build01: the build this call attached to did not finish, retry, asking the scheduler again
25kss3zw4bm1rnyhl3nsj8wcpy8xs1sf-config.tf.json.drv: build01: the build this call attached to did not finish, retry, asking the scheduler again
25kss3zw4bm1rnyhl3nsj8wcpy8xs1sf-config.tf.json.drv: build01: the build this call attached to did not finish, retry, asking the scheduler again
25kss3zw4bm1rnyhl3nsj8wcpy8xs1sf-config.tf.json.drv: build01: the build this call attached to did not finish, retry, asking the scheduler again
25kss3zw4bm1rnyhl3nsj8wcpy8xs1sf-config.tf.json.drv: build01: the build this call attached to did not finish, retry, asking the scheduler again
error: dependency '25kss3zw4bm1rnyhl3nsj8wcpy8xs1sf-config.tf.json.drv' failed
failed checks.aarch64-linux.package-tf-destroy 17s
setup: 25kss3zw4bm1rnyhl3nsj8wcpy8xs1sf-config.tf.json.drv: build01: the build this call attached to did not finish, retry, asking the scheduler again 25kss3zw4 …
setup:
25kss3zw4bm1rnyhl3nsj8wcpy8xs1sf-config.tf.json.drv: build01: the build this call attached to did not finish, retry, asking the scheduler again
25kss3zw4bm1rnyhl3nsj8wcpy8xs1sf-config.tf.json.drv: build01: the build this call attached to did not finish, retry, asking the scheduler again
25kss3zw4bm1rnyhl3nsj8wcpy8xs1sf-config.tf.json.drv: build01: build01: input not substitutable: error: path '/nix/store/3aw2mzjm25zdndvnynizc4dx8jvw51y2-opentofu-external-key-provider' is required, but there is no substituter that can build it, asking the scheduler again
25kss3zw4bm1rnyhl3nsj8wcpy8xs1sf-config.tf.json.drv: build01: the build this call attached to did not finish, retry, asking the scheduler again
25kss3zw4bm1rnyhl3nsj8wcpy8xs1sf-config.tf.json.drv: build01: build01: input not substitutable: error: path '/nix/store/3aw2mzjm25zdndvnynizc4dx8jvw51y2-opentofu-external-key-provider' is required, but there is no substituter that can build it, asking the scheduler again
25kss3zw4bm1rnyhl3nsj8wcpy8xs1sf-config.tf.json.drv: build01: build01: input not substitutable: error: path '/nix/store/3aw2mzjm25zdndvnynizc4dx8jvw51y2-opentofu-external-key-provider' is required, but there is no substituter that can build it, asking the scheduler again
25kss3zw4bm1rnyhl3nsj8wcpy8xs1sf-config.tf.json.drv: build01: the build this call attached to did not finish, retry, asking the scheduler again
error: dependency '25kss3zw4bm1rnyhl3nsj8wcpy8xs1sf-config.tf.json.drv' failed
failed checks.aarch64-linux.package-tf-init 18s
setup: 25kss3zw4bm1rnyhl3nsj8wcpy8xs1sf-config.tf.json.drv: build01: the build this call attached to did not finish, retry, asking the scheduler again 25kss3zw4 …
setup:
25kss3zw4bm1rnyhl3nsj8wcpy8xs1sf-config.tf.json.drv: build01: the build this call attached to did not finish, retry, asking the scheduler again
25kss3zw4bm1rnyhl3nsj8wcpy8xs1sf-config.tf.json.drv: build01: the build this call attached to did not finish, retry, asking the scheduler again
25kss3zw4bm1rnyhl3nsj8wcpy8xs1sf-config.tf.json.drv: build01: the build this call attached to did not finish, retry, asking the scheduler again
25kss3zw4bm1rnyhl3nsj8wcpy8xs1sf-config.tf.json.drv: build01: build01: input not substitutable: error: path '/nix/store/3aw2mzjm25zdndvnynizc4dx8jvw51y2-opentofu-external-key-provider' is required, but there is no substituter that can build it, asking the scheduler again
25kss3zw4bm1rnyhl3nsj8wcpy8xs1sf-config.tf.json.drv: build01: the build this call attached to did not finish, retry, asking the scheduler again
25kss3zw4bm1rnyhl3nsj8wcpy8xs1sf-config.tf.json.drv: build01: the build this call attached to did not finish, retry, asking the scheduler again
25kss3zw4bm1rnyhl3nsj8wcpy8xs1sf-config.tf.json.drv: build01: build01: input not substitutable: error: path '/nix/store/3aw2mzjm25zdndvnynizc4dx8jvw51y2-opentofu-external-key-provider' is required, but there is no substituter that can build it, asking the scheduler again
error: dependency '25kss3zw4bm1rnyhl3nsj8wcpy8xs1sf-config.tf.json.drv' failed
failed checks.aarch64-linux.treefmt 8s
setup: don't know how to build these paths: /nix/store/26c1w7wim67apq5d3wg2ghhsbgny3av4-treefmt-check.drv warning: ignoring the client-specified setting 'stor …
setup:
don't know how to build these paths:
  /nix/store/26c1w7wim67apq5d3wg2ghhsbgny3av4-treefmt-check.drv
warning: ignoring the client-specified setting 'store', because it is a restricted setting and you are not a trusted user
26c1w7wim67apq5d3wg2ghhsbgny3av4-treefmt-check.drv: error: gRPC AddMultipleToStore on 'nix-store.geninf.io:50051' failed: error: some references of path '/nix/store/rnbix0f1rip6cc9h99h2p6rw436y0v0x-actionlint-1.7.12.drv' could not be realised
error: error: gRPC AddMultipleToStore on 'nix-store.geninf.io:50051' failed: error: some references of path '/nix/store/rnbix0f1rip6cc9h99h2p6rw436y0v0x-actionlint-1.7.12.drv' could not be realised
failed checks.x86_64-linux."home-manager-enzime@gaia" 39s
setup: 5z28vzrxdk30z342nil8qj7rq3cgrsxk-home-manager-generation.drv: web01: web01: input not substitutable: error: some references of path '/nix/store/vfr5dwmrh …
setup:
5z28vzrxdk30z342nil8qj7rq3cgrsxk-home-manager-generation.drv: web01: web01: input not substitutable: error: some references of path '/nix/store/vfr5dwmrhswnfccy4wr13sv6kj7zx3yf-hm-putter.json' could not be realised, asking the scheduler again
5z28vzrxdk30z342nil8qj7rq3cgrsxk-home-manager-generation.drv: web01: web01: input not substitutable: error: some references of path '/nix/store/vfr5dwmrhswnfccy4wr13sv6kj7zx3yf-hm-putter.json' could not be realised, asking the scheduler again
5z28vzrxdk30z342nil8qj7rq3cgrsxk-home-manager-generation.drv: web01: web01: input not substitutable: error: some references of path '/nix/store/vfr5dwmrhswnfccy4wr13sv6kj7zx3yf-hm-putter.json' could not be realised, asking the scheduler again
5z28vzrxdk30z342nil8qj7rq3cgrsxk-home-manager-generation.drv: web01: web01: input not substitutable: error: some references of path '/nix/store/vfr5dwmrhswnfccy4wr13sv6kj7zx3yf-hm-putter.json' could not be realised, asking the scheduler again
5z28vzrxdk30z342nil8qj7rq3cgrsxk-home-manager-generation.drv: web01: web01: input not substitutable: error: some references of path '/nix/store/vfr5dwmrhswnfccy4wr13sv6kj7zx3yf-hm-putter.json' could not be realised, asking the scheduler again
5z28vzrxdk30z342nil8qj7rq3cgrsxk-home-manager-generation.drv: web01: web01: input not substitutable: error: some references of path '/nix/store/vfr5dwmrhswnfccy4wr13sv6kj7zx3yf-hm-putter.json' could not be realised, asking the scheduler again
5z28vzrxdk30z342nil8qj7rq3cgrsxk-home-manager-generation.drv: web01: web01: input not substitutable: error: some references of path '/nix/store/vfr5dwmrhswnfccy4wr13sv6kj7zx3yf-hm-putter.json' could not be realised, asking the scheduler again
error: gave up after 9 reschedules
failed checks.x86_64-linux.nixos-gaia 1m 4s
setup: don't know how to build these paths: /nix/store/86s2f6iflsak93046hrqii4imlm2dapm-nixos-system-gaia-26.11.20261007.7dd199b.drv warning: ignoring the cli …
setup:
don't know how to build these paths:
  /nix/store/86s2f6iflsak93046hrqii4imlm2dapm-nixos-system-gaia-26.11.20261007.7dd199b.drv
warning: ignoring the client-specified setting 'store', because it is a restricted setting and you are not a trusted user
84fbn8lh4v03a3wy489ihrcd57lfxh1p-home-manager-generation.drv: error: gRPC AddMultipleToStore on 'nix-store.geninf.io:50051' failed: error: some references of path '/nix/store/l861wkfggh3gf9lch7n72rxazg75lvi9-hm-putter.json.drv' could not be realised
error: dependency 'm4m271zsfs0j9l9m891r6yqz9hqr2pkb-etc.drv' failed
failed checks.x86_64-linux.nixos-sigma 2m 33s
setup: don't know how to build these paths: /nix/store/0drq8xms4k8fv26zx1gvg2qq3hxkkz45-nixos-system-sigma-26.11.20261007.7dd199b.drv warning: ignoring the cl …
setup:
don't know how to build these paths:
  /nix/store/0drq8xms4k8fv26zx1gvg2qq3hxkkz45-nixos-system-sigma-26.11.20261007.7dd199b.drv
warning: ignoring the client-specified setting 'store', because it is a restricted setting and you are not a trusted user
w246a7ki4hc2j0h0lwihjlh7rkpyyrrr-user-units.drv: error: gRPC AddMultipleToStore on 'nix-store.geninf.io:50051' failed: error: path '/nix/store/81bnk1vpwiqg9r3fmyh2ipc1wpd1vcca-unit-geoclue-agent.service.drv' is required, but there is no substituter that can build it
chq7k6ypxk8cjd51l5m1clwi0hzhxv2a-unit-polkit.service.drv: error: gRPC AddMultipleToStore on 'nix-store.geninf.io:50051' failed: error: some references of path '/nix/store/py2f9axcbpd2zr5fmxs8zvd6knv2cqm9-X-Reload-Triggers-polkit.drv' could not be realised
error: dependency 'n26xy1b26vbhpz1aixhhnx84l8cxxnvc-etc.drv' failed
11 succeeded
succeeded attributes
status attribute duration
loading…
32 already built
skipped attributes
status attribute duration
loading…