nixbot

builds

Enzime/hyperconfig build #1145 failed

branch next · PR #1087 · commit f57552ea2b · · took 4m 53s · eval 51s

eval warnings 1 kind · 2 occurrences
  • warn A legacy Nextcloud install (from before NixOS 26.11) may be installed. ×2

19 failed
failed attributes
status attribute duration
failed checks.aarch64-darwin.devShell-default 2m 4s
setup: /nix/store/g4i7g6gzbwy3f200x4i0xsvlznrnp2m8-python3.14-pyproject-hooks-1.2.0 /nix/store/5091q5r44zpnd6rw1kjs22kcj4vdmxhk-python3.14-wheel-0.47.0 /n …
setup:
  /nix/store/g4i7g6gzbwy3f200x4i0xsvlznrnp2m8-python3.14-pyproject-hooks-1.2.0
  /nix/store/5091q5r44zpnd6rw1kjs22kcj4vdmxhk-python3.14-wheel-0.47.0
  /nix/store/ykjjacd8w080i2lz777q3jhkp0zs94ac-terraform-provider-external-2.4.2
  /nix/store/dgnc0b0nzyal6b4cc7chid6zbpg0hc0z-wrap-python-hook
warning: ignoring the client-specified setting 'store', because it is a restricted setting and you are not a trusted user
warning: 85fhyjq90qlqmy9dgafrx9ph1jcri4y1-clan-runtime.drv: no connected, non-draining worker for system 'aarch64-darwin' offers features {}, the workers offer {}, waiting up to 120s for a worker
85fhyjq90qlqmy9dgafrx9ph1jcri4y1-clan-runtime.drv: no connected, non-draining worker for system 'aarch64-darwin' offers features {}, the workers offer {}
error: dependency 'b6575pv542axhjkmdr839abdch7zwbga-clan-cli.drv' failed
failed checks.aarch64-darwin."home-manager-enzime@hyperion-macos" 2m 8s
setup: don't know how to build these paths: /nix/store/7zys36bxipjqq5hshzxz4lnrp1hyyq3m-home-manager-generation.drv warning: ignoring the client-specified set …
setup:
don't know how to build these paths:
  /nix/store/7zys36bxipjqq5hshzxz4lnrp1hyyq3m-home-manager-generation.drv
warning: ignoring the client-specified setting 'store', because it is a restricted setting and you are not a trusted user
warning: 6vwmrq0qjvxx4kiag925maq93g7vz5id-options.json.drv: no connected, non-draining worker for system 'aarch64-darwin' offers features {}, the workers offer {}, waiting up to 120s for a worker
6vwmrq0qjvxx4kiag925maq93g7vz5id-options.json.drv: no connected, non-draining worker for system 'aarch64-darwin' offers features {}, the workers offer {}
error: dependency '2w40w85bbmasmadddz0v3004rr206qyz-home-manager-path.drv' failed
failed checks.aarch64-darwin.nix-darwin-hyperion-macos 2m 29s
setup: warning: flxd0cgzcgqmwanm1bp53m1ypk54jvax-etc-registry.json.drv: no connected, non-draining worker for system 'aarch64-darwin' offers features {}, the wo …
setup:
warning: flxd0cgzcgqmwanm1bp53m1ypk54jvax-etc-registry.json.drv: no connected, non-draining worker for system 'aarch64-darwin' offers features {}, the workers offer {}, waiting up to 120s for a worker
warning: m1b370fsa7074mdi1dgx458vmcgf44i0-darwin-version.json.drv: no connected, non-draining worker for system 'aarch64-darwin' offers features {}, the workers offer {}, waiting up to 120s for a worker
3c0ghv7f12c20zhsr640fqpzlw7kzbys-options.json.drv: no connected, non-draining worker for system 'aarch64-darwin' offers features {}, the workers offer {}
6vwmrq0qjvxx4kiag925maq93g7vz5id-options.json.drv: no connected, non-draining worker for system 'aarch64-darwin' offers features {}, the workers offer {}
85fhyjq90qlqmy9dgafrx9ph1jcri4y1-clan-runtime.drv: no connected, non-draining worker for system 'aarch64-darwin' offers features {}, the workers offer {}
flxd0cgzcgqmwanm1bp53m1ypk54jvax-etc-registry.json.drv: no connected, non-draining worker for system 'aarch64-darwin' offers features {}, the workers offer {}
m1b370fsa7074mdi1dgx458vmcgf44i0-darwin-version.json.drv: no connected, non-draining worker for system 'aarch64-darwin' offers features {}, the workers offer {}
error: dependency 'm1b370fsa7074mdi1dgx458vmcgf44i0-darwin-version.json.drv' failed
failed checks.aarch64-darwin.package-gaia-vm 2m 2s
setup: don't know how to build these paths: /nix/store/59srrnshzvwlvi2ysm53ql94ymnzz03n-run-gaia-vm-on-aarch64-darwin.drv warning: ignoring the client-specifi …
setup:
don't know how to build these paths:
  /nix/store/59srrnshzvwlvi2ysm53ql94ymnzz03n-run-gaia-vm-on-aarch64-darwin.drv
warning: ignoring the client-specified setting 'store', because it is a restricted setting and you are not a trusted user
warning: 59srrnshzvwlvi2ysm53ql94ymnzz03n-run-gaia-vm-on-aarch64-darwin.drv: no connected, non-draining worker for system 'aarch64-darwin' offers features {}, the workers offer {}, waiting up to 120s for a worker
59srrnshzvwlvi2ysm53ql94ymnzz03n-run-gaia-vm-on-aarch64-darwin.drv: no connected, non-draining worker for system 'aarch64-darwin' offers features {}, the workers offer {}
error: no connected, non-draining worker for system 'aarch64-darwin' offers features {}, the workers offer {}
failed checks.aarch64-darwin.package-get-clan-secret 2m 2s
setup: don't know how to build these paths: /nix/store/03s6pajy6a30j0fvvdiijz47j76zjjnl-get-clan-secret.drv warning: ignoring the client-specified setting 'st …
setup:
don't know how to build these paths:
  /nix/store/03s6pajy6a30j0fvvdiijz47j76zjjnl-get-clan-secret.drv
warning: ignoring the client-specified setting 'store', because it is a restricted setting and you are not a trusted user
warning: 85fhyjq90qlqmy9dgafrx9ph1jcri4y1-clan-runtime.drv: no connected, non-draining worker for system 'aarch64-darwin' offers features {}, the workers offer {}, waiting up to 120s for a worker
85fhyjq90qlqmy9dgafrx9ph1jcri4y1-clan-runtime.drv: no connected, non-draining worker for system 'aarch64-darwin' offers features {}, the workers offer {}
error: dependency 'b6575pv542axhjkmdr839abdch7zwbga-clan-cli.drv' failed
failed checks.aarch64-darwin.package-phi-nixos-vm 2m 2s
setup: this derivation will be built: /nix/store/c2179s3cahfdvb6f72bd069y8y8a6dhc-run-phi-nixos-vm-on-aarch64-darwin.drv warning: ignoring the client-specifie …
setup:
this derivation will be built:
  /nix/store/c2179s3cahfdvb6f72bd069y8y8a6dhc-run-phi-nixos-vm-on-aarch64-darwin.drv
warning: ignoring the client-specified setting 'store', because it is a restricted setting and you are not a trusted user
warning: c2179s3cahfdvb6f72bd069y8y8a6dhc-run-phi-nixos-vm-on-aarch64-darwin.drv: no connected, non-draining worker for system 'aarch64-darwin' offers features {}, the workers offer {}, waiting up to 120s for a worker
c2179s3cahfdvb6f72bd069y8y8a6dhc-run-phi-nixos-vm-on-aarch64-darwin.drv: no connected, non-draining worker for system 'aarch64-darwin' offers features {}, the workers offer {}
error: no connected, non-draining worker for system 'aarch64-darwin' offers features {}, the workers offer {}
failed checks.aarch64-darwin.package-provide-tf-passphrase 2m 4s
setup: /nix/store/lcb9p8fdakcgn2i7kgnckgqbxp1fhkmm-python3.14-installer-1.0.1 /nix/store/g4i7g6gzbwy3f200x4i0xsvlznrnp2m8-python3.14-pyproject-hooks-1.2.0 …
setup:
  /nix/store/lcb9p8fdakcgn2i7kgnckgqbxp1fhkmm-python3.14-installer-1.0.1
  /nix/store/g4i7g6gzbwy3f200x4i0xsvlznrnp2m8-python3.14-pyproject-hooks-1.2.0
  /nix/store/5091q5r44zpnd6rw1kjs22kcj4vdmxhk-python3.14-wheel-0.47.0
  /nix/store/dgnc0b0nzyal6b4cc7chid6zbpg0hc0z-wrap-python-hook
warning: ignoring the client-specified setting 'store', because it is a restricted setting and you are not a trusted user
warning: 85fhyjq90qlqmy9dgafrx9ph1jcri4y1-clan-runtime.drv: no connected, non-draining worker for system 'aarch64-darwin' offers features {}, the workers offer {}, waiting up to 120s for a worker
85fhyjq90qlqmy9dgafrx9ph1jcri4y1-clan-runtime.drv: no connected, non-draining worker for system 'aarch64-darwin' offers features {}, the workers offer {}
error: dependency 'b6575pv542axhjkmdr839abdch7zwbga-clan-cli.drv' failed
failed checks.aarch64-darwin.package-sigma-vm 2m 0s
setup: don't know how to build these paths: /nix/store/rcr2hac30wvpw09phhh4hx24lvhdk8nr-run-sigma-vm-on-aarch64-darwin.drv warning: ignoring the client-specif …
setup:
don't know how to build these paths:
  /nix/store/rcr2hac30wvpw09phhh4hx24lvhdk8nr-run-sigma-vm-on-aarch64-darwin.drv
warning: ignoring the client-specified setting 'store', because it is a restricted setting and you are not a trusted user
warning: rcr2hac30wvpw09phhh4hx24lvhdk8nr-run-sigma-vm-on-aarch64-darwin.drv: no connected, non-draining worker for system 'aarch64-darwin' offers features {}, the workers offer {}, waiting up to 120s for a worker
rcr2hac30wvpw09phhh4hx24lvhdk8nr-run-sigma-vm-on-aarch64-darwin.drv: no connected, non-draining worker for system 'aarch64-darwin' offers features {}, the workers offer {}
error: no connected, non-draining worker for system 'aarch64-darwin' offers features {}, the workers offer {}
dependency failed checks.aarch64-darwin.package-tf-apply —
dependency failed checks.aarch64-darwin.package-tf-destroy —
dependency failed checks.aarch64-darwin.package-tf-init —
failed checks.aarch64-darwin.treefmt 2m 2s
setup: don't know how to build these paths: /nix/store/9lh789q3xnn4w8sy4arj047ip4pn782p-treefmt-check.drv warning: ignoring the client-specified setting 'stor …
setup:
don't know how to build these paths:
  /nix/store/9lh789q3xnn4w8sy4arj047ip4pn782p-treefmt-check.drv
warning: ignoring the client-specified setting 'store', because it is a restricted setting and you are not a trusted user
warning: 9lh789q3xnn4w8sy4arj047ip4pn782p-treefmt-check.drv: no connected, non-draining worker for system 'aarch64-darwin' offers features {}, the workers offer {}, waiting up to 120s for a worker
9lh789q3xnn4w8sy4arj047ip4pn782p-treefmt-check.drv: no connected, non-draining worker for system 'aarch64-darwin' offers features {}, the workers offer {}
error: no connected, non-draining worker for system 'aarch64-darwin' offers features {}, the workers offer {}
failed checks.aarch64-linux.devShell-default 30s
setup: /nix/store/wx29nywb9rhcqdmic78h80k48cb996f0-python3.14-pyproject-hooks-1.2.0 /nix/store/isv6zwb5wfnn6sb1w1skg3cvlq83mh3n-python3.14-setuptools-83.0.0 …
setup:
  /nix/store/wx29nywb9rhcqdmic78h80k48cb996f0-python3.14-pyproject-hooks-1.2.0
  /nix/store/isv6zwb5wfnn6sb1w1skg3cvlq83mh3n-python3.14-setuptools-83.0.0
  /nix/store/dcwjkmgvbk78mjddd4987mx4sr1c4pm9-python3.14-wheel-0.47.0
  /nix/store/jadqw1fnfbzd5qihyfhhnnfsrm3hw6jj-terraform-provider-external-2.4.2
  /nix/store/qzg3ak46z92kmckh4bj4jwkvjwacv95v-wrap-python-hook
warning: ignoring the client-specified setting 'store', because it is a restricted setting and you are not a trusted user
lb3nn6pg5v4h8hk9nmw7ak1dgqfkimlf-nix-shell.drv: error: gRPC AddMultipleToStore on 'nix-store.geninf.io:50051' failed: error: some references of path '/nix/store/1n1722ckpyr399w2w3bb74ad98n8z94f-terraform-provider-gitea-0.8.1.drv' could not be realised
error: error: gRPC AddMultipleToStore on 'nix-store.geninf.io:50051' failed: error: some references of path '/nix/store/1n1722ckpyr399w2w3bb74ad98n8z94f-terraform-provider-gitea-0.8.1.drv' could not be realised
failed checks.aarch64-linux.package-tf-apply 11s
setup: don't know how to build these paths: /nix/store/ja81fmwysrbjhyd4ccqm5xp0hrynr8j7-tf-apply.drv warning: ignoring the client-specified setting 'store', b …
setup:
don't know how to build these paths:
  /nix/store/ja81fmwysrbjhyd4ccqm5xp0hrynr8j7-tf-apply.drv
warning: ignoring the client-specified setting 'store', because it is a restricted setting and you are not a trusted user
ja81fmwysrbjhyd4ccqm5xp0hrynr8j7-tf-apply.drv: error: gRPC AddMultipleToStore on 'nix-store.geninf.io:50051' failed: error: some references of path '/nix/store/1n1722ckpyr399w2w3bb74ad98n8z94f-terraform-provider-gitea-0.8.1.drv' could not be realised
error: error: gRPC AddMultipleToStore on 'nix-store.geninf.io:50051' failed: error: some references of path '/nix/store/1n1722ckpyr399w2w3bb74ad98n8z94f-terraform-provider-gitea-0.8.1.drv' could not be realised
failed checks.aarch64-linux.package-tf-destroy 10s
setup: don't know how to build these paths: /nix/store/44fxa7gmms21wl6mdzarx66kh6wk0yr9-tf-destroy.drv warning: ignoring the client-specified setting 'store', …
setup:
don't know how to build these paths:
  /nix/store/44fxa7gmms21wl6mdzarx66kh6wk0yr9-tf-destroy.drv
warning: ignoring the client-specified setting 'store', because it is a restricted setting and you are not a trusted user
44fxa7gmms21wl6mdzarx66kh6wk0yr9-tf-destroy.drv: error: gRPC AddMultipleToStore on 'nix-store.geninf.io:50051' failed: error: some references of path '/nix/store/1n1722ckpyr399w2w3bb74ad98n8z94f-terraform-provider-gitea-0.8.1.drv' could not be realised
error: error: gRPC AddMultipleToStore on 'nix-store.geninf.io:50051' failed: error: some references of path '/nix/store/1n1722ckpyr399w2w3bb74ad98n8z94f-terraform-provider-gitea-0.8.1.drv' could not be realised
failed checks.aarch64-linux.package-tf-init 11s
setup: don't know how to build these paths: /nix/store/5r9wh9zp9k1s8znqj87lxbxncril5flc-tf-init.drv warning: ignoring the client-specified setting 'store', be …
setup:
don't know how to build these paths:
  /nix/store/5r9wh9zp9k1s8znqj87lxbxncril5flc-tf-init.drv
warning: ignoring the client-specified setting 'store', because it is a restricted setting and you are not a trusted user
5r9wh9zp9k1s8znqj87lxbxncril5flc-tf-init.drv: error: gRPC AddMultipleToStore on 'nix-store.geninf.io:50051' failed: error: some references of path '/nix/store/1n1722ckpyr399w2w3bb74ad98n8z94f-terraform-provider-gitea-0.8.1.drv' could not be realised
error: error: gRPC AddMultipleToStore on 'nix-store.geninf.io:50051' failed: error: some references of path '/nix/store/1n1722ckpyr399w2w3bb74ad98n8z94f-terraform-provider-gitea-0.8.1.drv' could not be realised
failed checks.aarch64-linux.treefmt 5s
setup: /nix/store/dk6y51p9l3c0sgwvj494i1jq6rnfhzjp-python3.14-pyflakes-3.4.0 /nix/store/w9s5sw6pdlfwnpxh2s1jmbmlwligwwa2-statix-0.5.8-unstable-2026-07-17 …
setup:
  /nix/store/dk6y51p9l3c0sgwvj494i1jq6rnfhzjp-python3.14-pyflakes-3.4.0
  /nix/store/w9s5sw6pdlfwnpxh2s1jmbmlwligwwa2-statix-0.5.8-unstable-2026-07-17
  /nix/store/rdh9wsj7wvmrbrxmcbzajdk5sym7wlcf-statix-config
  /nix/store/wv2fcngsm61yczsh9ddaj9q9bi7wkzra-statix-fix
  /nix/store/i1b9pzkjf5v57dm6xs7a925c4kyia5rh-treefmt.toml
warning: ignoring the client-specified setting 'store', because it is a restricted setting and you are not a trusted user
psy7h070silb3bsqgp1xhdi6cx8sjg8v-treefmt-check.drv: error: gRPC AddMultipleToStore on 'nix-store.geninf.io:50051' failed: error: some references of path '/nix/store/rnbix0f1rip6cc9h99h2p6rw436y0v0x-actionlint-1.7.12.drv' could not be realised
error: error: gRPC AddMultipleToStore on 'nix-store.geninf.io:50051' failed: error: some references of path '/nix/store/rnbix0f1rip6cc9h99h2p6rw436y0v0x-actionlint-1.7.12.drv' could not be realised
failed checks.x86_64-linux.nixos-gaia 3m 14s
setup: /nix/store/k7n7k5axjlj9aifb58fiz8pcjxyiz72w-wayvnc-0.10.2 /nix/store/mpqg9hiira9dc5gkdawd6pna982cwahv-wrap-python-hook /nix/store/q8dr0mbn9r3kfqi41 …
setup:
  /nix/store/k7n7k5axjlj9aifb58fiz8pcjxyiz72w-wayvnc-0.10.2
  /nix/store/mpqg9hiira9dc5gkdawd6pna982cwahv-wrap-python-hook
  /nix/store/q8dr0mbn9r3kfqi41a4zfmii0cwl8ivw-xdg-desktop-portal-1.22.1
  /nix/store/137nydmzzxfk2gdwa8h3rxkfrv82g7y6-xdg-desktop-portal-gtk-1.15.3
  /nix/store/9a2jkw3hdk3h8jmh8yicfv346c2b4g4a-xkb-validated
warning: ignoring the client-specified setting 'store', because it is a restricted setting and you are not a trusted user
9vrdkggzf1qbk3wyh96dip83lhb0mz4j-system-units.drv: error: gRPC AddMultipleToStore on 'nix-store.geninf.io:50051' failed: error: some references of path '/nix/store/3ybqsinclswrd51p80jhha5zg36f58vd-templ-0.3.1020.drv' could not be realised
error: dependency '5zpnmipnjhp8p68q9dxwh0yyr26vwsh2-etc.drv' failed
failed checks.x86_64-linux.nixos-sigma 3m 58s
setup: /nix/store/5imzg4hlah4jhnxyrd03d7ymsmms9jaj-make-shell-wrapper-hook /nix/store/5f8phq3mn92fb7266fhfpw8r5aywzdc6-system-generators /nix/store/3qg5wp …
setup:
  /nix/store/5imzg4hlah4jhnxyrd03d7ymsmms9jaj-make-shell-wrapper-hook
  /nix/store/5f8phq3mn92fb7266fhfpw8r5aywzdc6-system-generators
  /nix/store/3qg5wpjf6yxfkw4ynqmybfl9rzryihn1-system-shutdown
  /nix/store/ngi7v0brxk0xsgg6j8ljmp5rsi3jhx5s-user-generators
  /nix/store/9a2jkw3hdk3h8jmh8yicfv346c2b4g4a-xkb-validated
warning: ignoring the client-specified setting 'store', because it is a restricted setting and you are not a trusted user
64jqm2wl95v3qqfy9p837v99fay6ndh9-unit-polkit.service.drv: error: gRPC AddMultipleToStore on 'nix-store.geninf.io:50051' failed: error: some references of path '/nix/store/py2f9axcbpd2zr5fmxs8zvd6knv2cqm9-X-Reload-Triggers-polkit.drv' could not be realised
error: dependency 'sdgchc8irrmx77pbahaxy33zzk0yqnkr-etc.drv' failed
19 succeeded ⚠ 1
succeeded attributes
status attribute duration
succeeded checks.x86_64-linux.nixos-phi-nixos
  • A legacy Nextcloud install (from before NixOS 26.11) may be installed. After nextcloud33 is installed successfully, you can safely upgrade to 34. The latest version available is Nextcloud35. Please note that Nextcloud doesn't support upgrades across multiple major versions (i.e. an upgrade from 16 is possible to 17, but not 16 to 18). The package can be upgraded by explicitly declaring the service-option `services.nextcloud.package`.
  • A legacy Nextcloud install (from before NixOS 26.11) may be installed. After nextcloud34 is installed successfully, you can safely upgrade to 35. The latest version available is Nextcloud35. Please note that Nextcloud doesn't support upgrades across multiple major versions (i.e. an upgrade from 16 is possible to 17, but not 16 to 18). The package can be upgraded by explicitly declaring the service-option `services.nextcloud.package`.
3m 46s
succeeded checks.aarch64-linux.package-gaia-vm 4s
succeeded checks.aarch64-linux.package-get-clan-secret 31s
succeeded checks.aarch64-linux.package-phi-nixos-vm 5s
succeeded checks.aarch64-linux.package-provide-tf-passphrase 31s
succeeded checks.aarch64-linux.package-sigma-vm 5s
succeeded checks.x86_64-linux.devShell-default 1m 23s
succeeded checks.x86_64-linux."home-manager-enzime@gaia" 3m 25s
succeeded checks.x86_64-linux."home-manager-enzime@phi-nixos" 3m 25s
succeeded checks.x86_64-linux."home-manager-enzime@sigma" 3m 25s
succeeded checks.x86_64-linux.package-gaia-vm 22s
succeeded checks.x86_64-linux.package-get-clan-secret 1m 53s
succeeded checks.x86_64-linux.package-phi-nixos-vm 22s
succeeded checks.x86_64-linux.package-provide-tf-passphrase 1m 53s
succeeded checks.x86_64-linux.package-sigma-vm 23s
succeeded checks.x86_64-linux.package-tf-apply 34s
succeeded checks.x86_64-linux.package-tf-destroy 34s
succeeded checks.x86_64-linux.package-tf-init 1m 18s
succeeded checks.x86_64-linux.treefmt 20s
21 already built
skipped attributes
status attribute duration
loading…