nixbot

builds

Enzime/hyperconfig build #1148 failed

branch next · PR #1085 · commit c92277d754 · · took 4m 1s · eval 45s

eval warnings 1 kind · 2 occurrences
  • warn A legacy Nextcloud install (from before NixOS 26.11) may be installed. ×2

10 failed
failed attributes
status attribute duration
failed checks.aarch64-darwin.devShell-default 2m 3s
setup: don't know how to build these paths: /nix/store/k5s0fpg2g56bkj1jdy46h1rysr1r108n-nix-shell.drv warning: ignoring the client-specified setting 'store', …
setup:
don't know how to build these paths:
  /nix/store/k5s0fpg2g56bkj1jdy46h1rysr1r108n-nix-shell.drv
warning: ignoring the client-specified setting 'store', because it is a restricted setting and you are not a trusted user
warning: 2f67akdg5grxxj2f7pwn76fd0jx6l0d4-home-manager.drv: no connected, non-draining worker for system 'aarch64-darwin' offers features {}, the workers offer {}, waiting up to 120s for a worker
2f67akdg5grxxj2f7pwn76fd0jx6l0d4-home-manager.drv: no connected, non-draining worker for system 'aarch64-darwin' offers features {}, the workers offer {}
error: dependency '2f67akdg5grxxj2f7pwn76fd0jx6l0d4-home-manager.drv' failed
failed checks.aarch64-darwin."home-manager-enzime@hyperion-macos" 2m 8s
setup: don't know how to build these paths: /nix/store/s81m3xq1lyjld4nw1xdwq5imrdmwdck8-home-manager-generation.drv warning: ignoring the client-specified set …
setup:
don't know how to build these paths:
  /nix/store/s81m3xq1lyjld4nw1xdwq5imrdmwdck8-home-manager-generation.drv
warning: ignoring the client-specified setting 'store', because it is a restricted setting and you are not a trusted user
warning: 2f67akdg5grxxj2f7pwn76fd0jx6l0d4-home-manager.drv: no connected, non-draining worker for system 'aarch64-darwin' offers features {}, the workers offer {}, waiting up to 120s for a worker
warning: amlahpkvnd12nhdkbnyildfx92g1g94n-options.json.drv: no connected, non-draining worker for system 'aarch64-darwin' offers features {}, the workers offer {}, waiting up to 120s for a worker
2f67akdg5grxxj2f7pwn76fd0jx6l0d4-home-manager.drv: no connected, non-draining worker for system 'aarch64-darwin' offers features {}, the workers offer {}
amlahpkvnd12nhdkbnyildfx92g1g94n-options.json.drv: no connected, non-draining worker for system 'aarch64-darwin' offers features {}, the workers offer {}
error: dependency 'p5jskjxcmyzlq29kjcrgm45py5xxm966-home-manager-path.drv' failed
failed checks.aarch64-darwin.nix-darwin-hyperion-macos 2m 4s
setup: warning: amlahpkvnd12nhdkbnyildfx92g1g94n-options.json.drv: no connected, non-draining worker for system 'aarch64-darwin' offers features {}, the workers …
setup:
warning: amlahpkvnd12nhdkbnyildfx92g1g94n-options.json.drv: no connected, non-draining worker for system 'aarch64-darwin' offers features {}, the workers offer {}, waiting up to 120s for a worker
warning: kxzipd1lria7j20j7vmqshargcz6h3mx-darwin-version.json.drv: no connected, non-draining worker for system 'aarch64-darwin' offers features {}, the workers offer {}, waiting up to 120s for a worker
warning: rfwr7gizvin6y96wjkhrnc7g0b2l1a88-etc-registry.json.drv: no connected, non-draining worker for system 'aarch64-darwin' offers features {}, the workers offer {}, waiting up to 120s for a worker
2f67akdg5grxxj2f7pwn76fd0jx6l0d4-home-manager.drv: no connected, non-draining worker for system 'aarch64-darwin' offers features {}, the workers offer {}
amlahpkvnd12nhdkbnyildfx92g1g94n-options.json.drv: no connected, non-draining worker for system 'aarch64-darwin' offers features {}, the workers offer {}
kxzipd1lria7j20j7vmqshargcz6h3mx-darwin-version.json.drv: no connected, non-draining worker for system 'aarch64-darwin' offers features {}, the workers offer {}
rfwr7gizvin6y96wjkhrnc7g0b2l1a88-etc-registry.json.drv: no connected, non-draining worker for system 'aarch64-darwin' offers features {}, the workers offer {}
error: dependency '6r70i4iyc8227jn3s3j12fy4mgy41vdy-system-path.drv' failed
failed checks.aarch64-darwin.package-gaia-vm 2m 1s
setup: don't know how to build these paths: /nix/store/q0fr29rzgyn2i0zvsfk8dcwx7ky7c24k-run-gaia-vm-on-aarch64-darwin.drv warning: ignoring the client-specifi …
setup:
don't know how to build these paths:
  /nix/store/q0fr29rzgyn2i0zvsfk8dcwx7ky7c24k-run-gaia-vm-on-aarch64-darwin.drv
warning: ignoring the client-specified setting 'store', because it is a restricted setting and you are not a trusted user
warning: q0fr29rzgyn2i0zvsfk8dcwx7ky7c24k-run-gaia-vm-on-aarch64-darwin.drv: no connected, non-draining worker for system 'aarch64-darwin' offers features {}, the workers offer {}, waiting up to 120s for a worker
q0fr29rzgyn2i0zvsfk8dcwx7ky7c24k-run-gaia-vm-on-aarch64-darwin.drv: no connected, non-draining worker for system 'aarch64-darwin' offers features {}, the workers offer {}
error: no connected, non-draining worker for system 'aarch64-darwin' offers features {}, the workers offer {}
failed checks.aarch64-darwin.package-phi-nixos-vm 2m 1s
setup: don't know how to build these paths: /nix/store/5775fkn12rbr2wwjxcx46vw0xag1gkim-run-phi-nixos-vm-on-aarch64-darwin.drv warning: ignoring the client-sp …
setup:
don't know how to build these paths:
  /nix/store/5775fkn12rbr2wwjxcx46vw0xag1gkim-run-phi-nixos-vm-on-aarch64-darwin.drv
warning: ignoring the client-specified setting 'store', because it is a restricted setting and you are not a trusted user
warning: 5775fkn12rbr2wwjxcx46vw0xag1gkim-run-phi-nixos-vm-on-aarch64-darwin.drv: no connected, non-draining worker for system 'aarch64-darwin' offers features {}, the workers offer {}, waiting up to 120s for a worker
5775fkn12rbr2wwjxcx46vw0xag1gkim-run-phi-nixos-vm-on-aarch64-darwin.drv: no connected, non-draining worker for system 'aarch64-darwin' offers features {}, the workers offer {}
error: no connected, non-draining worker for system 'aarch64-darwin' offers features {}, the workers offer {}
failed checks.aarch64-darwin.package-sigma-vm 2m 1s
setup: this derivation will be built: /nix/store/nzap6ydpd4x9vmx8rv6x9plj0ajaahcb-run-sigma-vm-on-aarch64-darwin.drv warning: ignoring the client-specified se …
setup:
this derivation will be built:
  /nix/store/nzap6ydpd4x9vmx8rv6x9plj0ajaahcb-run-sigma-vm-on-aarch64-darwin.drv
warning: ignoring the client-specified setting 'store', because it is a restricted setting and you are not a trusted user
warning: nzap6ydpd4x9vmx8rv6x9plj0ajaahcb-run-sigma-vm-on-aarch64-darwin.drv: no connected, non-draining worker for system 'aarch64-darwin' offers features {}, the workers offer {}, waiting up to 120s for a worker
nzap6ydpd4x9vmx8rv6x9plj0ajaahcb-run-sigma-vm-on-aarch64-darwin.drv: no connected, non-draining worker for system 'aarch64-darwin' offers features {}, the workers offer {}
error: no connected, non-draining worker for system 'aarch64-darwin' offers features {}, the workers offer {}
failed checks.aarch64-darwin.package-tf-apply 2m 1s
setup: don't know how to build these paths: /nix/store/pgl242q37zh417xv03xs1l2xlwny3pc3-tf-apply.drv warning: ignoring the client-specified setting 'store', b …
setup:
don't know how to build these paths:
  /nix/store/pgl242q37zh417xv03xs1l2xlwny3pc3-tf-apply.drv
warning: ignoring the client-specified setting 'store', because it is a restricted setting and you are not a trusted user
warning: c9nvx0k0sb7amj6wbdw16pby69qn7g0z-get-clan-secret.drv: no connected, non-draining worker for system 'aarch64-darwin' offers features {}, the workers offer {}, waiting up to 120s for a worker
warning: jly31slxnxn6wi4q6yalpb8mg89gj6jp-opentofu-external-key-provider.drv: no connected, non-draining worker for system 'aarch64-darwin' offers features {}, the workers offer {}, waiting up to 120s for a worker
c9nvx0k0sb7amj6wbdw16pby69qn7g0z-get-clan-secret.drv: no connected, non-draining worker for system 'aarch64-darwin' offers features {}, the workers offer {}
jly31slxnxn6wi4q6yalpb8mg89gj6jp-opentofu-external-key-provider.drv: no connected, non-draining worker for system 'aarch64-darwin' offers features {}, the workers offer {}
error: dependency 'wsz0j307svrcd6abx37n6hh27m051v8l-config.tf.json.drv' failed
failed checks.aarch64-darwin.treefmt 2m 1s
setup: don't know how to build these paths: /nix/store/imfnsiwlhma6vlb805pjwpnv31y6s54h-treefmt-check.drv warning: ignoring the client-specified setting 'stor …
setup:
don't know how to build these paths:
  /nix/store/imfnsiwlhma6vlb805pjwpnv31y6s54h-treefmt-check.drv
warning: ignoring the client-specified setting 'store', because it is a restricted setting and you are not a trusted user
warning: imfnsiwlhma6vlb805pjwpnv31y6s54h-treefmt-check.drv: no connected, non-draining worker for system 'aarch64-darwin' offers features {}, the workers offer {}, waiting up to 120s for a worker
imfnsiwlhma6vlb805pjwpnv31y6s54h-treefmt-check.drv: no connected, non-draining worker for system 'aarch64-darwin' offers features {}, the workers offer {}
error: no connected, non-draining worker for system 'aarch64-darwin' offers features {}, the workers offer {}
failed checks.aarch64-linux.devShell-default 26s
setup: don't know how to build these paths: /nix/store/ny3vpdvvirz8z8ls3bb6df8ny02kw65v-nix-shell.drv warning: ignoring the client-specified setting 'store', …
setup:
don't know how to build these paths:
  /nix/store/ny3vpdvvirz8z8ls3bb6df8ny02kw65v-nix-shell.drv
warning: ignoring the client-specified setting 'store', because it is a restricted setting and you are not a trusted user
fi17140nscf5wcvwp0ix7d33cgpr6bgr-opentofu-1.13.1.drv: error: gRPC AddMultipleToStore on 'nix-store.geninf.io:50051' failed: error: some references of path '/nix/store/1n1722ckpyr399w2w3bb74ad98n8z94f-terraform-provider-gitea-0.8.1.drv' could not be realised
grmpc69wcdmfvx5y91giq3xqxy04mvsc-home-manager.drv: error: gRPC AddMultipleToStore on 'nix-store.geninf.io:50051' failed: error: some references of path '/nix/store/7ix3jswjcl56qkc937hcm7y9igmhvvzc-inetutils-2.7.drv' could not be realised
error: dependency 'fi17140nscf5wcvwp0ix7d33cgpr6bgr-opentofu-1.13.1.drv' failed
failed checks.aarch64-linux.treefmt 2s
setup: don't know how to build these paths: /nix/store/gmvrlhgmfrhxbxvyp19m2pb73810mn2r-treefmt-check.drv warning: ignoring the client-specified setting 'stor …
setup:
don't know how to build these paths:
  /nix/store/gmvrlhgmfrhxbxvyp19m2pb73810mn2r-treefmt-check.drv
warning: ignoring the client-specified setting 'store', because it is a restricted setting and you are not a trusted user
gmvrlhgmfrhxbxvyp19m2pb73810mn2r-treefmt-check.drv: error: gRPC AddMultipleToStore on 'nix-store.geninf.io:50051' failed: error: some references of path '/nix/store/rnbix0f1rip6cc9h99h2p6rw436y0v0x-actionlint-1.7.12.drv' could not be realised
error: error: gRPC AddMultipleToStore on 'nix-store.geninf.io:50051' failed: error: some references of path '/nix/store/rnbix0f1rip6cc9h99h2p6rw436y0v0x-actionlint-1.7.12.drv' could not be realised
14 succeeded ⚠ 1
succeeded attributes
status attribute duration
succeeded checks.x86_64-linux.nixos-phi-nixos
  • A legacy Nextcloud install (from before NixOS 26.11) may be installed. After nextcloud33 is installed successfully, you can safely upgrade to 34. The latest version available is Nextcloud35. Please note that Nextcloud doesn't support upgrades across multiple major versions (i.e. an upgrade from 16 is possible to 17, but not 16 to 18). The package can be upgraded by explicitly declaring the service-option `services.nextcloud.package`.
  • A legacy Nextcloud install (from before NixOS 26.11) may be installed. After nextcloud34 is installed successfully, you can safely upgrade to 35. The latest version available is Nextcloud35. Please note that Nextcloud doesn't support upgrades across multiple major versions (i.e. an upgrade from 16 is possible to 17, but not 16 to 18). The package can be upgraded by explicitly declaring the service-option `services.nextcloud.package`.
2m 52s
succeeded checks.aarch64-linux.package-gaia-vm 7s
succeeded checks.aarch64-linux.package-phi-nixos-vm 9s
succeeded checks.aarch64-linux.package-sigma-vm 34s
succeeded checks.x86_64-linux.devShell-default 6s
succeeded checks.x86_64-linux."home-manager-enzime@gaia" 1m 42s
succeeded checks.x86_64-linux."home-manager-enzime@phi-nixos" 1m 53s
succeeded checks.x86_64-linux."home-manager-enzime@sigma" 1m 47s
succeeded checks.x86_64-linux.nixos-gaia 3m 14s
succeeded checks.x86_64-linux.nixos-sigma 3m 9s
succeeded checks.x86_64-linux.package-gaia-vm 3s
succeeded checks.x86_64-linux.package-phi-nixos-vm 3s
succeeded checks.x86_64-linux.package-sigma-vm 4s
succeeded checks.x86_64-linux.treefmt 5s
35 already built
skipped attributes
status attribute duration
loading…