nixbot

builds

Enzime/hyperconfig build #1149 failed

branch next · PR #1086 · commit afce576210 · · took 3m 8s · eval 23s

eval warnings 1 kind · 2 occurrences
  • warn A legacy Nextcloud install (from before NixOS 26.11) may be installed. ×2

12 failed
failed attributes
status attribute duration
failed checks.aarch64-darwin."home-manager-enzime@hyperion-macos" 2m 4s
setup: warning: ignoring the client-specified setting 'store', because it is a restricted setting and you are not a trusted user warning: 5vrcy1bmhvpncj4wi5b433 …
setup:
warning: ignoring the client-specified setting 'store', because it is a restricted setting and you are not a trusted user
warning: 5vrcy1bmhvpncj4wi5b433xdii00q7ad-source.drv: no connected, non-draining worker for system 'aarch64-darwin' offers features {}, the workers offer {}, waiting up to 120s for a worker
warning: ccml6pmnvv8y7a1ck8fzlfjdc0691aph-claude.drv: no connected, non-draining worker for system 'aarch64-darwin' offers features {}, the workers offer {}, waiting up to 120s for a worker
warning: fjc1609mvn47wg8fdl5w2vzvq6wfrcay-omp-18.8.7-cargo-vendor-vendor-staging.drv: no connected, non-draining worker for system 'aarch64-darwin' offers features {}, the workers offer {}, waiting up to 120s for a worker
5vrcy1bmhvpncj4wi5b433xdii00q7ad-source.drv: no connected, non-draining worker for system 'aarch64-darwin' offers features {}, the workers offer {}
ccml6pmnvv8y7a1ck8fzlfjdc0691aph-claude.drv: no connected, non-draining worker for system 'aarch64-darwin' offers features {}, the workers offer {}
fjc1609mvn47wg8fdl5w2vzvq6wfrcay-omp-18.8.7-cargo-vendor-vendor-staging.drv: no connected, non-draining worker for system 'aarch64-darwin' offers features {}, the workers offer {}
error: dependency '4s6mns3gda0wbz1ymxhjyf48fsb943cc-home-manager-path.drv' failed
failed checks.aarch64-darwin.nix-darwin-hyperion-macos 2m 19s
setup: warning: fjc1609mvn47wg8fdl5w2vzvq6wfrcay-omp-18.8.7-cargo-vendor-vendor-staging.drv: no connected, non-draining worker for system 'aarch64-darwin' offer …
setup:
warning: fjc1609mvn47wg8fdl5w2vzvq6wfrcay-omp-18.8.7-cargo-vendor-vendor-staging.drv: no connected, non-draining worker for system 'aarch64-darwin' offers features {}, the workers offer {}, waiting up to 120s for a worker
warning: pw9fmghcaiz5aiw0qqdzajylf143nw0k-darwin-version.json.drv: no connected, non-draining worker for system 'aarch64-darwin' offers features {}, the workers offer {}, waiting up to 120s for a worker
5vrcy1bmhvpncj4wi5b433xdii00q7ad-source.drv: no connected, non-draining worker for system 'aarch64-darwin' offers features {}, the workers offer {}
9bis5b56djd118vk6r3f1mh47y2q8sn2-etc-registry.json.drv: no connected, non-draining worker for system 'aarch64-darwin' offers features {}, the workers offer {}
ccml6pmnvv8y7a1ck8fzlfjdc0691aph-claude.drv: no connected, non-draining worker for system 'aarch64-darwin' offers features {}, the workers offer {}
fjc1609mvn47wg8fdl5w2vzvq6wfrcay-omp-18.8.7-cargo-vendor-vendor-staging.drv: no connected, non-draining worker for system 'aarch64-darwin' offers features {}, the workers offer {}
pw9fmghcaiz5aiw0qqdzajylf143nw0k-darwin-version.json.drv: no connected, non-draining worker for system 'aarch64-darwin' offers features {}, the workers offer {}
error: dependency 'pw9fmghcaiz5aiw0qqdzajylf143nw0k-darwin-version.json.drv' failed
failed checks.aarch64-darwin.package-gaia-vm 2m 1s
setup: don't know how to build these paths: /nix/store/aidl1qm6cx5l70g0rp6hi5vvbj1sifi7-run-gaia-vm-on-aarch64-darwin.drv warning: ignoring the client-specifi …
setup:
don't know how to build these paths:
  /nix/store/aidl1qm6cx5l70g0rp6hi5vvbj1sifi7-run-gaia-vm-on-aarch64-darwin.drv
warning: ignoring the client-specified setting 'store', because it is a restricted setting and you are not a trusted user
warning: aidl1qm6cx5l70g0rp6hi5vvbj1sifi7-run-gaia-vm-on-aarch64-darwin.drv: no connected, non-draining worker for system 'aarch64-darwin' offers features {}, the workers offer {}, waiting up to 120s for a worker
aidl1qm6cx5l70g0rp6hi5vvbj1sifi7-run-gaia-vm-on-aarch64-darwin.drv: no connected, non-draining worker for system 'aarch64-darwin' offers features {}, the workers offer {}
error: no connected, non-draining worker for system 'aarch64-darwin' offers features {}, the workers offer {}
failed checks.aarch64-darwin.package-get-clan-secret 2m 1s
setup: don't know how to build these paths: /nix/store/c9nvx0k0sb7amj6wbdw16pby69qn7g0z-get-clan-secret.drv warning: ignoring the client-specified setting 'st …
setup:
don't know how to build these paths:
  /nix/store/c9nvx0k0sb7amj6wbdw16pby69qn7g0z-get-clan-secret.drv
warning: ignoring the client-specified setting 'store', because it is a restricted setting and you are not a trusted user
warning: c9nvx0k0sb7amj6wbdw16pby69qn7g0z-get-clan-secret.drv: no connected, non-draining worker for system 'aarch64-darwin' offers features {}, the workers offer {}, waiting up to 120s for a worker
c9nvx0k0sb7amj6wbdw16pby69qn7g0z-get-clan-secret.drv: no connected, non-draining worker for system 'aarch64-darwin' offers features {}, the workers offer {}
error: no connected, non-draining worker for system 'aarch64-darwin' offers features {}, the workers offer {}
failed checks.aarch64-darwin.package-phi-nixos-vm 2m 3s
setup: this derivation will be built: /nix/store/dgpmpb53ifm86jhx0ryjvvhqydsh55br-run-phi-nixos-vm-on-aarch64-darwin.drv warning: ignoring the client-specifie …
setup:
this derivation will be built:
  /nix/store/dgpmpb53ifm86jhx0ryjvvhqydsh55br-run-phi-nixos-vm-on-aarch64-darwin.drv
warning: ignoring the client-specified setting 'store', because it is a restricted setting and you are not a trusted user
warning: dgpmpb53ifm86jhx0ryjvvhqydsh55br-run-phi-nixos-vm-on-aarch64-darwin.drv: no connected, non-draining worker for system 'aarch64-darwin' offers features {}, the workers offer {}, waiting up to 120s for a worker
dgpmpb53ifm86jhx0ryjvvhqydsh55br-run-phi-nixos-vm-on-aarch64-darwin.drv: no connected, non-draining worker for system 'aarch64-darwin' offers features {}, the workers offer {}
error: no connected, non-draining worker for system 'aarch64-darwin' offers features {}, the workers offer {}
failed checks.aarch64-darwin.package-provide-tf-passphrase 2m 3s
setup: don't know how to build these paths: /nix/store/jly31slxnxn6wi4q6yalpb8mg89gj6jp-opentofu-external-key-provider.drv warning: ignoring the client-specif …
setup:
don't know how to build these paths:
  /nix/store/jly31slxnxn6wi4q6yalpb8mg89gj6jp-opentofu-external-key-provider.drv
warning: ignoring the client-specified setting 'store', because it is a restricted setting and you are not a trusted user
warning: jly31slxnxn6wi4q6yalpb8mg89gj6jp-opentofu-external-key-provider.drv: no connected, non-draining worker for system 'aarch64-darwin' offers features {}, the workers offer {}, waiting up to 120s for a worker
jly31slxnxn6wi4q6yalpb8mg89gj6jp-opentofu-external-key-provider.drv: no connected, non-draining worker for system 'aarch64-darwin' offers features {}, the workers offer {}
error: no connected, non-draining worker for system 'aarch64-darwin' offers features {}, the workers offer {}
failed checks.aarch64-darwin.package-sigma-vm 2m 3s
setup: this derivation will be built: /nix/store/sbsncfnah6lzdpjvs36lvagngnbkn9bg-run-sigma-vm-on-aarch64-darwin.drv warning: ignoring the client-specified se …
setup:
this derivation will be built:
  /nix/store/sbsncfnah6lzdpjvs36lvagngnbkn9bg-run-sigma-vm-on-aarch64-darwin.drv
warning: ignoring the client-specified setting 'store', because it is a restricted setting and you are not a trusted user
warning: sbsncfnah6lzdpjvs36lvagngnbkn9bg-run-sigma-vm-on-aarch64-darwin.drv: no connected, non-draining worker for system 'aarch64-darwin' offers features {}, the workers offer {}, waiting up to 120s for a worker
sbsncfnah6lzdpjvs36lvagngnbkn9bg-run-sigma-vm-on-aarch64-darwin.drv: no connected, non-draining worker for system 'aarch64-darwin' offers features {}, the workers offer {}
error: no connected, non-draining worker for system 'aarch64-darwin' offers features {}, the workers offer {}
failed checks.aarch64-darwin.package-tf-apply 2m 0s
setup: don't know how to build these paths: /nix/store/pgl242q37zh417xv03xs1l2xlwny3pc3-tf-apply.drv warning: ignoring the client-specified setting 'store', b …
setup:
don't know how to build these paths:
  /nix/store/pgl242q37zh417xv03xs1l2xlwny3pc3-tf-apply.drv
warning: ignoring the client-specified setting 'store', because it is a restricted setting and you are not a trusted user
warning: wsz0j307svrcd6abx37n6hh27m051v8l-config.tf.json.drv: no connected, non-draining worker for system 'aarch64-darwin' offers features {}, the workers offer {}, waiting up to 120s for a worker
wsz0j307svrcd6abx37n6hh27m051v8l-config.tf.json.drv: no connected, non-draining worker for system 'aarch64-darwin' offers features {}, the workers offer {}
error: dependency 'wsz0j307svrcd6abx37n6hh27m051v8l-config.tf.json.drv' failed
failed checks.aarch64-darwin.package-tf-destroy 2m 2s
setup: don't know how to build these paths: /nix/store/r8df65r77k2vl0jwin9w8xikn4dg3y13-tf-destroy.drv warning: ignoring the client-specified setting 'store', …
setup:
don't know how to build these paths:
  /nix/store/r8df65r77k2vl0jwin9w8xikn4dg3y13-tf-destroy.drv
warning: ignoring the client-specified setting 'store', because it is a restricted setting and you are not a trusted user
warning: c9nvx0k0sb7amj6wbdw16pby69qn7g0z-get-clan-secret.drv: no connected, non-draining worker for system 'aarch64-darwin' offers features {}, the workers offer {}, waiting up to 120s for a worker
warning: jly31slxnxn6wi4q6yalpb8mg89gj6jp-opentofu-external-key-provider.drv: no connected, non-draining worker for system 'aarch64-darwin' offers features {}, the workers offer {}, waiting up to 120s for a worker
c9nvx0k0sb7amj6wbdw16pby69qn7g0z-get-clan-secret.drv: no connected, non-draining worker for system 'aarch64-darwin' offers features {}, the workers offer {}
jly31slxnxn6wi4q6yalpb8mg89gj6jp-opentofu-external-key-provider.drv: no connected, non-draining worker for system 'aarch64-darwin' offers features {}, the workers offer {}
error: dependency 'wsz0j307svrcd6abx37n6hh27m051v8l-config.tf.json.drv' failed
failed checks.aarch64-darwin.treefmt 2m 1s
setup: don't know how to build these paths: /nix/store/iv6x8pr2md1q9lylz3yaaknchprbkry2-treefmt-check.drv warning: ignoring the client-specified setting 'stor …
setup:
don't know how to build these paths:
  /nix/store/iv6x8pr2md1q9lylz3yaaknchprbkry2-treefmt-check.drv
warning: ignoring the client-specified setting 'store', because it is a restricted setting and you are not a trusted user
warning: iv6x8pr2md1q9lylz3yaaknchprbkry2-treefmt-check.drv: no connected, non-draining worker for system 'aarch64-darwin' offers features {}, the workers offer {}, waiting up to 120s for a worker
iv6x8pr2md1q9lylz3yaaknchprbkry2-treefmt-check.drv: no connected, non-draining worker for system 'aarch64-darwin' offers features {}, the workers offer {}
error: no connected, non-draining worker for system 'aarch64-darwin' offers features {}, the workers offer {}
failed checks.aarch64-linux.package-tf 1s
setup: these 2 paths will be fetched (0.0 KiB download, 16.1 MiB unpacked): /nix/store/scwy3jif3fd65d32c8i4awnfsq6qkiz0-opentofu-1.13.1 /nix/store/jadqw1fnf …
setup:
these 2 paths will be fetched (0.0 KiB download, 16.1 MiB unpacked):
  /nix/store/scwy3jif3fd65d32c8i4awnfsq6qkiz0-opentofu-1.13.1
  /nix/store/jadqw1fnfbzd5qihyfhhnnfsrm3hw6jj-terraform-provider-external-2.4.2
warning: ignoring the client-specified setting 'store', because it is a restricted setting and you are not a trusted user
fi17140nscf5wcvwp0ix7d33cgpr6bgr-opentofu-1.13.1.drv: error: gRPC AddMultipleToStore on 'nix-store.geninf.io:50051' failed: error: some references of path '/nix/store/1n1722ckpyr399w2w3bb74ad98n8z94f-terraform-provider-gitea-0.8.1.drv' could not be realised
error: error: gRPC AddMultipleToStore on 'nix-store.geninf.io:50051' failed: error: some references of path '/nix/store/1n1722ckpyr399w2w3bb74ad98n8z94f-terraform-provider-gitea-0.8.1.drv' could not be realised
failed checks.aarch64-linux.treefmt 6s
setup: don't know how to build these paths: /nix/store/0sj8mrlm9f24hw592ak0wv1h90bj8a6i-treefmt-check.drv warning: ignoring the client-specified setting 'stor …
setup:
don't know how to build these paths:
  /nix/store/0sj8mrlm9f24hw592ak0wv1h90bj8a6i-treefmt-check.drv
warning: ignoring the client-specified setting 'store', because it is a restricted setting and you are not a trusted user
0sj8mrlm9f24hw592ak0wv1h90bj8a6i-treefmt-check.drv: error: gRPC AddMultipleToStore on 'nix-store.geninf.io:50051' failed: error: some references of path '/nix/store/rnbix0f1rip6cc9h99h2p6rw436y0v0x-actionlint-1.7.12.drv' could not be realised
error: error: gRPC AddMultipleToStore on 'nix-store.geninf.io:50051' failed: error: some references of path '/nix/store/rnbix0f1rip6cc9h99h2p6rw436y0v0x-actionlint-1.7.12.drv' could not be realised
13 succeeded ⚠ 1
succeeded attributes
status attribute duration
succeeded checks.x86_64-linux.nixos-phi-nixos
  • A legacy Nextcloud install (from before NixOS 26.11) may be installed. After nextcloud33 is installed successfully, you can safely upgrade to 34. The latest version available is Nextcloud35. Please note that Nextcloud doesn't support upgrades across multiple major versions (i.e. an upgrade from 16 is possible to 17, but not 16 to 18). The package can be upgraded by explicitly declaring the service-option `services.nextcloud.package`.
  • A legacy Nextcloud install (from before NixOS 26.11) may be installed. After nextcloud34 is installed successfully, you can safely upgrade to 35. The latest version available is Nextcloud35. Please note that Nextcloud doesn't support upgrades across multiple major versions (i.e. an upgrade from 16 is possible to 17, but not 16 to 18). The package can be upgraded by explicitly declaring the service-option `services.nextcloud.package`.
2m 22s
succeeded checks.aarch64-linux.package-gaia-vm 3s
succeeded checks.aarch64-linux.package-phi-nixos-vm 5s
succeeded checks.aarch64-linux.package-sigma-vm 2s
succeeded checks.x86_64-linux."home-manager-enzime@gaia" 11s
succeeded checks.x86_64-linux."home-manager-enzime@phi-nixos" 22s
succeeded checks.x86_64-linux."home-manager-enzime@sigma" 23s
succeeded checks.x86_64-linux.nixos-gaia 2m 41s
succeeded checks.x86_64-linux.nixos-sigma 2m 42s
succeeded checks.x86_64-linux.package-gaia-vm 10s
succeeded checks.x86_64-linux.package-phi-nixos-vm 11s
succeeded checks.x86_64-linux.package-sigma-vm 15s
succeeded checks.x86_64-linux.treefmt 13s
34 already built
skipped attributes
status attribute duration
loading…