nixbot

builds

Enzime/hyperconfig build #1152 failed

branch next · PR #1087 · commit 6ecbd2a449 · · took 3m 19s · eval 28s

eval warnings 1 kind · 2 occurrences
  • warn A legacy Nextcloud install (from before NixOS 26.11) may be installed. ×2

19 failed
failed attributes
status attribute duration
dependency failed checks.aarch64-darwin.devShell-default —
failed checks.aarch64-darwin."home-manager-enzime@hyperion-macos" 2m 24s
setup: warning: ignoring the client-specified setting 'store', because it is a restricted setting and you are not a trusted user warning: 4w2i78yaw494w035ylwp77 …
setup:
warning: ignoring the client-specified setting 'store', because it is a restricted setting and you are not a trusted user
warning: 4w2i78yaw494w035ylwp77f5sr60wjbb-python3.14-debugpy-1.8.22.drv: no connected, non-draining worker for system 'aarch64-darwin' offers features {}, the workers offer {}, waiting up to 120s for a worker
warning: 9vljgx6gs07z3qqvb3k75rwd3kf6cgf0-jj-status-hook.drv: no connected, non-draining worker for system 'aarch64-darwin' offers features {}, the workers offer {}, waiting up to 120s for a worker
warning: vpp7ivzca6v26cngifq7aw1vi2w040c0-options.json.drv: no connected, non-draining worker for system 'aarch64-darwin' offers features {}, the workers offer {}, waiting up to 120s for a worker
4w2i78yaw494w035ylwp77f5sr60wjbb-python3.14-debugpy-1.8.22.drv: no connected, non-draining worker for system 'aarch64-darwin' offers features {}, the workers offer {}
9vljgx6gs07z3qqvb3k75rwd3kf6cgf0-jj-status-hook.drv: no connected, non-draining worker for system 'aarch64-darwin' offers features {}, the workers offer {}
vpp7ivzca6v26cngifq7aw1vi2w040c0-options.json.drv: no connected, non-draining worker for system 'aarch64-darwin' offers features {}, the workers offer {}
error: dependency 'nlmbg78h1f4n0dbdhl74xbh0akflagky-home-manager-path.drv' failed
failed checks.aarch64-darwin.nix-darwin-hyperion-macos 2m 3s
setup: 5mgyal874r4mr93izffa6lcnx3pc06j6-darwin-manpages.drv: no connected, non-draining worker for system 'aarch64-darwin' offers features {}, the workers offer …
setup:
5mgyal874r4mr93izffa6lcnx3pc06j6-darwin-manpages.drv: no connected, non-draining worker for system 'aarch64-darwin' offers features {}, the workers offer {}
7507p3d5dc4icywm0lsc5bhz76a6x42n-clan-runtime.drv: no connected, non-draining worker for system 'aarch64-darwin' offers features {}, the workers offer {}
9vljgx6gs07z3qqvb3k75rwd3kf6cgf0-jj-status-hook.drv: no connected, non-draining worker for system 'aarch64-darwin' offers features {}, the workers offer {}
f97clpz2g3dcbzci107bw2fdb0xkiskb-darwin-version.json.drv: no connected, non-draining worker for system 'aarch64-darwin' offers features {}, the workers offer {}
gvyaq5bnaxn6yjirmph8bhgr041wihp2-options.json.drv: no connected, non-draining worker for system 'aarch64-darwin' offers features {}, the workers offer {}
pw45llyq7v12nfwxb0s8yv5irhj65mbx-etc-registry.json.drv: no connected, non-draining worker for system 'aarch64-darwin' offers features {}, the workers offer {}
vpp7ivzca6v26cngifq7aw1vi2w040c0-options.json.drv: no connected, non-draining worker for system 'aarch64-darwin' offers features {}, the workers offer {}
error: dependency 'f97clpz2g3dcbzci107bw2fdb0xkiskb-darwin-version.json.drv' failed
failed checks.aarch64-darwin.package-gaia-vm 2m 0s
setup: don't know how to build these paths: /nix/store/ivvm6j6m7lmx7ap4z0qwfickzy3q4nnj-run-gaia-vm-on-aarch64-darwin.drv warning: ignoring the client-specifi …
setup:
don't know how to build these paths:
  /nix/store/ivvm6j6m7lmx7ap4z0qwfickzy3q4nnj-run-gaia-vm-on-aarch64-darwin.drv
warning: ignoring the client-specified setting 'store', because it is a restricted setting and you are not a trusted user
warning: ivvm6j6m7lmx7ap4z0qwfickzy3q4nnj-run-gaia-vm-on-aarch64-darwin.drv: no connected, non-draining worker for system 'aarch64-darwin' offers features {}, the workers offer {}, waiting up to 120s for a worker
ivvm6j6m7lmx7ap4z0qwfickzy3q4nnj-run-gaia-vm-on-aarch64-darwin.drv: no connected, non-draining worker for system 'aarch64-darwin' offers features {}, the workers offer {}
error: no connected, non-draining worker for system 'aarch64-darwin' offers features {}, the workers offer {}
failed checks.aarch64-darwin.package-get-clan-secret 2m 1s
setup: don't know how to build these paths: /nix/store/kn0h32qrkprhxix6slifm736q657yyhg-get-clan-secret.drv warning: ignoring the client-specified setting 'st …
setup:
don't know how to build these paths:
  /nix/store/kn0h32qrkprhxix6slifm736q657yyhg-get-clan-secret.drv
warning: ignoring the client-specified setting 'store', because it is a restricted setting and you are not a trusted user
warning: 7507p3d5dc4icywm0lsc5bhz76a6x42n-clan-runtime.drv: no connected, non-draining worker for system 'aarch64-darwin' offers features {}, the workers offer {}, waiting up to 120s for a worker
7507p3d5dc4icywm0lsc5bhz76a6x42n-clan-runtime.drv: no connected, non-draining worker for system 'aarch64-darwin' offers features {}, the workers offer {}
error: dependency 'fqn7w68v2gzpiarb8yw69yn14182j6q1-clan-cli.drv' failed
failed checks.aarch64-darwin.package-phi-nixos-vm 2m 0s
setup: don't know how to build these paths: /nix/store/w9ch1lpviq3667fvd2lhkd0fgq4yrwwy-run-phi-nixos-vm-on-aarch64-darwin.drv warning: ignoring the client-sp …
setup:
don't know how to build these paths:
  /nix/store/w9ch1lpviq3667fvd2lhkd0fgq4yrwwy-run-phi-nixos-vm-on-aarch64-darwin.drv
warning: ignoring the client-specified setting 'store', because it is a restricted setting and you are not a trusted user
warning: w9ch1lpviq3667fvd2lhkd0fgq4yrwwy-run-phi-nixos-vm-on-aarch64-darwin.drv: no connected, non-draining worker for system 'aarch64-darwin' offers features {}, the workers offer {}, waiting up to 120s for a worker
w9ch1lpviq3667fvd2lhkd0fgq4yrwwy-run-phi-nixos-vm-on-aarch64-darwin.drv: no connected, non-draining worker for system 'aarch64-darwin' offers features {}, the workers offer {}
error: no connected, non-draining worker for system 'aarch64-darwin' offers features {}, the workers offer {}
failed checks.aarch64-darwin.package-provide-tf-passphrase 2m 1s
setup: don't know how to build these paths: /nix/store/a0hf4fssk4gvlk0k6jk9f35pmp0rv99d-opentofu-external-key-provider.drv warning: ignoring the client-specif …
setup:
don't know how to build these paths:
  /nix/store/a0hf4fssk4gvlk0k6jk9f35pmp0rv99d-opentofu-external-key-provider.drv
warning: ignoring the client-specified setting 'store', because it is a restricted setting and you are not a trusted user
warning: 7507p3d5dc4icywm0lsc5bhz76a6x42n-clan-runtime.drv: no connected, non-draining worker for system 'aarch64-darwin' offers features {}, the workers offer {}, waiting up to 120s for a worker
7507p3d5dc4icywm0lsc5bhz76a6x42n-clan-runtime.drv: no connected, non-draining worker for system 'aarch64-darwin' offers features {}, the workers offer {}
error: dependency 'fqn7w68v2gzpiarb8yw69yn14182j6q1-clan-cli.drv' failed
failed checks.aarch64-darwin.package-sigma-vm 2m 2s
setup: this derivation will be built: /nix/store/cmajjv3vpzqmk1pws5pnar47v1bvvg7l-run-sigma-vm-on-aarch64-darwin.drv warning: ignoring the client-specified se …
setup:
this derivation will be built:
  /nix/store/cmajjv3vpzqmk1pws5pnar47v1bvvg7l-run-sigma-vm-on-aarch64-darwin.drv
warning: ignoring the client-specified setting 'store', because it is a restricted setting and you are not a trusted user
warning: cmajjv3vpzqmk1pws5pnar47v1bvvg7l-run-sigma-vm-on-aarch64-darwin.drv: no connected, non-draining worker for system 'aarch64-darwin' offers features {}, the workers offer {}, waiting up to 120s for a worker
cmajjv3vpzqmk1pws5pnar47v1bvvg7l-run-sigma-vm-on-aarch64-darwin.drv: no connected, non-draining worker for system 'aarch64-darwin' offers features {}, the workers offer {}
error: no connected, non-draining worker for system 'aarch64-darwin' offers features {}, the workers offer {}
failed checks.aarch64-darwin.package-tf 2m 1s
setup: don't know how to build these paths: /nix/store/bbvdcia03mmnrikhagnzfrfa13y54izk-opentofu-1.13.1.drv warning: ignoring the client-specified setting 'st …
setup:
don't know how to build these paths:
  /nix/store/bbvdcia03mmnrikhagnzfrfa13y54izk-opentofu-1.13.1.drv
warning: ignoring the client-specified setting 'store', because it is a restricted setting and you are not a trusted user
warning: bbvdcia03mmnrikhagnzfrfa13y54izk-opentofu-1.13.1.drv: no connected, non-draining worker for system 'aarch64-darwin' offers features {}, the workers offer {}, waiting up to 120s for a worker
bbvdcia03mmnrikhagnzfrfa13y54izk-opentofu-1.13.1.drv: no connected, non-draining worker for system 'aarch64-darwin' offers features {}, the workers offer {}
error: no connected, non-draining worker for system 'aarch64-darwin' offers features {}, the workers offer {}
dependency failed checks.aarch64-darwin.package-tf-apply —
dependency failed checks.aarch64-darwin.package-tf-destroy —
dependency failed checks.aarch64-darwin.package-tf-init —
failed checks.aarch64-darwin.treefmt 2m 1s
setup: don't know how to build these paths: /nix/store/krjzfyf3x2m34bfpyf87lldyw3xsxdzk-treefmt-check.drv warning: ignoring the client-specified setting 'stor …
setup:
don't know how to build these paths:
  /nix/store/krjzfyf3x2m34bfpyf87lldyw3xsxdzk-treefmt-check.drv
warning: ignoring the client-specified setting 'store', because it is a restricted setting and you are not a trusted user
warning: krjzfyf3x2m34bfpyf87lldyw3xsxdzk-treefmt-check.drv: no connected, non-draining worker for system 'aarch64-darwin' offers features {}, the workers offer {}, waiting up to 120s for a worker
krjzfyf3x2m34bfpyf87lldyw3xsxdzk-treefmt-check.drv: no connected, non-draining worker for system 'aarch64-darwin' offers features {}, the workers offer {}
error: no connected, non-draining worker for system 'aarch64-darwin' offers features {}, the workers offer {}
dependency failed checks.aarch64-linux.devShell-default —
failed checks.aarch64-linux.package-tf 3s
setup: don't know how to build these paths: /nix/store/kdfsbc5ahgddw1vs02vgg6i7lgh8a1f0-opentofu-1.13.1.drv warning: ignoring the client-specified setting 'st …
setup:
don't know how to build these paths:
  /nix/store/kdfsbc5ahgddw1vs02vgg6i7lgh8a1f0-opentofu-1.13.1.drv
warning: ignoring the client-specified setting 'store', because it is a restricted setting and you are not a trusted user
kdfsbc5ahgddw1vs02vgg6i7lgh8a1f0-opentofu-1.13.1.drv: error: gRPC AddMultipleToStore on 'nix-store.geninf.io:50051' failed: error: some references of path '/nix/store/1n1722ckpyr399w2w3bb74ad98n8z94f-terraform-provider-gitea-0.8.1.drv' could not be realised
error: error: gRPC AddMultipleToStore on 'nix-store.geninf.io:50051' failed: error: some references of path '/nix/store/1n1722ckpyr399w2w3bb74ad98n8z94f-terraform-provider-gitea-0.8.1.drv' could not be realised
dependency failed checks.aarch64-linux.package-tf-apply —
dependency failed checks.aarch64-linux.package-tf-destroy —
dependency failed checks.aarch64-linux.package-tf-init —
failed checks.aarch64-linux.treefmt 3s
setup: don't know how to build these paths: /nix/store/9vya4m58xdn6xnqwpv7plah4f9jcq8nv-treefmt-check.drv warning: ignoring the client-specified setting 'stor …
setup:
don't know how to build these paths:
  /nix/store/9vya4m58xdn6xnqwpv7plah4f9jcq8nv-treefmt-check.drv
warning: ignoring the client-specified setting 'store', because it is a restricted setting and you are not a trusted user
9vya4m58xdn6xnqwpv7plah4f9jcq8nv-treefmt-check.drv: error: gRPC AddMultipleToStore on 'nix-store.geninf.io:50051' failed: error: some references of path '/nix/store/rnbix0f1rip6cc9h99h2p6rw436y0v0x-actionlint-1.7.12.drv' could not be realised
error: error: gRPC AddMultipleToStore on 'nix-store.geninf.io:50051' failed: error: some references of path '/nix/store/rnbix0f1rip6cc9h99h2p6rw436y0v0x-actionlint-1.7.12.drv' could not be realised
22 succeeded ⚠ 1
succeeded attributes
status attribute duration
succeeded checks.x86_64-linux.nixos-phi-nixos
  • A legacy Nextcloud install (from before NixOS 26.11) may be installed. After nextcloud33 is installed successfully, you can safely upgrade to 34. The latest version available is Nextcloud35. Please note that Nextcloud doesn't support upgrades across multiple major versions (i.e. an upgrade from 16 is possible to 17, but not 16 to 18). The package can be upgraded by explicitly declaring the service-option `services.nextcloud.package`.
  • A legacy Nextcloud install (from before NixOS 26.11) may be installed. After nextcloud34 is installed successfully, you can safely upgrade to 35. The latest version available is Nextcloud35. Please note that Nextcloud doesn't support upgrades across multiple major versions (i.e. an upgrade from 16 is possible to 17, but not 16 to 18). The package can be upgraded by explicitly declaring the service-option `services.nextcloud.package`.
2m 43s
succeeded checks.aarch64-linux.package-gaia-vm 4s
succeeded checks.aarch64-linux.package-get-clan-secret 27s
succeeded checks.aarch64-linux.package-phi-nixos-vm 4s
succeeded checks.aarch64-linux.package-provide-tf-passphrase 26s
succeeded checks.aarch64-linux.package-sigma-vm 5s
succeeded checks.x86_64-linux.devShell-default 55s
succeeded checks.x86_64-linux."home-manager-enzime@gaia" 2m 9s
succeeded checks.x86_64-linux."home-manager-enzime@phi-nixos" 2m 17s
succeeded checks.x86_64-linux."home-manager-enzime@sigma" 2m 4s
succeeded checks.x86_64-linux.nixos-gaia 2m 45s
succeeded checks.x86_64-linux.nixos-sigma 2m 49s
succeeded checks.x86_64-linux.package-gaia-vm 10s
succeeded checks.x86_64-linux.package-get-clan-secret 1m 29s
succeeded checks.x86_64-linux.package-phi-nixos-vm 10s
succeeded checks.x86_64-linux.package-provide-tf-passphrase 1m 29s
succeeded checks.x86_64-linux.package-sigma-vm 13s
succeeded checks.x86_64-linux.package-tf 11s
succeeded checks.x86_64-linux.package-tf-apply 35s
succeeded checks.x86_64-linux.package-tf-destroy 32s
succeeded checks.x86_64-linux.package-tf-init 32s
succeeded checks.x86_64-linux.treefmt 11s
18 already built
skipped attributes
status attribute duration
loading…