nixbot

builds

Enzime/hyperconfig build #1151 failed

branch next · PR #1086 · commit a9282ebd02 · · took 3m 53s · eval 29s

eval warnings 1 kind · 2 occurrences
  • warn A legacy Nextcloud install (from before NixOS 26.11) may be installed. ×2

9 failed
failed attributes
status attribute duration
failed checks.aarch64-darwin."home-manager-enzime@hyperion-macos" 2m 4s
setup: warning: ignoring the client-specified setting 'store', because it is a restricted setting and you are not a trusted user warning: 0gamsykfxqv7kdb70nhfv6 …
setup:
warning: ignoring the client-specified setting 'store', because it is a restricted setting and you are not a trusted user
warning: 0gamsykfxqv7kdb70nhfv60jw0m9q5jg-claude.drv: no connected, non-draining worker for system 'aarch64-darwin' offers features {}, the workers offer {}, waiting up to 120s for a worker
warning: 5vrcy1bmhvpncj4wi5b433xdii00q7ad-source.drv: no connected, non-draining worker for system 'aarch64-darwin' offers features {}, the workers offer {}, waiting up to 120s for a worker
warning: rvxcchas8c9j68bf6bsxp6bnwq1cv244-source.drv: no connected, non-draining worker for system 'aarch64-darwin' offers features {}, the workers offer {}, waiting up to 120s for a worker
0gamsykfxqv7kdb70nhfv60jw0m9q5jg-claude.drv: no connected, non-draining worker for system 'aarch64-darwin' offers features {}, the workers offer {}
5vrcy1bmhvpncj4wi5b433xdii00q7ad-source.drv: no connected, non-draining worker for system 'aarch64-darwin' offers features {}, the workers offer {}
rvxcchas8c9j68bf6bsxp6bnwq1cv244-source.drv: no connected, non-draining worker for system 'aarch64-darwin' offers features {}, the workers offer {}
error: dependency '4qd5x6rm3hddfpk1spvxz6gh8pp6akn8-home-manager-path.drv' failed
failed checks.aarch64-darwin.nix-darwin-hyperion-macos 2m 6s
setup: warning: rvxcchas8c9j68bf6bsxp6bnwq1cv244-source.drv: no connected, non-draining worker for system 'aarch64-darwin' offers features {}, the workers offer …
setup:
warning: rvxcchas8c9j68bf6bsxp6bnwq1cv244-source.drv: no connected, non-draining worker for system 'aarch64-darwin' offers features {}, the workers offer {}, waiting up to 120s for a worker
warning: ynhzx9xgfg0blb40saknjq8ana3mai29-darwin-version.json.drv: no connected, non-draining worker for system 'aarch64-darwin' offers features {}, the workers offer {}, waiting up to 120s for a worker
0gamsykfxqv7kdb70nhfv60jw0m9q5jg-claude.drv: no connected, non-draining worker for system 'aarch64-darwin' offers features {}, the workers offer {}
5vrcy1bmhvpncj4wi5b433xdii00q7ad-source.drv: no connected, non-draining worker for system 'aarch64-darwin' offers features {}, the workers offer {}
86pc9d252h2038974irc2fg9i91ywm7x-etc-registry.json.drv: no connected, non-draining worker for system 'aarch64-darwin' offers features {}, the workers offer {}
rvxcchas8c9j68bf6bsxp6bnwq1cv244-source.drv: no connected, non-draining worker for system 'aarch64-darwin' offers features {}, the workers offer {}
ynhzx9xgfg0blb40saknjq8ana3mai29-darwin-version.json.drv: no connected, non-draining worker for system 'aarch64-darwin' offers features {}, the workers offer {}
error: dependency 'ynhzx9xgfg0blb40saknjq8ana3mai29-darwin-version.json.drv' failed
failed checks.aarch64-darwin.package-gaia-vm 2m 0s
setup: don't know how to build these paths: /nix/store/7kyg18hhhb0vd9q90825py75f43sq9q0-run-gaia-vm-on-aarch64-darwin.drv warning: ignoring the client-specifi …
setup:
don't know how to build these paths:
  /nix/store/7kyg18hhhb0vd9q90825py75f43sq9q0-run-gaia-vm-on-aarch64-darwin.drv
warning: ignoring the client-specified setting 'store', because it is a restricted setting and you are not a trusted user
warning: 7kyg18hhhb0vd9q90825py75f43sq9q0-run-gaia-vm-on-aarch64-darwin.drv: no connected, non-draining worker for system 'aarch64-darwin' offers features {}, the workers offer {}, waiting up to 120s for a worker
7kyg18hhhb0vd9q90825py75f43sq9q0-run-gaia-vm-on-aarch64-darwin.drv: no connected, non-draining worker for system 'aarch64-darwin' offers features {}, the workers offer {}
error: no connected, non-draining worker for system 'aarch64-darwin' offers features {}, the workers offer {}
failed checks.aarch64-darwin.package-phi-nixos-vm 2m 1s
setup: don't know how to build these paths: /nix/store/rhwq3rmzwxgay3rqa6zda9wvmkwsf6cx-run-phi-nixos-vm-on-aarch64-darwin.drv warning: ignoring the client-sp …
setup:
don't know how to build these paths:
  /nix/store/rhwq3rmzwxgay3rqa6zda9wvmkwsf6cx-run-phi-nixos-vm-on-aarch64-darwin.drv
warning: ignoring the client-specified setting 'store', because it is a restricted setting and you are not a trusted user
warning: rhwq3rmzwxgay3rqa6zda9wvmkwsf6cx-run-phi-nixos-vm-on-aarch64-darwin.drv: no connected, non-draining worker for system 'aarch64-darwin' offers features {}, the workers offer {}, waiting up to 120s for a worker
rhwq3rmzwxgay3rqa6zda9wvmkwsf6cx-run-phi-nixos-vm-on-aarch64-darwin.drv: no connected, non-draining worker for system 'aarch64-darwin' offers features {}, the workers offer {}
error: no connected, non-draining worker for system 'aarch64-darwin' offers features {}, the workers offer {}
failed checks.aarch64-darwin.package-sigma-vm 2m 1s
setup: don't know how to build these paths: /nix/store/r9j0dyq7a4pkwh3jxhbiw8h0x4wcknxq-run-sigma-vm-on-aarch64-darwin.drv warning: ignoring the client-specif …
setup:
don't know how to build these paths:
  /nix/store/r9j0dyq7a4pkwh3jxhbiw8h0x4wcknxq-run-sigma-vm-on-aarch64-darwin.drv
warning: ignoring the client-specified setting 'store', because it is a restricted setting and you are not a trusted user
warning: r9j0dyq7a4pkwh3jxhbiw8h0x4wcknxq-run-sigma-vm-on-aarch64-darwin.drv: no connected, non-draining worker for system 'aarch64-darwin' offers features {}, the workers offer {}, waiting up to 120s for a worker
r9j0dyq7a4pkwh3jxhbiw8h0x4wcknxq-run-sigma-vm-on-aarch64-darwin.drv: no connected, non-draining worker for system 'aarch64-darwin' offers features {}, the workers offer {}
error: no connected, non-draining worker for system 'aarch64-darwin' offers features {}, the workers offer {}
failed checks.aarch64-darwin.treefmt 2m 0s
setup: don't know how to build these paths: /nix/store/96dlgxqzfcfm8qh9z70bkl4am4mn28hm-treefmt-check.drv warning: ignoring the client-specified setting 'stor …
setup:
don't know how to build these paths:
  /nix/store/96dlgxqzfcfm8qh9z70bkl4am4mn28hm-treefmt-check.drv
warning: ignoring the client-specified setting 'store', because it is a restricted setting and you are not a trusted user
warning: 96dlgxqzfcfm8qh9z70bkl4am4mn28hm-treefmt-check.drv: no connected, non-draining worker for system 'aarch64-darwin' offers features {}, the workers offer {}, waiting up to 120s for a worker
96dlgxqzfcfm8qh9z70bkl4am4mn28hm-treefmt-check.drv: no connected, non-draining worker for system 'aarch64-darwin' offers features {}, the workers offer {}
error: no connected, non-draining worker for system 'aarch64-darwin' offers features {}, the workers offer {}
failed checks.aarch64-linux.devShell-default 7s
setup: don't know how to build these paths: /nix/store/r4mb68hv8pxykxfkkqmkz59yh41wwcrh-nix-shell.drv warning: ignoring the client-specified setting 'store', …
setup:
don't know how to build these paths:
  /nix/store/r4mb68hv8pxykxfkkqmkz59yh41wwcrh-nix-shell.drv
warning: ignoring the client-specified setting 'store', because it is a restricted setting and you are not a trusted user
fi17140nscf5wcvwp0ix7d33cgpr6bgr-opentofu-1.13.1.drv: error: gRPC AddMultipleToStore on 'nix-store.geninf.io:50051' failed: error: some references of path '/nix/store/1n1722ckpyr399w2w3bb74ad98n8z94f-terraform-provider-gitea-0.8.1.drv' could not be realised
error: dependency 'fi17140nscf5wcvwp0ix7d33cgpr6bgr-opentofu-1.13.1.drv' failed
failed checks.aarch64-linux.package-tf-destroy 3s
setup: 25kss3zw4bm1rnyhl3nsj8wcpy8xs1sf-config.tf.json.drv: build01: build01: input not substitutable: error: path '/nix/store/3aw2mzjm25zdndvnynizc4dx8jvw51y2- …
setup:
25kss3zw4bm1rnyhl3nsj8wcpy8xs1sf-config.tf.json.drv: build01: build01: input not substitutable: error: path '/nix/store/3aw2mzjm25zdndvnynizc4dx8jvw51y2-opentofu-external-key-provider' is required, but there is no substituter that can build it, asking the scheduler again
25kss3zw4bm1rnyhl3nsj8wcpy8xs1sf-config.tf.json.drv: build01: build01: input not substitutable: error: path '/nix/store/3aw2mzjm25zdndvnynizc4dx8jvw51y2-opentofu-external-key-provider' is required, but there is no substituter that can build it, asking the scheduler again
25kss3zw4bm1rnyhl3nsj8wcpy8xs1sf-config.tf.json.drv: build01: build01: input not substitutable: error: path '/nix/store/3aw2mzjm25zdndvnynizc4dx8jvw51y2-opentofu-external-key-provider' is required, but there is no substituter that can build it, asking the scheduler again
25kss3zw4bm1rnyhl3nsj8wcpy8xs1sf-config.tf.json.drv: build01: build01: input not substitutable: error: path '/nix/store/3aw2mzjm25zdndvnynizc4dx8jvw51y2-opentofu-external-key-provider' is required, but there is no substituter that can build it, asking the scheduler again
25kss3zw4bm1rnyhl3nsj8wcpy8xs1sf-config.tf.json.drv: build01: build01: input not substitutable: error: path '/nix/store/3aw2mzjm25zdndvnynizc4dx8jvw51y2-opentofu-external-key-provider' is required, but there is no substituter that can build it, asking the scheduler again
25kss3zw4bm1rnyhl3nsj8wcpy8xs1sf-config.tf.json.drv: build01: build01: input not substitutable: error: path '/nix/store/3aw2mzjm25zdndvnynizc4dx8jvw51y2-opentofu-external-key-provider' is required, but there is no substituter that can build it, asking the scheduler again
25kss3zw4bm1rnyhl3nsj8wcpy8xs1sf-config.tf.json.drv: build01: build01: input not substitutable: error: path '/nix/store/3aw2mzjm25zdndvnynizc4dx8jvw51y2-opentofu-external-key-provider' is required, but there is no substituter that can build it, asking the scheduler again
error: dependency '25kss3zw4bm1rnyhl3nsj8wcpy8xs1sf-config.tf.json.drv' failed
failed checks.aarch64-linux.treefmt 1s
setup: don't know how to build these paths: /nix/store/mhlazxm5rfj4d41dv28mppynkmmlrakx-treefmt-check.drv warning: ignoring the client-specified setting 'stor …
setup:
don't know how to build these paths:
  /nix/store/mhlazxm5rfj4d41dv28mppynkmmlrakx-treefmt-check.drv
warning: ignoring the client-specified setting 'store', because it is a restricted setting and you are not a trusted user
mhlazxm5rfj4d41dv28mppynkmmlrakx-treefmt-check.drv: error: gRPC AddMultipleToStore on 'nix-store.geninf.io:50051' failed: error: some references of path '/nix/store/rnbix0f1rip6cc9h99h2p6rw436y0v0x-actionlint-1.7.12.drv' could not be realised
error: error: gRPC AddMultipleToStore on 'nix-store.geninf.io:50051' failed: error: some references of path '/nix/store/rnbix0f1rip6cc9h99h2p6rw436y0v0x-actionlint-1.7.12.drv' could not be realised
13 succeeded ⚠ 1
succeeded attributes
status attribute duration
succeeded checks.x86_64-linux.nixos-phi-nixos
  • A legacy Nextcloud install (from before NixOS 26.11) may be installed. After nextcloud33 is installed successfully, you can safely upgrade to 34. The latest version available is Nextcloud35. Please note that Nextcloud doesn't support upgrades across multiple major versions (i.e. an upgrade from 16 is possible to 17, but not 16 to 18). The package can be upgraded by explicitly declaring the service-option `services.nextcloud.package`.
  • A legacy Nextcloud install (from before NixOS 26.11) may be installed. After nextcloud34 is installed successfully, you can safely upgrade to 35. The latest version available is Nextcloud35. Please note that Nextcloud doesn't support upgrades across multiple major versions (i.e. an upgrade from 16 is possible to 17, but not 16 to 18). The package can be upgraded by explicitly declaring the service-option `services.nextcloud.package`.
2m 34s
succeeded checks.aarch64-linux.package-gaia-vm 2s
succeeded checks.aarch64-linux.package-phi-nixos-vm 3s
succeeded checks.aarch64-linux.package-sigma-vm 7s
succeeded checks.x86_64-linux."home-manager-enzime@gaia" 19s
succeeded checks.x86_64-linux."home-manager-enzime@phi-nixos" 19s
succeeded checks.x86_64-linux."home-manager-enzime@sigma" 26s
succeeded checks.x86_64-linux.nixos-gaia 3m 3s
succeeded checks.x86_64-linux.nixos-sigma 3m 22s
succeeded checks.x86_64-linux.package-gaia-vm 16s
succeeded checks.x86_64-linux.package-phi-nixos-vm 16s
succeeded checks.x86_64-linux.package-sigma-vm 16s
succeeded checks.x86_64-linux.treefmt 18s
37 already built
skipped attributes
status attribute duration
loading…