nixbot

builds

Enzime/hyperconfig build #1156 failed

branch next · PR #1090 · commit c87152f6dd · · took 2m 42s · eval 21s

eval warnings 1 kind · 2 occurrences
  • warn A legacy Nextcloud install (from before NixOS 26.11) may be installed. ×2

10 failed
failed attributes
status attribute duration
failed checks.aarch64-darwin.devShell-default 2m 1s
setup: don't know how to build these paths: /nix/store/q1ijlyrmm72v676px54q4vxryf0yqis3-nix-shell.drv warning: ignoring the client-specified setting 'store', …
setup:
don't know how to build these paths:
  /nix/store/q1ijlyrmm72v676px54q4vxryf0yqis3-nix-shell.drv
warning: ignoring the client-specified setting 'store', because it is a restricted setting and you are not a trusted user
warning: q1ijlyrmm72v676px54q4vxryf0yqis3-nix-shell.drv: no connected, non-draining worker for system 'aarch64-darwin' offers features {}, the workers offer {}, waiting up to 120s for a worker
q1ijlyrmm72v676px54q4vxryf0yqis3-nix-shell.drv: no connected, non-draining worker for system 'aarch64-darwin' offers features {}, the workers offer {}
error: no connected, non-draining worker for system 'aarch64-darwin' offers features {}, the workers offer {}
failed checks.aarch64-darwin."home-manager-enzime@hyperion-macos" 2m 4s
setup: don't know how to build these paths: /nix/store/y26v5si8z9a0y6vpybq2ah8bff6baknm-home-manager-generation.drv warning: ignoring the client-specified set …
setup:
don't know how to build these paths:
  /nix/store/y26v5si8z9a0y6vpybq2ah8bff6baknm-home-manager-generation.drv
warning: ignoring the client-specified setting 'store', because it is a restricted setting and you are not a trusted user
warning: 5cvgvxzq3iyyllvc8z89vh40ycnkyjhv-index-aarch64-darwin.drv: no connected, non-draining worker for system 'aarch64-darwin' offers features {}, the workers offer {}, waiting up to 120s for a worker
warning: x4kgl6xa2fsijhny8zi2pfl6vmxz0xml-index-aarch64-darwin-small.drv: no connected, non-draining worker for system 'aarch64-darwin' offers features {}, the workers offer {}, waiting up to 120s for a worker
5cvgvxzq3iyyllvc8z89vh40ycnkyjhv-index-aarch64-darwin.drv: no connected, non-draining worker for system 'aarch64-darwin' offers features {}, the workers offer {}
x4kgl6xa2fsijhny8zi2pfl6vmxz0xml-index-aarch64-darwin-small.drv: no connected, non-draining worker for system 'aarch64-darwin' offers features {}, the workers offer {}
error: dependency 'fq2klwdi5qs5a5172cx6qv9c03c9lhzz-home-manager-path.drv' failed
failed checks.aarch64-darwin.nix-darwin-hyperion-macos 2m 21s
setup: warning: nb4ssr93x213miy6zz8dkbnmi8yl5rzk-darwin-version.json.drv: no connected, non-draining worker for system 'aarch64-darwin' offers features {}, the …
setup:
warning: nb4ssr93x213miy6zz8dkbnmi8yl5rzk-darwin-version.json.drv: no connected, non-draining worker for system 'aarch64-darwin' offers features {}, the workers offer {}, waiting up to 120s for a worker
warning: ri7ysibx6qyacxl9rhb0b4vyxqnjbx5s-etc-registry.json.drv: no connected, non-draining worker for system 'aarch64-darwin' offers features {}, the workers offer {}, waiting up to 120s for a worker
warning: x4kgl6xa2fsijhny8zi2pfl6vmxz0xml-index-aarch64-darwin-small.drv: no connected, non-draining worker for system 'aarch64-darwin' offers features {}, the workers offer {}, waiting up to 120s for a worker
5cvgvxzq3iyyllvc8z89vh40ycnkyjhv-index-aarch64-darwin.drv: no connected, non-draining worker for system 'aarch64-darwin' offers features {}, the workers offer {}
nb4ssr93x213miy6zz8dkbnmi8yl5rzk-darwin-version.json.drv: no connected, non-draining worker for system 'aarch64-darwin' offers features {}, the workers offer {}
ri7ysibx6qyacxl9rhb0b4vyxqnjbx5s-etc-registry.json.drv: no connected, non-draining worker for system 'aarch64-darwin' offers features {}, the workers offer {}
x4kgl6xa2fsijhny8zi2pfl6vmxz0xml-index-aarch64-darwin-small.drv: no connected, non-draining worker for system 'aarch64-darwin' offers features {}, the workers offer {}
error: dependency 'nb4ssr93x213miy6zz8dkbnmi8yl5rzk-darwin-version.json.drv' failed
failed checks.aarch64-darwin.package-gaia-vm 2m 2s
setup: don't know how to build these paths: /nix/store/dd83d48074jnvcgr5qw8wmjp9wzhlq47-run-gaia-vm-on-aarch64-darwin.drv warning: ignoring the client-specifi …
setup:
don't know how to build these paths:
  /nix/store/dd83d48074jnvcgr5qw8wmjp9wzhlq47-run-gaia-vm-on-aarch64-darwin.drv
warning: ignoring the client-specified setting 'store', because it is a restricted setting and you are not a trusted user
warning: dd83d48074jnvcgr5qw8wmjp9wzhlq47-run-gaia-vm-on-aarch64-darwin.drv: no connected, non-draining worker for system 'aarch64-darwin' offers features {}, the workers offer {}, waiting up to 120s for a worker
dd83d48074jnvcgr5qw8wmjp9wzhlq47-run-gaia-vm-on-aarch64-darwin.drv: no connected, non-draining worker for system 'aarch64-darwin' offers features {}, the workers offer {}
error: no connected, non-draining worker for system 'aarch64-darwin' offers features {}, the workers offer {}
failed checks.aarch64-darwin.package-phi-nixos-vm 2m 1s
setup: this derivation will be built: /nix/store/mbn113g68wmbfzbijpzfhncfc8p01aja-run-phi-nixos-vm-on-aarch64-darwin.drv warning: ignoring the client-specifie …
setup:
this derivation will be built:
  /nix/store/mbn113g68wmbfzbijpzfhncfc8p01aja-run-phi-nixos-vm-on-aarch64-darwin.drv
warning: ignoring the client-specified setting 'store', because it is a restricted setting and you are not a trusted user
warning: mbn113g68wmbfzbijpzfhncfc8p01aja-run-phi-nixos-vm-on-aarch64-darwin.drv: no connected, non-draining worker for system 'aarch64-darwin' offers features {}, the workers offer {}, waiting up to 120s for a worker
mbn113g68wmbfzbijpzfhncfc8p01aja-run-phi-nixos-vm-on-aarch64-darwin.drv: no connected, non-draining worker for system 'aarch64-darwin' offers features {}, the workers offer {}
error: no connected, non-draining worker for system 'aarch64-darwin' offers features {}, the workers offer {}
failed checks.aarch64-darwin.package-sigma-vm 2m 1s
setup: don't know how to build these paths: /nix/store/zcxz28b0fyqdjjwrl511rjm78qm4sys3-run-sigma-vm-on-aarch64-darwin.drv warning: ignoring the client-specif …
setup:
don't know how to build these paths:
  /nix/store/zcxz28b0fyqdjjwrl511rjm78qm4sys3-run-sigma-vm-on-aarch64-darwin.drv
warning: ignoring the client-specified setting 'store', because it is a restricted setting and you are not a trusted user
warning: zcxz28b0fyqdjjwrl511rjm78qm4sys3-run-sigma-vm-on-aarch64-darwin.drv: no connected, non-draining worker for system 'aarch64-darwin' offers features {}, the workers offer {}, waiting up to 120s for a worker
zcxz28b0fyqdjjwrl511rjm78qm4sys3-run-sigma-vm-on-aarch64-darwin.drv: no connected, non-draining worker for system 'aarch64-darwin' offers features {}, the workers offer {}
error: no connected, non-draining worker for system 'aarch64-darwin' offers features {}, the workers offer {}
failed checks.aarch64-darwin.treefmt 2m 3s
setup: /nix/store/925b3zxz1j0984ywkl3y35v0bbrda2k9-statix-0.5.8-unstable-2026-07-17 /nix/store/775mmr2czhrfc7p45i9rwp5imkb7wcvd-statix-config /nix/store/q …
setup:
  /nix/store/925b3zxz1j0984ywkl3y35v0bbrda2k9-statix-0.5.8-unstable-2026-07-17
  /nix/store/775mmr2czhrfc7p45i9rwp5imkb7wcvd-statix-config
  /nix/store/q3s56vfx8n9d3l5pp9jl7kq3ncpa0fw4-statix-fix
  /nix/store/m965417sqcxjj5dj6wmhd4a57a1nx6jk-treefmt.toml
warning: ignoring the client-specified setting 'store', because it is a restricted setting and you are not a trusted user
warning: b4k6yqgfkfslr3pk6xssrzyyvr2igv1v-treefmt-check.drv: no connected, non-draining worker for system 'aarch64-darwin' offers features {}, the workers offer {}, waiting up to 120s for a worker
b4k6yqgfkfslr3pk6xssrzyyvr2igv1v-treefmt-check.drv: no connected, non-draining worker for system 'aarch64-darwin' offers features {}, the workers offer {}
error: no connected, non-draining worker for system 'aarch64-darwin' offers features {}, the workers offer {}
failed checks.aarch64-linux.devShell-default 2s
setup: don't know how to build these paths: /nix/store/r4mb68hv8pxykxfkkqmkz59yh41wwcrh-nix-shell.drv warning: ignoring the client-specified setting 'store', …
setup:
don't know how to build these paths:
  /nix/store/r4mb68hv8pxykxfkkqmkz59yh41wwcrh-nix-shell.drv
warning: ignoring the client-specified setting 'store', because it is a restricted setting and you are not a trusted user
r4mb68hv8pxykxfkkqmkz59yh41wwcrh-nix-shell.drv: error: gRPC AddMultipleToStore on 'nix-store.geninf.io:50051' failed: error: some references of path '/nix/store/1n1722ckpyr399w2w3bb74ad98n8z94f-terraform-provider-gitea-0.8.1.drv' could not be realised
error: error: gRPC AddMultipleToStore on 'nix-store.geninf.io:50051' failed: error: some references of path '/nix/store/1n1722ckpyr399w2w3bb74ad98n8z94f-terraform-provider-gitea-0.8.1.drv' could not be realised
failed checks.aarch64-linux.package-tf-init 6s
setup: 25kss3zw4bm1rnyhl3nsj8wcpy8xs1sf-config.tf.json.drv: build01: build01: input not substitutable: error: path '/nix/store/3aw2mzjm25zdndvnynizc4dx8jvw51y2- …
setup:
25kss3zw4bm1rnyhl3nsj8wcpy8xs1sf-config.tf.json.drv: build01: build01: input not substitutable: error: path '/nix/store/3aw2mzjm25zdndvnynizc4dx8jvw51y2-opentofu-external-key-provider' is required, but there is no substituter that can build it, asking the scheduler again
25kss3zw4bm1rnyhl3nsj8wcpy8xs1sf-config.tf.json.drv: build01: build01: input not substitutable: error: path '/nix/store/3aw2mzjm25zdndvnynizc4dx8jvw51y2-opentofu-external-key-provider' is required, but there is no substituter that can build it, asking the scheduler again
25kss3zw4bm1rnyhl3nsj8wcpy8xs1sf-config.tf.json.drv: build01: build01: input not substitutable: error: path '/nix/store/3aw2mzjm25zdndvnynizc4dx8jvw51y2-opentofu-external-key-provider' is required, but there is no substituter that can build it, asking the scheduler again
25kss3zw4bm1rnyhl3nsj8wcpy8xs1sf-config.tf.json.drv: build01: build01: input not substitutable: error: path '/nix/store/3aw2mzjm25zdndvnynizc4dx8jvw51y2-opentofu-external-key-provider' is required, but there is no substituter that can build it, asking the scheduler again
25kss3zw4bm1rnyhl3nsj8wcpy8xs1sf-config.tf.json.drv: build01: build01: input not substitutable: error: path '/nix/store/3aw2mzjm25zdndvnynizc4dx8jvw51y2-opentofu-external-key-provider' is required, but there is no substituter that can build it, asking the scheduler again
25kss3zw4bm1rnyhl3nsj8wcpy8xs1sf-config.tf.json.drv: build01: build01: input not substitutable: error: path '/nix/store/3aw2mzjm25zdndvnynizc4dx8jvw51y2-opentofu-external-key-provider' is required, but there is no substituter that can build it, asking the scheduler again
25kss3zw4bm1rnyhl3nsj8wcpy8xs1sf-config.tf.json.drv: build01: build01: input not substitutable: error: path '/nix/store/3aw2mzjm25zdndvnynizc4dx8jvw51y2-opentofu-external-key-provider' is required, but there is no substituter that can build it, asking the scheduler again
error: dependency '25kss3zw4bm1rnyhl3nsj8wcpy8xs1sf-config.tf.json.drv' failed
failed checks.aarch64-linux.treefmt 2s
setup: don't know how to build these paths: /nix/store/86p1xj43jncvbs82rvw2dndhz0zrw5ww-treefmt-check.drv warning: ignoring the client-specified setting 'stor …
setup:
don't know how to build these paths:
  /nix/store/86p1xj43jncvbs82rvw2dndhz0zrw5ww-treefmt-check.drv
warning: ignoring the client-specified setting 'store', because it is a restricted setting and you are not a trusted user
86p1xj43jncvbs82rvw2dndhz0zrw5ww-treefmt-check.drv: error: gRPC AddMultipleToStore on 'nix-store.geninf.io:50051' failed: error: some references of path '/nix/store/rnbix0f1rip6cc9h99h2p6rw436y0v0x-actionlint-1.7.12.drv' could not be realised
error: error: gRPC AddMultipleToStore on 'nix-store.geninf.io:50051' failed: error: some references of path '/nix/store/rnbix0f1rip6cc9h99h2p6rw436y0v0x-actionlint-1.7.12.drv' could not be realised
13 succeeded ⚠ 1
succeeded attributes
status attribute duration
succeeded checks.x86_64-linux.nixos-phi-nixos
  • A legacy Nextcloud install (from before NixOS 26.11) may be installed. After nextcloud33 is installed successfully, you can safely upgrade to 34. The latest version available is Nextcloud35. Please note that Nextcloud doesn't support upgrades across multiple major versions (i.e. an upgrade from 16 is possible to 17, but not 16 to 18). The package can be upgraded by explicitly declaring the service-option `services.nextcloud.package`.
  • A legacy Nextcloud install (from before NixOS 26.11) may be installed. After nextcloud34 is installed successfully, you can safely upgrade to 35. The latest version available is Nextcloud35. Please note that Nextcloud doesn't support upgrades across multiple major versions (i.e. an upgrade from 16 is possible to 17, but not 16 to 18). The package can be upgraded by explicitly declaring the service-option `services.nextcloud.package`.
2m 7s
succeeded checks.aarch64-linux.package-gaia-vm 2s
succeeded checks.aarch64-linux.package-phi-nixos-vm 4s
succeeded checks.aarch64-linux.package-sigma-vm 3s
succeeded checks.x86_64-linux."home-manager-enzime@gaia" 58s
succeeded checks.x86_64-linux."home-manager-enzime@phi-nixos" 1m 17s
succeeded checks.x86_64-linux."home-manager-enzime@sigma" 1m 10s
succeeded checks.x86_64-linux.nixos-gaia 2m 6s
succeeded checks.x86_64-linux.nixos-sigma 2m 7s
succeeded checks.x86_64-linux.package-gaia-vm 7s
succeeded checks.x86_64-linux.package-phi-nixos-vm 5s
succeeded checks.x86_64-linux.package-sigma-vm 6s
succeeded checks.x86_64-linux.treefmt 7s
36 already built
skipped attributes
status attribute duration
loading…