nixbot

builds

Enzime/hyperconfig build #1157 failed

branch next · PR #1084 · commit dbf866a53e · · took 9m 31s · eval 1m 27s

eval warnings 1 kind · 2 occurrences
  • warn A legacy Nextcloud install (from before NixOS 26.11) may be installed. ×2

34 failed ⚠ 1
failed attributes
status attribute duration
failed checks.x86_64-linux.nixos-phi-nixos
  • A legacy Nextcloud install (from before NixOS 26.11) may be installed. After nextcloud33 is installed successfully, you can safely upgrade to 34. The latest version available is Nextcloud35. Please note that Nextcloud doesn't support upgrades across multiple major versions (i.e. an upgrade from 16 is possible to 17, but not 16 to 18). The package can be upgraded by explicitly declaring the service-option `services.nextcloud.package`.
  • A legacy Nextcloud install (from before NixOS 26.11) may be installed. After nextcloud34 is installed successfully, you can safely upgrade to 35. The latest version available is Nextcloud35. Please note that Nextcloud doesn't support upgrades across multiple major versions (i.e. an upgrade from 16 is possible to 17, but not 16 to 18). The package can be upgraded by explicitly declaring the service-option `services.nextcloud.package`.
4m 2s
setup: faj6lqzprbmkz590a90490gzcnfz366a-fix-ctrl-arrows.patch.drv: gi-build-x86-02: the build this call attached to did not finish, retry, asking the scheduler …
setup:
faj6lqzprbmkz590a90490gzcnfz366a-fix-ctrl-arrows.patch.drv: gi-build-x86-02: the build this call attached to did not finish, retry, asking the scheduler again
faj6lqzprbmkz590a90490gzcnfz366a-fix-ctrl-arrows.patch.drv: gi-build-x86-02: the build this call attached to did not finish, retry, asking the scheduler again
li70apikd1cffd1zspkbh3fralhc8l8c-tailscale-1.102.5.drv: build-x86-01: the build this call attached to did not finish, retry, asking the scheduler again
li70apikd1cffd1zspkbh3fralhc8l8c-tailscale-1.102.5.drv: gi-build-x86-02: the build this call attached to did not finish, retry, asking the scheduler again
li70apikd1cffd1zspkbh3fralhc8l8c-tailscale-1.102.5.drv: build-x86-01: publish failed: error: niks3 push: uploading objects: uploading NAR nar/15r5z975q86n88rwh9ksckj9d9j49zwq17l8x8c6hzfw66qna7vh.nar.zst: uploading part 2: server returned 500: , asking the scheduler again
li70apikd1cffd1zspkbh3fralhc8l8c-tailscale-1.102.5.drv: gi-build-x86-02: the build this call attached to did not finish, retry, asking the scheduler again
li70apikd1cffd1zspkbh3fralhc8l8c-tailscale-1.102.5.drv: build-x86-01: publish failed: error: niks3 push: uploading objects: uploading NAR nar/15r5z975q86n88rwh9ksckj9d9j49zwq17l8x8c6hzfw66qna7vh.nar.zst: uploading part 2: server returned 500: , asking the scheduler again
error: dependency 'vd8bdacz7114iapy41rmkn7rvp47gw0z-system-path.drv' failed
dependency failed checks.aarch64-darwin.devShell-default —
failed checks.aarch64-darwin."home-manager-enzime@hyperion-macos" 5m 28s
setup: /nix/store/aa33ni9r31y6lmad4g83iyqj6hgmvkz6-zod-3.25.76.tgz /nix/store/nyn817bda5qwwnjwxqjr1g4mykfdv8hs-zsh-prezto-0-unstable-2025-07-30 /nix/store …
setup:
  /nix/store/aa33ni9r31y6lmad4g83iyqj6hgmvkz6-zod-3.25.76.tgz
  /nix/store/nyn817bda5qwwnjwxqjr1g4mykfdv8hs-zsh-prezto-0-unstable-2025-07-30
  /nix/store/hqhk73agzmpgb129yvmiw6vpv9yxr18w-zsh-you-should-use-1.11.1
  /nix/store/y2rfagdz0zmb2dr1g9ll1hhndv2g577j-zstd-1.5.7
  /nix/store/j75x9rykhj0d45mpwib6zc0nw1a7w3k8-zvbi-0.2.44
  /nix/store/fbk115rn3nyd9dic8r88r6l45hqy9dq6-zvbi-0.2.45
warning: ignoring the client-specified setting 'store', because it is a restricted setting and you are not a trusted user
error: gRPC QueryValidPaths on 'nix-store.geninf.io:50051' failed: error: niks3 push: uploading objects: uploading build log log/3lsd80hyz37yfj6grlvjj5dsdzf7k76r-fix-ctrl-arrows.patch.drv: server returned 500: 
failed checks.aarch64-darwin.nix-darwin-hyperion-macos 7m 51s
setup: nwg2hn819pbjf7nl9vlclb977w979l24-VSCode_1.140.0_darwin-arm64.zip.drv: error: gRPC QueryValidPaths on 'nix-store.geninf.io:50051' failed: error: niks3 pus …
setup:
nwg2hn819pbjf7nl9vlclb977w979l24-VSCode_1.140.0_darwin-arm64.zip.drv: error: gRPC QueryValidPaths on 'nix-store.geninf.io:50051' failed: error: niks3 push: uploading objects: uploading NAR nar/1zffzwc6zxy52ayc8siyxb0h15964qvs67sbykjz2pplfvk5rcm2.nar.zst: uploading NAR nar/1zffzwc6zxy52ayc8siyxb0h15964qvs67sbykjz2pplfvk5rcm2.nar.zst: server returned 500: 
dirpw6p7w0pl01r37wzk0wa5qlbidmdm-claude.drv: error: gRPC QueryValidPaths on 'nix-store.geninf.io:50051' failed: error: niks3 push: uploading objects: uploading NAR nar/1qh6svi8cgnv9hlx4zfjksayvpib4ac2lk82l7is6d224rmynwq2.nar.zst: uploading NAR nar/1qh6svi8cgnv9hlx4zfjksayvpib4ac2lk82l7is6d224rmynwq2.nar.zst: server returned 500: 
n0rk4bz3q34m9s4gid4v48hmmrxjhrv6-darwin-version.json.drv: error: gRPC QueryValidPaths on 'nix-store.geninf.io:50051' failed: error: niks3 push: uploading objects: uploading NAR nar/022cvwsrc18rgda6wi8q8ggj0jjbh4pmk7bf2sj128mgnwx37hbc.nar.zst: uploading NAR nar/022cvwsrc18rgda6wi8q8ggj0jjbh4pmk7bf2sj128mgnwx37hbc.nar.zst: server returned 500: 
ycw49sdsmqkwb6raa9mgg976zn6k69d3-firefox.desktop.drv: error: gRPC QueryValidPaths on 'nix-store.geninf.io:50051' failed: error: niks3 push: uploading objects: uploading NAR nar/0809givrzx1k6mz92g54xr2mqmhrk7wd84wc8xpabih02jjl24dn.nar.zst: uploading NAR nar/0809givrzx1k6mz92g54xr2mqmhrk7wd84wc8xpabih02jjl24dn.nar.zst: server returned 500: 
z0j8jris347jf26gqz3xhxz8mkwrn2s2-onepassword-password-manager-8.12.41.1.drv: error: gRPC QueryValidPaths on 'nix-store.geninf.io:50051' failed: error: niks3 push: uploading objects: uploading NAR nar/1cacq7bqb8vra23dayq7kk88clbrlbzs3hrv6kmk5h29pbyd9g38.nar.zst: uploading NAR nar/1cacq7bqb8vra23dayq7kk88clbrlbzs3hrv6kmk5h29pbyd9g38.nar.zst: server returned 500: 
ilzknfd5p8h91ab988vmh655y78j8a5v-Firefox-20157.0.1.dmg.drv: error: gRPC QueryValidPaths on 'nix-store.geninf.io:50051' failed: error: niks3 push: uploading objects: uploading NAR nar/1a3hs95q0mif875xmzbkqjn1y3ghi7ikxs7w4mxpdd77q127k53z.nar.zst: uploading NAR nar/1a3hs95q0mif875xmzbkqjn1y3ghi7ikxs7w4mxpdd77q127k53z.nar.zst: server returned 500: 
x62262k3vnchjg6dwxkz659maxyhlqfw-etc-registry.json.drv: error: gRPC QueryValidPaths on 'nix-store.geninf.io:50051' failed: error: niks3 push: uploading objects: uploading NAR nar/1qjbjs647k21gsqyl71ba0rlqwlvypf4g8962klyi2ylm31i4kqb.nar.zst: uploading NAR nar/1qjbjs647k21gsqyl71ba0rlqwlvypf4g8962klyi2ylm31i4kqb.nar.zst: server returned 500: 
error: dependency '4bvri0j7crwjgg329rvigj431q9m577d-activation-root.drv' failed
failed checks.aarch64-darwin.package-gaia-vm 31s
setup: this derivation will be built: /nix/store/l97s0gjmgvd3cibaijj0fsia5hgcyiaz-run-gaia-vm-on-aarch64-darwin.drv this path will be fetched (0.0 KiB downloa …
setup:
this derivation will be built:
  /nix/store/l97s0gjmgvd3cibaijj0fsia5hgcyiaz-run-gaia-vm-on-aarch64-darwin.drv
this path will be fetched (0.0 KiB download, 60.2 KiB unpacked):
  /nix/store/9w7180x9zhy6f7acldggqra45jxgjnvc-stdenv-darwin-no-cc
warning: ignoring the client-specified setting 'store', because it is a restricted setting and you are not a trusted user
l97s0gjmgvd3cibaijj0fsia5hgcyiaz-run-gaia-vm-on-aarch64-darwin.drv: error: gRPC QueryValidPaths on 'nix-store.geninf.io:50051' failed: error: niks3 push: uploading objects: uploading NAR nar/0p0xjql705vzvnm1k6ycvfpvmkwzs100fcr549cp52l57gf2xaiy.nar.zst: uploading NAR nar/0p0xjql705vzvnm1k6ycvfpvmkwzs100fcr549cp52l57gf2xaiy.nar.zst: server returned 500: 
error: error: gRPC QueryValidPaths on 'nix-store.geninf.io:50051' failed: error: niks3 push: uploading objects: uploading NAR nar/0p0xjql705vzvnm1k6ycvfpvmkwzs100fcr549cp52l57gf2xaiy.nar.zst: uploading NAR nar/0p0xjql705vzvnm1k6ycvfpvmkwzs100fcr549cp52l57gf2xaiy.nar.zst: server returned 500: 
failed checks.aarch64-darwin.package-get-clan-secret 39s
setup: don't know how to build these paths: /nix/store/c9nvx0k0sb7amj6wbdw16pby69qn7g0z-get-clan-secret.drv warning: ignoring the client-specified setting 'st …
setup:
don't know how to build these paths:
  /nix/store/c9nvx0k0sb7amj6wbdw16pby69qn7g0z-get-clan-secret.drv
warning: ignoring the client-specified setting 'store', because it is a restricted setting and you are not a trusted user
61m035jvcgyy14h27ya31mrv0rkdf6h2-clan-runtime.drv: error: gRPC QueryValidPaths on 'nix-store.geninf.io:50051' failed: error: niks3 push: uploading objects: uploading NAR nar/1as898w5q2gvsriz5hgjp6mcs7d914jka57ag808wclq2d4a9lsd.nar.zst: uploading NAR nar/1as898w5q2gvsriz5hgjp6mcs7d914jka57ag808wclq2d4a9lsd.nar.zst: server returned 500: 
error: dependency 'xjh6kvn56imlpnmyxxp7pb4nqp1zgc3z-clan-cli.drv' failed
failed checks.aarch64-darwin.package-phi-nixos-vm 28s
setup: don't know how to build these paths: /nix/store/66kz09dig9dnhdf3kj7g4axysrd89ikq-run-phi-nixos-vm-on-aarch64-darwin.drv warning: ignoring the client-sp …
setup:
don't know how to build these paths:
  /nix/store/66kz09dig9dnhdf3kj7g4axysrd89ikq-run-phi-nixos-vm-on-aarch64-darwin.drv
warning: ignoring the client-specified setting 'store', because it is a restricted setting and you are not a trusted user
66kz09dig9dnhdf3kj7g4axysrd89ikq-run-phi-nixos-vm-on-aarch64-darwin.drv: error: gRPC QueryValidPaths on 'nix-store.geninf.io:50051' failed: error: niks3 push: uploading objects: uploading NAR nar/0rvvyiwxf4xqxx73gwy9mgkf5c4cmsbfs6580g751rf6lzpjxsqq.nar.zst: uploading NAR nar/0rvvyiwxf4xqxx73gwy9mgkf5c4cmsbfs6580g751rf6lzpjxsqq.nar.zst: server returned 500: 
error: error: gRPC QueryValidPaths on 'nix-store.geninf.io:50051' failed: error: niks3 push: uploading objects: uploading NAR nar/0rvvyiwxf4xqxx73gwy9mgkf5c4cmsbfs6580g751rf6lzpjxsqq.nar.zst: uploading NAR nar/0rvvyiwxf4xqxx73gwy9mgkf5c4cmsbfs6580g751rf6lzpjxsqq.nar.zst: server returned 500: 
failed checks.aarch64-darwin.package-provide-tf-passphrase 35s
setup: don't know how to build these paths: /nix/store/jly31slxnxn6wi4q6yalpb8mg89gj6jp-opentofu-external-key-provider.drv warning: ignoring the client-specif …
setup:
don't know how to build these paths:
  /nix/store/jly31slxnxn6wi4q6yalpb8mg89gj6jp-opentofu-external-key-provider.drv
warning: ignoring the client-specified setting 'store', because it is a restricted setting and you are not a trusted user
61m035jvcgyy14h27ya31mrv0rkdf6h2-clan-runtime.drv: error: gRPC QueryValidPaths on 'nix-store.geninf.io:50051' failed: error: niks3 push: uploading objects: uploading NAR nar/1inwp1p8hy7xyib3zin04grkgdiy7vj2wankd0jip54cj15pfihj.nar.zst: uploading NAR nar/1inwp1p8hy7xyib3zin04grkgdiy7vj2wankd0jip54cj15pfihj.nar.zst: server returned 500: 
error: dependency 'xjh6kvn56imlpnmyxxp7pb4nqp1zgc3z-clan-cli.drv' failed
failed checks.aarch64-darwin.package-sigma-vm 22s
setup: don't know how to build these paths: /nix/store/ahrsk4y5c8czw60iskq1bjwm2vqnz7y3-run-sigma-vm-on-aarch64-darwin.drv warning: ignoring the client-specif …
setup:
don't know how to build these paths:
  /nix/store/ahrsk4y5c8czw60iskq1bjwm2vqnz7y3-run-sigma-vm-on-aarch64-darwin.drv
warning: ignoring the client-specified setting 'store', because it is a restricted setting and you are not a trusted user
ahrsk4y5c8czw60iskq1bjwm2vqnz7y3-run-sigma-vm-on-aarch64-darwin.drv: error: gRPC QueryValidPaths on 'nix-store.geninf.io:50051' failed: error: niks3 push: uploading objects: uploading NAR nar/068yh4b0f9fjzc6zyqkp19nyjv5hpa65d1qp5dspglhxignglg3l.nar.zst: uploading NAR nar/068yh4b0f9fjzc6zyqkp19nyjv5hpa65d1qp5dspglhxignglg3l.nar.zst: server returned 500: 
error: error: gRPC QueryValidPaths on 'nix-store.geninf.io:50051' failed: error: niks3 push: uploading objects: uploading NAR nar/068yh4b0f9fjzc6zyqkp19nyjv5hpa65d1qp5dspglhxignglg3l.nar.zst: uploading NAR nar/068yh4b0f9fjzc6zyqkp19nyjv5hpa65d1qp5dspglhxignglg3l.nar.zst: server returned 500: 
failed checks.aarch64-darwin.package-tf 26s
setup: /nix/store/iccwbimwlg3b9j7jlkki82z23w3npcgv-terraform-provider-null-3.3.2 /nix/store/0hkw03kgaskdy3vz0nsb30cwf67zkq5p-terraform-provider-onepassword- …
setup:
  /nix/store/iccwbimwlg3b9j7jlkki82z23w3npcgv-terraform-provider-null-3.3.2
  /nix/store/0hkw03kgaskdy3vz0nsb30cwf67zkq5p-terraform-provider-onepassword-2.2.1
  /nix/store/ji648ar4rkp6ma9cdrd4v8a11m9gjlz0-terraform-provider-tailscale-0.29.2
  /nix/store/yabpxa1m1npdwar4kq1wb65b8ip1i0cr-terraform-provider-tls-4.4.0
  /nix/store/cck4dpcwbi1ixrdfp85aj74xhdbjrfvf-terraform-provider-vultr-2.32.0
warning: ignoring the client-specified setting 'store', because it is a restricted setting and you are not a trusted user
mnj4xzfwgaz1ailha3phbw2vfxx68xhn-opentofu-1.13.1.drv: error: gRPC AddMultipleToStore on 'nix-store.geninf.io:50051' failed: error: niks3 push: uploading objects: uploading NAR nar/17wimjvbhrgx8dm2s5dpganyvxz2z5gd3nhp35cshipdmagfym32.nar.zst: uploading NAR nar/17wimjvbhrgx8dm2s5dpganyvxz2z5gd3nhp35cshipdmagfym32.nar.zst: server returned 500: 
error: error: gRPC AddMultipleToStore on 'nix-store.geninf.io:50051' failed: error: niks3 push: uploading objects: uploading NAR nar/17wimjvbhrgx8dm2s5dpganyvxz2z5gd3nhp35cshipdmagfym32.nar.zst: uploading NAR nar/17wimjvbhrgx8dm2s5dpganyvxz2z5gd3nhp35cshipdmagfym32.nar.zst: server returned 500: 
dependency failed checks.aarch64-darwin.package-tf-apply —
dependency failed checks.aarch64-darwin.package-tf-destroy —
dependency failed checks.aarch64-darwin.package-tf-init —
failed checks.aarch64-darwin.treefmt 35s
setup: don't know how to build these paths: /nix/store/bnhn5ilai76nx2xqp4lzqli7vmk44m47-treefmt-check.drv warning: ignoring the client-specified setting 'stor …
setup:
don't know how to build these paths:
  /nix/store/bnhn5ilai76nx2xqp4lzqli7vmk44m47-treefmt-check.drv
warning: ignoring the client-specified setting 'store', because it is a restricted setting and you are not a trusted user
nmxvvw6m2kwvyf6mpj1gr6zwx84izpgq-statix.toml.drv: error: gRPC QueryValidPaths on 'nix-store.geninf.io:50051' failed: error: niks3 push: uploading objects: uploading NAR nar/0d4vgr4j17xd1wnp60k8k8zk60z0xp4j6xzvz0pkiw6mzwrb0w3a.nar.zst: uploading NAR nar/0d4vgr4j17xd1wnp60k8k8zk60z0xp4j6xzvz0pkiw6mzwrb0w3a.nar.zst: server returned 500: 
6z2cvbf9ali9vdjf7if5006gg3m11bnk-nil.drv: error: gRPC QueryValidPaths on 'nix-store.geninf.io:50051' failed: error: niks3 push: uploading objects: uploading NAR nar/15ajkqa7ms1mdnax8mxnkg8xw81p13zja3iqqw62m3rvprwcvs59.nar.zst: uploading NAR nar/15ajkqa7ms1mdnax8mxnkg8xw81p13zja3iqqw62m3rvprwcvs59.nar.zst: server returned 500: 
error: dependency '787gwwlv7nj1zqq3k1627a3r6gp2kdqa-treefmt.drv' failed
dependency failed checks.aarch64-linux.devShell-default —
failed checks.aarch64-linux.package-gaia-vm 23s
setup: don't know how to build these paths: /nix/store/x6hn1xg3q0nkzmhmc9g4k2vzrhqk4fxf-run-gaia-vm-on-aarch64-linux.drv warning: ignoring the client-specifie …
setup:
don't know how to build these paths:
  /nix/store/x6hn1xg3q0nkzmhmc9g4k2vzrhqk4fxf-run-gaia-vm-on-aarch64-linux.drv
warning: ignoring the client-specified setting 'store', because it is a restricted setting and you are not a trusted user
x6hn1xg3q0nkzmhmc9g4k2vzrhqk4fxf-run-gaia-vm-on-aarch64-linux.drv: error: gRPC AddMultipleToStore on 'nix-store.geninf.io:50051' failed: error: niks3 push: uploading objects: uploading NAR nar/127bfax84sgnx0day56s65wvg8snlsjhm12r7nqf4lzxd50xbmkb.nar.zst: uploading NAR nar/127bfax84sgnx0day56s65wvg8snlsjhm12r7nqf4lzxd50xbmkb.nar.zst: server returned 500: 
error: error: gRPC AddMultipleToStore on 'nix-store.geninf.io:50051' failed: error: niks3 push: uploading objects: uploading NAR nar/127bfax84sgnx0day56s65wvg8snlsjhm12r7nqf4lzxd50xbmkb.nar.zst: uploading NAR nar/127bfax84sgnx0day56s65wvg8snlsjhm12r7nqf4lzxd50xbmkb.nar.zst: server returned 500: 
failed checks.aarch64-linux.package-get-clan-secret 1m 59s
get-clan-secret: build01: building 2myb52hs1x0ik560j4a25qmjci2g0rmd-get-clan-secret.drv build01: building 2myb52hs1x0ik560j4a25qmjci2g0rmd-get-clan-secret.drv b …
get-clan-secret:
build01: building 2myb52hs1x0ik560j4a25qmjci2g0rmd-get-clan-secret.drv
build01: building 2myb52hs1x0ik560j4a25qmjci2g0rmd-get-clan-secret.drv
build01: building 2myb52hs1x0ik560j4a25qmjci2g0rmd-get-clan-secret.drv
build01: building 2myb52hs1x0ik560j4a25qmjci2g0rmd-get-clan-secret.drv
build01: building 2myb52hs1x0ik560j4a25qmjci2g0rmd-get-clan-secret.drv
build01: building 2myb52hs1x0ik560j4a25qmjci2g0rmd-get-clan-secret.drv
build01: building 2myb52hs1x0ik560j4a25qmjci2g0rmd-get-clan-secret.drv
build01: building 2myb52hs1x0ik560j4a25qmjci2g0rmd-get-clan-secret.drv
failed checks.aarch64-linux.package-phi-nixos-vm 13s
setup: this derivation will be built: /nix/store/v7f4267mba0lhpli4x3vnzmydqqgbbym-run-phi-nixos-vm-on-aarch64-linux.drv this path will be fetched (0.0 KiB dow …
setup:
this derivation will be built:
  /nix/store/v7f4267mba0lhpli4x3vnzmydqqgbbym-run-phi-nixos-vm-on-aarch64-linux.drv
this path will be fetched (0.0 KiB download, 60.0 KiB unpacked):
  /nix/store/wc2yjib5jdx9pxxfbshmiffxzb03qx18-stdenv-linux-no-cc
warning: ignoring the client-specified setting 'store', because it is a restricted setting and you are not a trusted user
v7f4267mba0lhpli4x3vnzmydqqgbbym-run-phi-nixos-vm-on-aarch64-linux.drv: error: gRPC QueryValidPaths on 'nix-store.geninf.io:50051' failed: error: niks3 push: uploading objects: uploading NAR nar/127bfax84sgnx0day56s65wvg8snlsjhm12r7nqf4lzxd50xbmkb.nar.zst: uploading NAR nar/127bfax84sgnx0day56s65wvg8snlsjhm12r7nqf4lzxd50xbmkb.nar.zst: server returned 500: 
error: error: gRPC QueryValidPaths on 'nix-store.geninf.io:50051' failed: error: niks3 push: uploading objects: uploading NAR nar/127bfax84sgnx0day56s65wvg8snlsjhm12r7nqf4lzxd50xbmkb.nar.zst: uploading NAR nar/127bfax84sgnx0day56s65wvg8snlsjhm12r7nqf4lzxd50xbmkb.nar.zst: server returned 500: 
failed checks.aarch64-linux.package-provide-tf-passphrase 1m 52s
opentofu-external-key-provider: build01: building 2rnf471wsl3xp9k353nxcp8949ahmi9c-opentofu-external-key-provider.drv build01: building 2rnf471wsl3xp9k353nxcp89 …
opentofu-external-key-provider:
build01: building 2rnf471wsl3xp9k353nxcp8949ahmi9c-opentofu-external-key-provider.drv
build01: building 2rnf471wsl3xp9k353nxcp8949ahmi9c-opentofu-external-key-provider.drv
build01: building 2rnf471wsl3xp9k353nxcp8949ahmi9c-opentofu-external-key-provider.drv
build01: building 2rnf471wsl3xp9k353nxcp8949ahmi9c-opentofu-external-key-provider.drv
build01: building 2rnf471wsl3xp9k353nxcp8949ahmi9c-opentofu-external-key-provider.drv
build01: building 2rnf471wsl3xp9k353nxcp8949ahmi9c-opentofu-external-key-provider.drv
build01: building 2rnf471wsl3xp9k353nxcp8949ahmi9c-opentofu-external-key-provider.drv
build01: building 2rnf471wsl3xp9k353nxcp8949ahmi9c-opentofu-external-key-provider.drv
failed checks.aarch64-linux.package-sigma-vm 10s
setup: don't know how to build these paths: /nix/store/wrk3q2d9is8r224b6fi0cj21z2jkyjhw-run-sigma-vm-on-aarch64-linux.drv warning: ignoring the client-specifi …
setup:
don't know how to build these paths:
  /nix/store/wrk3q2d9is8r224b6fi0cj21z2jkyjhw-run-sigma-vm-on-aarch64-linux.drv
warning: ignoring the client-specified setting 'store', because it is a restricted setting and you are not a trusted user
wrk3q2d9is8r224b6fi0cj21z2jkyjhw-run-sigma-vm-on-aarch64-linux.drv: error: gRPC AddMultipleToStore on 'nix-store.geninf.io:50051' failed: error: niks3 push: uploading objects: uploading NAR nar/127bfax84sgnx0day56s65wvg8snlsjhm12r7nqf4lzxd50xbmkb.nar.zst: uploading NAR nar/127bfax84sgnx0day56s65wvg8snlsjhm12r7nqf4lzxd50xbmkb.nar.zst: server returned 500: 
error: error: gRPC AddMultipleToStore on 'nix-store.geninf.io:50051' failed: error: niks3 push: uploading objects: uploading NAR nar/127bfax84sgnx0day56s65wvg8snlsjhm12r7nqf4lzxd50xbmkb.nar.zst: uploading NAR nar/127bfax84sgnx0day56s65wvg8snlsjhm12r7nqf4lzxd50xbmkb.nar.zst: server returned 500: 
failed checks.aarch64-linux.package-tf 36s
setup: /nix/store/fi17140nscf5wcvwp0ix7d33cgpr6bgr-opentofu-1.13.1.drv these 3 paths will be fetched (5.3 MiB download, 16.1 MiB unpacked): /nix/store/z41dr …
setup:
  /nix/store/fi17140nscf5wcvwp0ix7d33cgpr6bgr-opentofu-1.13.1.drv
these 3 paths will be fetched (5.3 MiB download, 16.1 MiB unpacked):
  /nix/store/z41drq8l6lj1pz60wmwq5ylf95ya4v0a-die-hook
  /nix/store/v138qwlwfppf49qxvf97jgdanqjb8xvx-make-shell-wrapper-hook
  /nix/store/jadqw1fnfbzd5qihyfhhnnfsrm3hw6jj-terraform-provider-external-2.4.2
warning: ignoring the client-specified setting 'store', because it is a restricted setting and you are not a trusted user
fi17140nscf5wcvwp0ix7d33cgpr6bgr-opentofu-1.13.1.drv: error: gRPC AddMultipleToStore on 'nix-store.geninf.io:50051' failed: error: niks3 push: uploading objects: uploading NAR nar/0511bjxd542bj1xa0dcnmz2jgjf8bf62zb1l24ayplncxgm9crxz.nar.zst: uploading NAR nar/0511bjxd542bj1xa0dcnmz2jgjf8bf62zb1l24ayplncxgm9crxz.nar.zst: server returned 500: 
error: error: gRPC AddMultipleToStore on 'nix-store.geninf.io:50051' failed: error: niks3 push: uploading objects: uploading NAR nar/0511bjxd542bj1xa0dcnmz2jgjf8bf62zb1l24ayplncxgm9crxz.nar.zst: uploading NAR nar/0511bjxd542bj1xa0dcnmz2jgjf8bf62zb1l24ayplncxgm9crxz.nar.zst: server returned 500: 
dependency failed checks.aarch64-linux.package-tf-apply —
dependency failed checks.aarch64-linux.package-tf-destroy —
dependency failed checks.aarch64-linux.package-tf-init —
failed checks.aarch64-linux.treefmt 1m 56s
setup: jji5vx3qw8n8wwc7ic7c3qqn42wn756a-statix.toml.drv: build01: publish failed: error: niks3 push: uploading objects: uploading build log log/jji5vx3qw8n8wwc7 …
setup:
jji5vx3qw8n8wwc7ic7c3qqn42wn756a-statix.toml.drv: build01: publish failed: error: niks3 push: uploading objects: uploading build log log/jji5vx3qw8n8wwc7ic7c3qqn42wn756a-statix.toml.drv: server returned 500: , asking the scheduler again
jji5vx3qw8n8wwc7ic7c3qqn42wn756a-statix.toml.drv: build01: publish failed: error: niks3 push: uploading objects: uploading listing 2w4jjayrm2pwcsswf2wq2zms3775qhxj.ls: server returned 500: , asking the scheduler again
jji5vx3qw8n8wwc7ic7c3qqn42wn756a-statix.toml.drv: build01: publish failed: error: niks3 push: uploading objects: uploading listing 2w4jjayrm2pwcsswf2wq2zms3775qhxj.ls: server returned 500: , asking the scheduler again
jji5vx3qw8n8wwc7ic7c3qqn42wn756a-statix.toml.drv: build01: publish failed: error: niks3 push: uploading objects: uploading listing 2w4jjayrm2pwcsswf2wq2zms3775qhxj.ls: server returned 500: , asking the scheduler again
jji5vx3qw8n8wwc7ic7c3qqn42wn756a-statix.toml.drv: build01: publish failed: error: niks3 push: uploading objects: uploading build log log/jji5vx3qw8n8wwc7ic7c3qqn42wn756a-statix.toml.drv: server returned 500: , asking the scheduler again
jji5vx3qw8n8wwc7ic7c3qqn42wn756a-statix.toml.drv: build01: publish failed: error: niks3 push: uploading objects: uploading build log log/jji5vx3qw8n8wwc7ic7c3qqn42wn756a-statix.toml.drv: server returned 500: , asking the scheduler again
jji5vx3qw8n8wwc7ic7c3qqn42wn756a-statix.toml.drv: build01: publish failed: error: niks3 push: uploading objects: uploading listing 2w4jjayrm2pwcsswf2wq2zms3775qhxj.ls: server returned 500: , asking the scheduler again
error: dependency '9arg3f4idz0r3vxq3rdnalqccvmsc8rj-treefmt.drv' failed
failed checks.x86_64-linux."home-manager-enzime@gaia" 25s
setup: don't know how to build these paths: /nix/store/panm7x0k6r01f2rpjypp4qi0q600j7k4-home-manager-generation.drv warning: ignoring the client-specified set …
setup:
don't know how to build these paths:
  /nix/store/panm7x0k6r01f2rpjypp4qi0q600j7k4-home-manager-generation.drv
warning: ignoring the client-specified setting 'store', because it is a restricted setting and you are not a trusted user
panm7x0k6r01f2rpjypp4qi0q600j7k4-home-manager-generation.drv: error: gRPC QueryValidPaths on 'nix-store.geninf.io:50051' failed: error: niks3 push: uploading objects: uploading NAR nar/127bfax84sgnx0day56s65wvg8snlsjhm12r7nqf4lzxd50xbmkb.nar.zst: uploading NAR nar/127bfax84sgnx0day56s65wvg8snlsjhm12r7nqf4lzxd50xbmkb.nar.zst: server returned 500: 
error: error: gRPC QueryValidPaths on 'nix-store.geninf.io:50051' failed: error: niks3 push: uploading objects: uploading NAR nar/127bfax84sgnx0day56s65wvg8snlsjhm12r7nqf4lzxd50xbmkb.nar.zst: uploading NAR nar/127bfax84sgnx0day56s65wvg8snlsjhm12r7nqf4lzxd50xbmkb.nar.zst: server returned 500: 
failed checks.x86_64-linux."home-manager-enzime@phi-nixos" 2m 0s
setup: /nix/store/4sq0awhi6w9zw9qb08amnams96a0kwp5-zstd-1.5.7 /nix/store/30d12zr26jknnicjwfwvrffmifsqdgan-zvbi-0.2.44 /nix/store/1asg1n83cg2mspd1k0aasib2g …
setup:
  /nix/store/4sq0awhi6w9zw9qb08amnams96a0kwp5-zstd-1.5.7
  /nix/store/30d12zr26jknnicjwfwvrffmifsqdgan-zvbi-0.2.44
  /nix/store/1asg1n83cg2mspd1k0aasib2glgib4fc-zvbi-0.2.45
  /nix/store/v64vzsfpynzl5a6sjkjy934ixa84cxpw-zxing-cpp-2.3.0
  /nix/store/0ky0ddrii2pzqi8l9qvga2n83v0lwrs4-zxing-cpp-3.1.1
warning: ignoring the client-specified setting 'store', because it is a restricted setting and you are not a trusted user
09vg1933lh0zhm9rgkzq3wfa7q7djm3p-home-manager-generation.drv: error: gRPC QueryValidPaths on 'nix-store.geninf.io:50051' failed: error: niks3 push: uploading objects: uploading NAR nar/127bfax84sgnx0day56s65wvg8snlsjhm12r7nqf4lzxd50xbmkb.nar.zst: uploading NAR nar/127bfax84sgnx0day56s65wvg8snlsjhm12r7nqf4lzxd50xbmkb.nar.zst: server returned 500: 
error: error: gRPC QueryValidPaths on 'nix-store.geninf.io:50051' failed: error: niks3 push: uploading objects: uploading NAR nar/127bfax84sgnx0day56s65wvg8snlsjhm12r7nqf4lzxd50xbmkb.nar.zst: uploading NAR nar/127bfax84sgnx0day56s65wvg8snlsjhm12r7nqf4lzxd50xbmkb.nar.zst: server returned 500: 
failed checks.x86_64-linux."home-manager-enzime@sigma" 14s
setup: /nix/store/4sq0awhi6w9zw9qb08amnams96a0kwp5-zstd-1.5.7 /nix/store/30d12zr26jknnicjwfwvrffmifsqdgan-zvbi-0.2.44 /nix/store/1asg1n83cg2mspd1k0aasib2g …
setup:
  /nix/store/4sq0awhi6w9zw9qb08amnams96a0kwp5-zstd-1.5.7
  /nix/store/30d12zr26jknnicjwfwvrffmifsqdgan-zvbi-0.2.44
  /nix/store/1asg1n83cg2mspd1k0aasib2glgib4fc-zvbi-0.2.45
  /nix/store/v64vzsfpynzl5a6sjkjy934ixa84cxpw-zxing-cpp-2.3.0
  /nix/store/0ky0ddrii2pzqi8l9qvga2n83v0lwrs4-zxing-cpp-3.1.1
warning: ignoring the client-specified setting 'store', because it is a restricted setting and you are not a trusted user
3ky9f009d6y71a6qdb93klxixd8yfqm7-home-manager-generation.drv: error: gRPC QueryValidPaths on 'nix-store.geninf.io:50051' failed: error: niks3 push: uploading objects: uploading NAR nar/127bfax84sgnx0day56s65wvg8snlsjhm12r7nqf4lzxd50xbmkb.nar.zst: uploading NAR nar/127bfax84sgnx0day56s65wvg8snlsjhm12r7nqf4lzxd50xbmkb.nar.zst: server returned 500: 
error: error: gRPC QueryValidPaths on 'nix-store.geninf.io:50051' failed: error: niks3 push: uploading objects: uploading NAR nar/127bfax84sgnx0day56s65wvg8snlsjhm12r7nqf4lzxd50xbmkb.nar.zst: uploading NAR nar/127bfax84sgnx0day56s65wvg8snlsjhm12r7nqf4lzxd50xbmkb.nar.zst: server returned 500: 
failed checks.x86_64-linux.nixos-gaia 5m 9s
setup: faj6lqzprbmkz590a90490gzcnfz366a-fix-ctrl-arrows.patch.drv: build-x86-01: publish failed: error: niks3 push: uploading objects: uploading NAR nar/0vq280q …
setup:
faj6lqzprbmkz590a90490gzcnfz366a-fix-ctrl-arrows.patch.drv: build-x86-01: publish failed: error: niks3 push: uploading objects: uploading NAR nar/0vq280q8kxr7zk9xya5mny3r7sjahw19qayjmdbiaskniz65hy4d.nar.zst: uploading NAR nar/0vq280q8kxr7zk9xya5mny3r7sjahw19qayjmdbiaskniz65hy4d.nar.zst: server returned 500: , asking the scheduler again
li70apikd1cffd1zspkbh3fralhc8l8c-tailscale-1.102.5.drv: gi-build-x86-02: publish failed: error: niks3 push: uploading objects: uploading NAR nar/15r5z975q86n88rwh9ksckj9d9j49zwq17l8x8c6hzfw66qna7vh.nar.zst: uploading part 2: server returned 500: , asking the scheduler again
w75nxrx6y8s7k27xnf98fgzlrrrrw8yh-nixos-version.drv: build-x86-01: publish failed: error: niks3 push: uploading objects: uploading build log log/w75nxrx6y8s7k27xnf98fgzlrrrrw8yh-nixos-version.drv: server returned 500: , asking the scheduler again
faj6lqzprbmkz590a90490gzcnfz366a-fix-ctrl-arrows.patch.drv: gi-build-x86-02: publish failed: error: niks3 push: uploading objects: uploading build log log/faj6lqzprbmkz590a90490gzcnfz366a-fix-ctrl-arrows.patch.drv: server returned 500: , asking the scheduler again
li70apikd1cffd1zspkbh3fralhc8l8c-tailscale-1.102.5.drv: build-x86-01: publish failed: error: niks3 push: uploading objects: uploading NAR nar/15r5z975q86n88rwh9ksckj9d9j49zwq17l8x8c6hzfw66qna7vh.nar.zst: uploading part 2: server returned 500: , asking the scheduler again
w75nxrx6y8s7k27xnf98fgzlrrrrw8yh-nixos-version.drv: gi-build-x86-02: publish failed: error: niks3 push: uploading objects: uploading build log log/w75nxrx6y8s7k27xnf98fgzlrrrrw8yh-nixos-version.drv: server returned 500: , asking the scheduler again
li70apikd1cffd1zspkbh3fralhc8l8c-tailscale-1.102.5.drv: build-x86-01: publish failed: error: niks3 push: uploading objects: uploading NAR nar/15r5z975q86n88rwh9ksckj9d9j49zwq17l8x8c6hzfw66qna7vh.nar.zst: uploading part 2: server returned 500: , asking the scheduler again
error: dependency '415jh1yirryw8qjcnjjcgz39vp5f3c3i-system-path.drv' failed
failed checks.x86_64-linux.nixos-sigma 4m 2s
setup: faj6lqzprbmkz590a90490gzcnfz366a-fix-ctrl-arrows.patch.drv: gi-build-x86-02: publish failed: error: niks3 push: uploading objects: uploading NAR nar/0vq2 …
setup:
faj6lqzprbmkz590a90490gzcnfz366a-fix-ctrl-arrows.patch.drv: gi-build-x86-02: publish failed: error: niks3 push: uploading objects: uploading NAR nar/0vq280q8kxr7zk9xya5mny3r7sjahw19qayjmdbiaskniz65hy4d.nar.zst: uploading NAR nar/0vq280q8kxr7zk9xya5mny3r7sjahw19qayjmdbiaskniz65hy4d.nar.zst: server returned 500: , asking the scheduler again
faj6lqzprbmkz590a90490gzcnfz366a-fix-ctrl-arrows.patch.drv: gi-build-x86-02: publish failed: error: niks3 push: uploading objects: uploading NAR nar/0vq280q8kxr7zk9xya5mny3r7sjahw19qayjmdbiaskniz65hy4d.nar.zst: uploading NAR nar/0vq280q8kxr7zk9xya5mny3r7sjahw19qayjmdbiaskniz65hy4d.nar.zst: server returned 500: , asking the scheduler again
li70apikd1cffd1zspkbh3fralhc8l8c-tailscale-1.102.5.drv: build-x86-01: publish failed: error: niks3 push: uploading objects: uploading NAR nar/15r5z975q86n88rwh9ksckj9d9j49zwq17l8x8c6hzfw66qna7vh.nar.zst: uploading part 2: server returned 500: , asking the scheduler again
li70apikd1cffd1zspkbh3fralhc8l8c-tailscale-1.102.5.drv: gi-build-x86-02: publish failed: error: niks3 push: uploading objects: uploading NAR nar/15r5z975q86n88rwh9ksckj9d9j49zwq17l8x8c6hzfw66qna7vh.nar.zst: uploading part 2: server returned 500: , asking the scheduler again
li70apikd1cffd1zspkbh3fralhc8l8c-tailscale-1.102.5.drv: build-x86-01: the build this call attached to did not finish, retry, asking the scheduler again
li70apikd1cffd1zspkbh3fralhc8l8c-tailscale-1.102.5.drv: gi-build-x86-02: publish failed: error: niks3 push: uploading objects: uploading NAR nar/15r5z975q86n88rwh9ksckj9d9j49zwq17l8x8c6hzfw66qna7vh.nar.zst: uploading part 2: server returned 500: , asking the scheduler again
li70apikd1cffd1zspkbh3fralhc8l8c-tailscale-1.102.5.drv: build-x86-01: the build this call attached to did not finish, retry, asking the scheduler again
error: dependency 'bbyvhv1y617l9bggbkxvcxzyrqc1swdb-system-path.drv' failed
failed checks.x86_64-linux.package-gaia-vm 8s
setup: don't know how to build these paths: /nix/store/6zxhp1xca1ql4v5vvz973cbrs8v2pvpa-run-gaia-vm-on-x86_64-linux.drv warning: ignoring the client-specified …
setup:
don't know how to build these paths:
  /nix/store/6zxhp1xca1ql4v5vvz973cbrs8v2pvpa-run-gaia-vm-on-x86_64-linux.drv
warning: ignoring the client-specified setting 'store', because it is a restricted setting and you are not a trusted user
6zxhp1xca1ql4v5vvz973cbrs8v2pvpa-run-gaia-vm-on-x86_64-linux.drv: error: gRPC AddMultipleToStore on 'nix-store.geninf.io:50051' failed: error: niks3 push: uploading objects: uploading NAR nar/127bfax84sgnx0day56s65wvg8snlsjhm12r7nqf4lzxd50xbmkb.nar.zst: uploading NAR nar/127bfax84sgnx0day56s65wvg8snlsjhm12r7nqf4lzxd50xbmkb.nar.zst: server returned 500: 
error: error: gRPC AddMultipleToStore on 'nix-store.geninf.io:50051' failed: error: niks3 push: uploading objects: uploading NAR nar/127bfax84sgnx0day56s65wvg8snlsjhm12r7nqf4lzxd50xbmkb.nar.zst: uploading NAR nar/127bfax84sgnx0day56s65wvg8snlsjhm12r7nqf4lzxd50xbmkb.nar.zst: server returned 500: 
failed checks.x86_64-linux.package-phi-nixos-vm 7s
setup: don't know how to build these paths: /nix/store/9z347xjwi720pz7ymfmbiv9arr6x0brd-run-phi-nixos-vm-on-x86_64-linux.drv warning: ignoring the client-spec …
setup:
don't know how to build these paths:
  /nix/store/9z347xjwi720pz7ymfmbiv9arr6x0brd-run-phi-nixos-vm-on-x86_64-linux.drv
warning: ignoring the client-specified setting 'store', because it is a restricted setting and you are not a trusted user
9z347xjwi720pz7ymfmbiv9arr6x0brd-run-phi-nixos-vm-on-x86_64-linux.drv: error: gRPC QueryValidPaths on 'nix-store.geninf.io:50051' failed: error: niks3 push: uploading objects: uploading NAR nar/127bfax84sgnx0day56s65wvg8snlsjhm12r7nqf4lzxd50xbmkb.nar.zst: uploading NAR nar/127bfax84sgnx0day56s65wvg8snlsjhm12r7nqf4lzxd50xbmkb.nar.zst: server returned 500: 
error: error: gRPC QueryValidPaths on 'nix-store.geninf.io:50051' failed: error: niks3 push: uploading objects: uploading NAR nar/127bfax84sgnx0day56s65wvg8snlsjhm12r7nqf4lzxd50xbmkb.nar.zst: uploading NAR nar/127bfax84sgnx0day56s65wvg8snlsjhm12r7nqf4lzxd50xbmkb.nar.zst: server returned 500: 
failed checks.x86_64-linux.package-sigma-vm 11s
setup: don't know how to build these paths: /nix/store/0l98pzqv9122f8y38cmkb3mazy2sv8gd-run-sigma-vm-on-x86_64-linux.drv warning: ignoring the client-specifie …
setup:
don't know how to build these paths:
  /nix/store/0l98pzqv9122f8y38cmkb3mazy2sv8gd-run-sigma-vm-on-x86_64-linux.drv
warning: ignoring the client-specified setting 'store', because it is a restricted setting and you are not a trusted user
0l98pzqv9122f8y38cmkb3mazy2sv8gd-run-sigma-vm-on-x86_64-linux.drv: error: gRPC AddMultipleToStore on 'nix-store.geninf.io:50051' failed: error: niks3 push: uploading objects: uploading NAR nar/0a08zvn7gm6wc8lgdg39z8r7sir48f8wf0hhcfybmygkjyjkj4c6.nar.zst: uploading NAR nar/0a08zvn7gm6wc8lgdg39z8r7sir48f8wf0hhcfybmygkjyjkj4c6.nar.zst: server returned 500: 
error: error: gRPC AddMultipleToStore on 'nix-store.geninf.io:50051' failed: error: niks3 push: uploading objects: uploading NAR nar/0a08zvn7gm6wc8lgdg39z8r7sir48f8wf0hhcfybmygkjyjkj4c6.nar.zst: uploading NAR nar/0a08zvn7gm6wc8lgdg39z8r7sir48f8wf0hhcfybmygkjyjkj4c6.nar.zst: server returned 500: 
failed checks.x86_64-linux.treefmt 14s
setup: don't know how to build these paths: /nix/store/zp9qbz8k2zzggjzzjxkb51b1ra8isczp-treefmt-check.drv warning: ignoring the client-specified setting 'stor …
setup:
don't know how to build these paths:
  /nix/store/zp9qbz8k2zzggjzzjxkb51b1ra8isczp-treefmt-check.drv
warning: ignoring the client-specified setting 'store', because it is a restricted setting and you are not a trusted user
zp9qbz8k2zzggjzzjxkb51b1ra8isczp-treefmt-check.drv: error: gRPC QueryValidPaths on 'nix-store.geninf.io:50051' failed: error: niks3 push: uploading objects: uploading NAR nar/127bfax84sgnx0day56s65wvg8snlsjhm12r7nqf4lzxd50xbmkb.nar.zst: uploading NAR nar/127bfax84sgnx0day56s65wvg8snlsjhm12r7nqf4lzxd50xbmkb.nar.zst: server returned 500: 
error: error: gRPC QueryValidPaths on 'nix-store.geninf.io:50051' failed: error: niks3 push: uploading objects: uploading NAR nar/127bfax84sgnx0day56s65wvg8snlsjhm12r7nqf4lzxd50xbmkb.nar.zst: uploading NAR nar/127bfax84sgnx0day56s65wvg8snlsjhm12r7nqf4lzxd50xbmkb.nar.zst: server returned 500: 
25 already built
skipped attributes
status attribute duration
loading…