nixbot

builds

Enzime/hyperconfig build #1158 failed

branch next · PR #1086 · commit aac490701f · · took 1m 37s

nix-eval-jobs failed with exit code 1:
evaluation warning: A legacy Nextcloud install (from before NixOS 26.11) may be installed.

                    After nextcloud33 is installed successfully, you can safely upgrade
                    to 34. The latest version available is Nextcloud35.

                    Please note that Nextcloud doesn't support upgrades across multiple major versions
                    (i.e. an upgrade from 16 is possible to 17, but not 16 to 18).

                    The package can be upgraded by explicitly declaring the service-option
                    `services.nextcloud.package`.
evaluation warning: A legacy Nextcloud install (from before NixOS 26.11) may be installed.

                    After nextcloud34 is installed successfully, you can safely upgrade
                    to 35. The latest version available is Nextcloud35.

                    Please note that Nextcloud doesn't support upgrades across multiple major versions
                    (i.e. an upgrade from 16 is possible to 17, but not 16 to 18).

                    The package can be upgraded by explicitly declaring the service-option
                    `services.nextcloud.package`.
error: gRPC QueryValidPaths on 'nix-store.geninf.io:50051' failed: error: niks3 push: uploading objects: uploading listing 9wys0cmwhk8n1hs60njxp88q3ld3zvm1.ls: server returned 500: 
eval warnings 2 kinds · 3 occurrences
  • error gRPC QueryValidPaths on 'nix-store.geninf.io:50051' failed: error: niks3 push: uploading objects: uploading listing ….ls: server returned 500: ×1
  • warn A legacy Nextcloud install (from before NixOS 26.11) may be installed. ×2

15 failed
failed attributes
status attribute duration
dependency failed checks.aarch64-darwin.devShell-default —
failed checks.aarch64-darwin.package-gaia-vm 5s
setup: don't know how to build these paths: /nix/store/pwwl06w1ly1cfika7rarkdjs62bvdj9h-run-gaia-vm-on-aarch64-darwin.drv warning: ignoring the client-specifi …
setup:
don't know how to build these paths:
  /nix/store/pwwl06w1ly1cfika7rarkdjs62bvdj9h-run-gaia-vm-on-aarch64-darwin.drv
warning: ignoring the client-specified setting 'store', because it is a restricted setting and you are not a trusted user
pwwl06w1ly1cfika7rarkdjs62bvdj9h-run-gaia-vm-on-aarch64-darwin.drv: error: gRPC QueryValidPaths on 'nix-store.geninf.io:50051' failed: error: niks3 push: uploading objects: uploading NAR nar/0psmndfig20ja8zxbhf6qkn1lpv2pf6vi664nmd8rvv0j54v3wsi.nar.zst: uploading NAR nar/0psmndfig20ja8zxbhf6qkn1lpv2pf6vi664nmd8rvv0j54v3wsi.nar.zst: server returned 500: 
error: error: gRPC QueryValidPaths on 'nix-store.geninf.io:50051' failed: error: niks3 push: uploading objects: uploading NAR nar/0psmndfig20ja8zxbhf6qkn1lpv2pf6vi664nmd8rvv0j54v3wsi.nar.zst: uploading NAR nar/0psmndfig20ja8zxbhf6qkn1lpv2pf6vi664nmd8rvv0j54v3wsi.nar.zst: server returned 500: 
failed checks.aarch64-darwin.package-phi-nixos-vm 15s
setup: this derivation will be built: /nix/store/hhqzzvgkgw4mjs1yfm89ygi34i3igq8b-run-phi-nixos-vm-on-aarch64-darwin.drv this path will be fetched (0.0 KiB do …
setup:
this derivation will be built:
  /nix/store/hhqzzvgkgw4mjs1yfm89ygi34i3igq8b-run-phi-nixos-vm-on-aarch64-darwin.drv
this path will be fetched (0.0 KiB download, 60.2 KiB unpacked):
  /nix/store/9w7180x9zhy6f7acldggqra45jxgjnvc-stdenv-darwin-no-cc
warning: ignoring the client-specified setting 'store', because it is a restricted setting and you are not a trusted user
hhqzzvgkgw4mjs1yfm89ygi34i3igq8b-run-phi-nixos-vm-on-aarch64-darwin.drv: error: gRPC QueryValidPaths on 'nix-store.geninf.io:50051' failed: error: niks3 push: uploading objects: uploading NAR nar/1qwn66g5r7ym41hrfyb4976lbp7d3llibjbszmb1bv8h55fh8vzz.nar.zst: uploading NAR nar/1qwn66g5r7ym41hrfyb4976lbp7d3llibjbszmb1bv8h55fh8vzz.nar.zst: server returned 500: 
error: error: gRPC QueryValidPaths on 'nix-store.geninf.io:50051' failed: error: niks3 push: uploading objects: uploading NAR nar/1qwn66g5r7ym41hrfyb4976lbp7d3llibjbszmb1bv8h55fh8vzz.nar.zst: uploading NAR nar/1qwn66g5r7ym41hrfyb4976lbp7d3llibjbszmb1bv8h55fh8vzz.nar.zst: server returned 500: 
failed checks.aarch64-darwin.package-sigma-vm 25s
setup: this derivation will be built: /nix/store/37qb9paxn4dly8rps7y3pblqnnwc40np-run-sigma-vm-on-aarch64-darwin.drv this path will be fetched (0.0 KiB downlo …
setup:
this derivation will be built:
  /nix/store/37qb9paxn4dly8rps7y3pblqnnwc40np-run-sigma-vm-on-aarch64-darwin.drv
this path will be fetched (0.0 KiB download, 60.2 KiB unpacked):
  /nix/store/9w7180x9zhy6f7acldggqra45jxgjnvc-stdenv-darwin-no-cc
warning: ignoring the client-specified setting 'store', because it is a restricted setting and you are not a trusted user
37qb9paxn4dly8rps7y3pblqnnwc40np-run-sigma-vm-on-aarch64-darwin.drv: error: gRPC QueryValidPaths on 'nix-store.geninf.io:50051' failed: error: niks3 push: uploading objects: uploading NAR nar/1ylgpqgndwjvjc65b13ld9jy2jp739gs68rishpinlrqkd5y075n.nar.zst: uploading NAR nar/1ylgpqgndwjvjc65b13ld9jy2jp739gs68rishpinlrqkd5y075n.nar.zst: server returned 500: 
error: error: gRPC QueryValidPaths on 'nix-store.geninf.io:50051' failed: error: niks3 push: uploading objects: uploading NAR nar/1ylgpqgndwjvjc65b13ld9jy2jp739gs68rishpinlrqkd5y075n.nar.zst: uploading NAR nar/1ylgpqgndwjvjc65b13ld9jy2jp739gs68rishpinlrqkd5y075n.nar.zst: server returned 500: 
failed checks.aarch64-darwin.package-tf 52s
opentofu-1.13.1: build04: building mnj4xzfwgaz1ailha3phbw2vfxx68xhn-opentofu-1.13.1.drv build04: building mnj4xzfwgaz1ailha3phbw2vfxx68xhn-opentofu-1.13.1.drv b …
opentofu-1.13.1:
build04: building mnj4xzfwgaz1ailha3phbw2vfxx68xhn-opentofu-1.13.1.drv
build04: building mnj4xzfwgaz1ailha3phbw2vfxx68xhn-opentofu-1.13.1.drv
build04: building mnj4xzfwgaz1ailha3phbw2vfxx68xhn-opentofu-1.13.1.drv
build04: building mnj4xzfwgaz1ailha3phbw2vfxx68xhn-opentofu-1.13.1.drv
build04: building mnj4xzfwgaz1ailha3phbw2vfxx68xhn-opentofu-1.13.1.drv
build04: building mnj4xzfwgaz1ailha3phbw2vfxx68xhn-opentofu-1.13.1.drv
build04: building mnj4xzfwgaz1ailha3phbw2vfxx68xhn-opentofu-1.13.1.drv
build04: building mnj4xzfwgaz1ailha3phbw2vfxx68xhn-opentofu-1.13.1.drv
dependency failed checks.aarch64-darwin.package-tf-apply —
dependency failed checks.aarch64-darwin.package-tf-destroy —
dependency failed checks.aarch64-darwin.package-tf-init —
failed checks.aarch64-linux.package-gaia-vm 1m 8s
setup: don't know how to build these paths: /nix/store/pkadvc3fw8c3l8f1i41h2ri37c0nyg44-run-gaia-vm-on-aarch64-linux.drv warning: ignoring the client-specifie …
setup:
don't know how to build these paths:
  /nix/store/pkadvc3fw8c3l8f1i41h2ri37c0nyg44-run-gaia-vm-on-aarch64-linux.drv
warning: ignoring the client-specified setting 'store', because it is a restricted setting and you are not a trusted user
pkadvc3fw8c3l8f1i41h2ri37c0nyg44-run-gaia-vm-on-aarch64-linux.drv: error: gRPC QueryValidPaths on 'nix-store.geninf.io:50051' failed: error: niks3 push: uploading objects: uploading NAR nar/04xgngb0vyzydw9hsrg7c5mhk7l7vnxgd9vdcr2fmv8nasi9rixj.nar.zst: uploading NAR nar/04xgngb0vyzydw9hsrg7c5mhk7l7vnxgd9vdcr2fmv8nasi9rixj.nar.zst: server returned 500: 
error: error: gRPC QueryValidPaths on 'nix-store.geninf.io:50051' failed: error: niks3 push: uploading objects: uploading NAR nar/04xgngb0vyzydw9hsrg7c5mhk7l7vnxgd9vdcr2fmv8nasi9rixj.nar.zst: uploading NAR nar/04xgngb0vyzydw9hsrg7c5mhk7l7vnxgd9vdcr2fmv8nasi9rixj.nar.zst: server returned 500: 
failed checks.aarch64-linux.package-phi-nixos-vm 39s
setup: don't know how to build these paths: /nix/store/cc2rf3xj5wdql2d6zjr50nvhl1ykaygv-run-phi-nixos-vm-on-aarch64-linux.drv warning: ignoring the client-spe …
setup:
don't know how to build these paths:
  /nix/store/cc2rf3xj5wdql2d6zjr50nvhl1ykaygv-run-phi-nixos-vm-on-aarch64-linux.drv
warning: ignoring the client-specified setting 'store', because it is a restricted setting and you are not a trusted user
cc2rf3xj5wdql2d6zjr50nvhl1ykaygv-run-phi-nixos-vm-on-aarch64-linux.drv: error: gRPC QueryValidPaths on 'nix-store.geninf.io:50051' failed: error: niks3 push: uploading objects: uploading NAR nar/04xgngb0vyzydw9hsrg7c5mhk7l7vnxgd9vdcr2fmv8nasi9rixj.nar.zst: uploading NAR nar/04xgngb0vyzydw9hsrg7c5mhk7l7vnxgd9vdcr2fmv8nasi9rixj.nar.zst: server returned 500: 
error: error: gRPC QueryValidPaths on 'nix-store.geninf.io:50051' failed: error: niks3 push: uploading objects: uploading NAR nar/04xgngb0vyzydw9hsrg7c5mhk7l7vnxgd9vdcr2fmv8nasi9rixj.nar.zst: uploading NAR nar/04xgngb0vyzydw9hsrg7c5mhk7l7vnxgd9vdcr2fmv8nasi9rixj.nar.zst: server returned 500: 
failed checks.aarch64-linux.package-sigma-vm 24s
setup: this derivation will be built: /nix/store/pkm87l90pvx6rizd3aqpfng6l5g0afp7-run-sigma-vm-on-aarch64-linux.drv this path will be fetched (0.0 KiB downloa …
setup:
this derivation will be built:
  /nix/store/pkm87l90pvx6rizd3aqpfng6l5g0afp7-run-sigma-vm-on-aarch64-linux.drv
this path will be fetched (0.0 KiB download, 60.0 KiB unpacked):
  /nix/store/wc2yjib5jdx9pxxfbshmiffxzb03qx18-stdenv-linux-no-cc
warning: ignoring the client-specified setting 'store', because it is a restricted setting and you are not a trusted user
pkm87l90pvx6rizd3aqpfng6l5g0afp7-run-sigma-vm-on-aarch64-linux.drv: error: gRPC AddMultipleToStore on 'nix-store.geninf.io:50051' failed: error: niks3 push: uploading objects: uploading NAR nar/0cb2f91l2pcf9pjagnk7i7vp3v2n54s6wc9wm31x4p9md53vh2hx.nar.zst: uploading NAR nar/0cb2f91l2pcf9pjagnk7i7vp3v2n54s6wc9wm31x4p9md53vh2hx.nar.zst: server returned 500: 
error: error: gRPC AddMultipleToStore on 'nix-store.geninf.io:50051' failed: error: niks3 push: uploading objects: uploading NAR nar/0cb2f91l2pcf9pjagnk7i7vp3v2n54s6wc9wm31x4p9md53vh2hx.nar.zst: uploading NAR nar/0cb2f91l2pcf9pjagnk7i7vp3v2n54s6wc9wm31x4p9md53vh2hx.nar.zst: server returned 500: 
failed checks.x86_64-linux.package-gaia-vm 18s
setup: don't know how to build these paths: /nix/store/zxhy5w58jw89bv3an2nhibvwrz1nggb4-run-gaia-vm-on-x86_64-linux.drv warning: ignoring the client-specified …
setup:
don't know how to build these paths:
  /nix/store/zxhy5w58jw89bv3an2nhibvwrz1nggb4-run-gaia-vm-on-x86_64-linux.drv
warning: ignoring the client-specified setting 'store', because it is a restricted setting and you are not a trusted user
zxhy5w58jw89bv3an2nhibvwrz1nggb4-run-gaia-vm-on-x86_64-linux.drv: error: gRPC QueryValidPaths on 'nix-store.geninf.io:50051' failed: error: niks3 push: uploading objects: uploading NAR nar/04xgngb0vyzydw9hsrg7c5mhk7l7vnxgd9vdcr2fmv8nasi9rixj.nar.zst: uploading NAR nar/04xgngb0vyzydw9hsrg7c5mhk7l7vnxgd9vdcr2fmv8nasi9rixj.nar.zst: server returned 500: 
error: error: gRPC QueryValidPaths on 'nix-store.geninf.io:50051' failed: error: niks3 push: uploading objects: uploading NAR nar/04xgngb0vyzydw9hsrg7c5mhk7l7vnxgd9vdcr2fmv8nasi9rixj.nar.zst: uploading NAR nar/04xgngb0vyzydw9hsrg7c5mhk7l7vnxgd9vdcr2fmv8nasi9rixj.nar.zst: server returned 500: 
failed checks.x86_64-linux.package-phi-nixos-vm 10s
setup: don't know how to build these paths: /nix/store/3byrs07ci3wxlzvn98q89fj2vivqmzff-run-phi-nixos-vm-on-x86_64-linux.drv warning: ignoring the client-spec …
setup:
don't know how to build these paths:
  /nix/store/3byrs07ci3wxlzvn98q89fj2vivqmzff-run-phi-nixos-vm-on-x86_64-linux.drv
warning: ignoring the client-specified setting 'store', because it is a restricted setting and you are not a trusted user
3byrs07ci3wxlzvn98q89fj2vivqmzff-run-phi-nixos-vm-on-x86_64-linux.drv: error: gRPC AddMultipleToStore on 'nix-store.geninf.io:50051' failed: error: niks3 push: uploading objects: uploading NAR nar/1mq1r9q1m2x1d9mx5dhm5jhiaif1sfx2kc1lvfays4sa01qpxbp5.nar.zst: uploading NAR nar/1mq1r9q1m2x1d9mx5dhm5jhiaif1sfx2kc1lvfays4sa01qpxbp5.nar.zst: server returned 500: 
error: error: gRPC AddMultipleToStore on 'nix-store.geninf.io:50051' failed: error: niks3 push: uploading objects: uploading NAR nar/1mq1r9q1m2x1d9mx5dhm5jhiaif1sfx2kc1lvfays4sa01qpxbp5.nar.zst: uploading NAR nar/1mq1r9q1m2x1d9mx5dhm5jhiaif1sfx2kc1lvfays4sa01qpxbp5.nar.zst: server returned 500: 
failed checks.x86_64-linux.package-sigma-vm 20s
setup: don't know how to build these paths: /nix/store/hm4phh5xz56n3gi4zbgrmgnxs2kj5hs7-run-sigma-vm-on-x86_64-linux.drv warning: ignoring the client-specifie …
setup:
don't know how to build these paths:
  /nix/store/hm4phh5xz56n3gi4zbgrmgnxs2kj5hs7-run-sigma-vm-on-x86_64-linux.drv
warning: ignoring the client-specified setting 'store', because it is a restricted setting and you are not a trusted user
hm4phh5xz56n3gi4zbgrmgnxs2kj5hs7-run-sigma-vm-on-x86_64-linux.drv: error: gRPC QueryValidPaths on 'nix-store.geninf.io:50051' failed: error: niks3 push: uploading objects: uploading NAR nar/04xgngb0vyzydw9hsrg7c5mhk7l7vnxgd9vdcr2fmv8nasi9rixj.nar.zst: uploading NAR nar/04xgngb0vyzydw9hsrg7c5mhk7l7vnxgd9vdcr2fmv8nasi9rixj.nar.zst: server returned 500: 
error: error: gRPC QueryValidPaths on 'nix-store.geninf.io:50051' failed: error: niks3 push: uploading objects: uploading NAR nar/04xgngb0vyzydw9hsrg7c5mhk7l7vnxgd9vdcr2fmv8nasi9rixj.nar.zst: uploading NAR nar/04xgngb0vyzydw9hsrg7c5mhk7l7vnxgd9vdcr2fmv8nasi9rixj.nar.zst: server returned 500: 
failed checks.x86_64-linux.treefmt 19s
setup: /nix/store/x5d9jl8wk20i2fc6w1lbvdp1awb82xyl-python3.14-pyflakes-3.4.0 /nix/store/7hvzxd0qgfw70brc9cvrl914a46n442f-statix-0.5.8-unstable-2026-07-17 …
setup:
  /nix/store/x5d9jl8wk20i2fc6w1lbvdp1awb82xyl-python3.14-pyflakes-3.4.0
  /nix/store/7hvzxd0qgfw70brc9cvrl914a46n442f-statix-0.5.8-unstable-2026-07-17
  /nix/store/fqmf9qkqmdzjw4vvqc56grhbinkzvbkj-statix-config
  /nix/store/58409vv55wxf9h3m14ll3a1z15apsmjx-statix-fix
  /nix/store/9h8b5xam2ldyg2ih4866lcfnn9mv18k7-treefmt.toml
warning: ignoring the client-specified setting 'store', because it is a restricted setting and you are not a trusted user
ljdc07dbcr2wa55f17yc3d043f3nbfb2-treefmt-check.drv: error: gRPC AddMultipleToStore on 'nix-store.geninf.io:50051' failed: error: niks3 push: uploading objects: uploading NAR nar/065vkcd5b4c95nwgxn0z5hm018aijv1f3ghh857kmrbgl9cx69n0.nar.zst: uploading NAR nar/065vkcd5b4c95nwgxn0z5hm018aijv1f3ghh857kmrbgl9cx69n0.nar.zst: server returned 500: 
error: error: gRPC AddMultipleToStore on 'nix-store.geninf.io:50051' failed: error: niks3 push: uploading objects: uploading NAR nar/065vkcd5b4c95nwgxn0z5hm018aijv1f3ghh857kmrbgl9cx69n0.nar.zst: uploading NAR nar/065vkcd5b4c95nwgxn0z5hm018aijv1f3ghh857kmrbgl9cx69n0.nar.zst: server returned 500: 
9 cancelled
cancelled attributes
status attribute duration
loading…
25 already built
skipped attributes
status attribute duration
loading…