nixbot

builds

Enzime/hyperconfig build #932 failed

branch next · PR #1025 · commit a1ba851329 · · took 33m 28s · eval 1m 46s

eval warnings 5 kinds · 126 occurrences
  • error unable to download 'https://cache.clan.lol/…': HTTP error 503 ×15
  • error unable to download 'https://cache.geninf.io/…': HTTP error 503 ×3
  • warn A legacy Nextcloud install (from before NixOS 26.11) may be installed. ×2
  • warn unable to download 'https://cache.clan.lol/…': HTTP error 503 ×72
  • warn unable to download 'https://cache.geninf.io/…': HTTP error 503 ×34

25 failed ⚠ 1
failed attributes
status attribute duration
failed checks.x86_64-linux.nixos-phi-nixos
  • A legacy Nextcloud install (from before NixOS 26.11) may be installed. After nextcloud33 is installed successfully, you can safely upgrade to 34. The latest version available is Nextcloud35. Please note that Nextcloud doesn't support upgrades across multiple major versions (i.e. an upgrade from 16 is possible to 17, but not 16 to 18). The package can be upgraded by explicitly declaring the service-option `services.nextcloud.package`.
  • A legacy Nextcloud install (from before NixOS 26.11) may be installed. After nextcloud34 is installed successfully, you can safely upgrade to 35. The latest version available is Nextcloud35. Please note that Nextcloud doesn't support upgrades across multiple major versions (i.e. an upgrade from 16 is possible to 17, but not 16 to 18). The package can be upgraded by explicitly declaring the service-option `services.nextcloud.package`.
26s
setup: don't know how to build these paths: /nix/store/z8fk1s6v8fcca1xz4cn3fi8k9wivvsmx-nixos-system-phi-nixos-26.11.20260922.b6c98e9.drv warning: ignoring th …
setup:
don't know how to build these paths:
  /nix/store/z8fk1s6v8fcca1xz4cn3fi8k9wivvsmx-nixos-system-phi-nixos-26.11.20260922.b6c98e9.drv
warning: ignoring the client-specified setting 'store', because it is a restricted setting and you are not a trusted user
error: gRPC QueryValidPaths on 'nix-store.geninf.io:50051' failed: error: unable to download 'https://cache.geninf.io/0kqiiaqxw3khxsy62xkh0x0j5mrs0ig1.narinfo': HTTP error 503

              response body:

              <?xml version="1.0" encoding="UTF-8" standalone="yes"?>
              <Error>
                  <Code>SlowDown</Code>
                  <Message>Your account has made too many requests; try again later.</Message>
              </Error>
failed checks.aarch64-darwin.devShell-default 1m 37s
setup: 687hh0cail4fii12ziks88y6c0imhn37-nix-shell.drv: build04: build04: input not substitutable: error: some references of path '/nix/store/6hbxwipydk9zksdlryw …
setup:
687hh0cail4fii12ziks88y6c0imhn37-nix-shell.drv: build04: build04: input not substitutable: error: some references of path '/nix/store/6hbxwipydk9zksdlrywzi6n2y7m5qzam-opentofu-1.12.6' could not be realised, asking the scheduler again
687hh0cail4fii12ziks88y6c0imhn37-nix-shell.drv: build04: build04: input not substitutable: error: some references of path '/nix/store/6hbxwipydk9zksdlrywzi6n2y7m5qzam-opentofu-1.12.6' could not be realised, asking the scheduler again
687hh0cail4fii12ziks88y6c0imhn37-nix-shell.drv: build04: build04: input not substitutable: error: some references of path '/nix/store/6hbxwipydk9zksdlrywzi6n2y7m5qzam-opentofu-1.12.6' could not be realised, asking the scheduler again
687hh0cail4fii12ziks88y6c0imhn37-nix-shell.drv: build04: build04: input not substitutable: error: some references of path '/nix/store/6hbxwipydk9zksdlrywzi6n2y7m5qzam-opentofu-1.12.6' could not be realised, asking the scheduler again
687hh0cail4fii12ziks88y6c0imhn37-nix-shell.drv: build04: build04: input not substitutable: error: some references of path '/nix/store/6hbxwipydk9zksdlrywzi6n2y7m5qzam-opentofu-1.12.6' could not be realised, asking the scheduler again
687hh0cail4fii12ziks88y6c0imhn37-nix-shell.drv: build04: build04: input not substitutable: error: some references of path '/nix/store/6hbxwipydk9zksdlrywzi6n2y7m5qzam-opentofu-1.12.6' could not be realised, asking the scheduler again
687hh0cail4fii12ziks88y6c0imhn37-nix-shell.drv: build04: build04: input not substitutable: error: some references of path '/nix/store/6hbxwipydk9zksdlrywzi6n2y7m5qzam-opentofu-1.12.6' could not be realised, asking the scheduler again
error: gave up after 9 reschedules
failed checks.aarch64-darwin."home-manager-enzime@hyperion-macos" 11s
setup: don't know how to build these paths: /nix/store/366xk6idxlggcn8lylfav7asxbw5d978-home-manager-generation.drv warning: ignoring the client-specified set …
setup:
don't know how to build these paths:
  /nix/store/366xk6idxlggcn8lylfav7asxbw5d978-home-manager-generation.drv
warning: ignoring the client-specified setting 'store', because it is a restricted setting and you are not a trusted user
error: gRPC QueryValidPaths on 'nix-store.geninf.io:50051' failed: error: unable to download 'https://cache.clan.lol/5fzqfqyyc0b752id6k14gp0dwcxdrpfq.narinfo': HTTP error 503

              response body:

              <?xml version="1.0" encoding="UTF-8" standalone="yes"?>
              <Error>
                  <Code>SlowDown</Code>
                  <Message>Your account has made too many requests; try again later.</Message>
              </Error>
failed checks.aarch64-darwin.nix-darwin-hyperion-macos 2m 33s
setup: don't know how to build these paths: /nix/store/cxaxqwsri7sy8kcijp613xfpqgz6zcxg-darwin-system-26.11.4cff07d.drv warning: ignoring the client-specified …
setup:
don't know how to build these paths:
  /nix/store/cxaxqwsri7sy8kcijp613xfpqgz6zcxg-darwin-system-26.11.4cff07d.drv
warning: ignoring the client-specified setting 'store', because it is a restricted setting and you are not a trusted user
error: gRPC QueryValidPaths on 'nix-store.geninf.io:50051' failed: error: unable to download 'https://cache.clan.lol/401cdx2xqs92pjqx1j5ijlz0zyq3k3hg.narinfo': HTTP error 503

              response body:

              <?xml version="1.0" encoding="UTF-8" standalone="yes"?>
              <Error>
                  <Code>SlowDown</Code>
                  <Message>Your account has made too many requests; try again later.</Message>
              </Error>
failed checks.aarch64-darwin.package-get-clan-secret 1m 31s
setup: don't know how to build these paths: /nix/store/rvfbpgvw7n861hp9ig3dhcvb2v4y4h1y-get-clan-secret.drv warning: ignoring the client-specified setting 'st …
setup:
don't know how to build these paths:
  /nix/store/rvfbpgvw7n861hp9ig3dhcvb2v4y4h1y-get-clan-secret.drv
warning: ignoring the client-specified setting 'store', because it is a restricted setting and you are not a trusted user
rvfbpgvw7n861hp9ig3dhcvb2v4y4h1y-get-clan-secret.drv: error: gRPC QueryValidPaths on 'nix-store.geninf.io:50051' failed: error: substituter 'https://cache.clan.lol' is disabled
error: error: gRPC QueryValidPaths on 'nix-store.geninf.io:50051' failed: error: substituter 'https://cache.clan.lol' is disabled
dependency failed checks.aarch64-darwin.package-tf-apply —
dependency failed checks.aarch64-darwin.package-tf-destroy —
dependency failed checks.aarch64-darwin.package-tf-init —
failed checks.aarch64-darwin.treefmt 4m 28s
setup: don't know how to build these paths: /nix/store/dbic8pr4zd12pggxp48hmfwmi62x949p-treefmt-check.drv warning: ignoring the client-specified setting 'stor …
setup:
don't know how to build these paths:
  /nix/store/dbic8pr4zd12pggxp48hmfwmi62x949p-treefmt-check.drv
warning: ignoring the client-specified setting 'store', because it is a restricted setting and you are not a trusted user
error: gRPC QueryValidPaths on 'nix-store.geninf.io:50051' failed: error: unable to download 'https://cache.clan.lol/vj214kz97c8r58qzxrvz6vrg4bv41c21.narinfo': HTTP error 503

              response body:

              <?xml version="1.0" encoding="UTF-8" standalone="yes"?>
              <Error>
                  <Code>SlowDown</Code>
                  <Message>Your account has made too many requests; try again later.</Message>
              </Error>
failed checks.aarch64-linux.devShell-default 9m 10s
setup: /nix/store/6rpvwbfgakbcvwspaw98lqh0k2h4azg6-python3.14-wheel-0.47.0 /nix/store/s636h8q3f1rhs81zj38zp6pdkvsmcch2-wrap-python-hook warning: ignoring th …
setup:
  /nix/store/6rpvwbfgakbcvwspaw98lqh0k2h4azg6-python3.14-wheel-0.47.0
  /nix/store/s636h8q3f1rhs81zj38zp6pdkvsmcch2-wrap-python-hook
warning: ignoring the client-specified setting 'store', because it is a restricted setting and you are not a trusted user
yzwz7lp25m0cjwl2n5jq9mdxrfbs2vfy-clan-cli-source.drv: error: gRPC QueryValidPaths on 'nix-store.geninf.io:50051' failed: error: unable to download 'https://cache.clan.lol/yzwz7lp25m0cjwl2n5jq9mdxrfbs2vfy.narinfo': HTTP error 503

              response body:

              <?xml version="1.0" encoding="UTF-8" standalone="yes"?>
              <Error>
                  <Code>SlowDown</Code>
                  <Message>Your account has made too many requests; try again later.</Message>
              </Error>
1im91r18wpplppd4cmg6k5js1jawj744-terraform-provider-desec-0.6.1.drv: error: gRPC QueryValidPaths on 'nix-store.geninf.io:50051' failed: error: substituter 'https://cache.clan.lol' is disabled
y1xh92hjf3kxlnly4mnx3wk0bhcxkivb-terraform-provider-b2-0.14.0.drv: error: gRPC QueryValidPaths on 'nix-store.geninf.io:50051' failed: error: substituter 'https://cache.clan.lol' is disabled
wnmch7cj1yn2xra365vm0ky8p9ynam09-opentofu-1.12.6.drv: build01: not scheduled here: wnmch7cj1yn2xra365vm0ky8p9ynam09-opentofu-1.12.6.drv, asking the scheduler again
error: dependency '6n0dvfc4nlsgp6xvy4zmdg41hyl9z9wb-clan-cli.drv' failed
failed checks.aarch64-linux.package-get-clan-secret 2m 17s
setup: don't know how to build these paths: /nix/store/843b80pxl7dsgp4mqr7lcpvhzmx4zks0-get-clan-secret.drv warning: ignoring the client-specified setting 'st …
setup:
don't know how to build these paths:
  /nix/store/843b80pxl7dsgp4mqr7lcpvhzmx4zks0-get-clan-secret.drv
warning: ignoring the client-specified setting 'store', because it is a restricted setting and you are not a trusted user
yzwz7lp25m0cjwl2n5jq9mdxrfbs2vfy-clan-cli-source.drv: error: gRPC QueryValidPaths on 'nix-store.geninf.io:50051' failed: error: substituter 'https://cache.geninf.io' is disabled
error: dependency '6n0dvfc4nlsgp6xvy4zmdg41hyl9z9wb-clan-cli.drv' failed
failed checks.aarch64-linux.package-provide-tf-passphrase 2m 17s
setup: don't know how to build these paths: /nix/store/6pj5zrq9sphy6hhq9qqdb2s6d66ylrfi-opentofu-external-key-provider.drv warning: ignoring the client-specif …
setup:
don't know how to build these paths:
  /nix/store/6pj5zrq9sphy6hhq9qqdb2s6d66ylrfi-opentofu-external-key-provider.drv
warning: ignoring the client-specified setting 'store', because it is a restricted setting and you are not a trusted user
yzwz7lp25m0cjwl2n5jq9mdxrfbs2vfy-clan-cli-source.drv: error: gRPC QueryValidPaths on 'nix-store.geninf.io:50051' failed: error: substituter 'https://cache.geninf.io' is disabled
error: dependency '6n0dvfc4nlsgp6xvy4zmdg41hyl9z9wb-clan-cli.drv' failed
dependency failed checks.aarch64-linux.package-tf-apply —
dependency failed checks.aarch64-linux.package-tf-destroy —
dependency failed checks.aarch64-linux.package-tf-init —
failed checks.aarch64-linux.treefmt 2m 10s
setup: don't know how to build these paths: /nix/store/cbz3cps5fn8441jhgf1dynd9pk0q1swr-treefmt-check.drv warning: ignoring the client-specified setting 'stor …
setup:
don't know how to build these paths:
  /nix/store/cbz3cps5fn8441jhgf1dynd9pk0q1swr-treefmt-check.drv
warning: ignoring the client-specified setting 'store', because it is a restricted setting and you are not a trusted user
7bhiy1bsp5px9n2qhhvbza7g9wamk71h-nil.drv: error: gRPC QueryValidPaths on 'nix-store.geninf.io:50051' failed: error: substituter 'https://cache.geninf.io' is disabled
error: dependency '80k5l9v8spyz9gfrh2b313d0z9bwh0wa-treefmt.drv' failed
failed checks.x86_64-linux.devShell-default 7m 4s
setup: don't know how to build these paths: /nix/store/ynnsmwjibbdh0209m50r19bzvbbrqpr4-nix-shell.drv warning: ignoring the client-specified setting 'store', …
setup:
don't know how to build these paths:
  /nix/store/ynnsmwjibbdh0209m50r19bzvbbrqpr4-nix-shell.drv
warning: ignoring the client-specified setting 'store', because it is a restricted setting and you are not a trusted user
error: gRPC QueryValidPaths on 'nix-store.geninf.io:50051' failed: error: unable to download 'https://cache.clan.lol/2irg5dfwia4j76z82ql7smmvq5gjfi2r.narinfo': HTTP error 503

              response body:

              <?xml version="1.0" encoding="UTF-8" standalone="yes"?>
              <Error>
                  <Code>SlowDown</Code>
                  <Message>Your account has made too many requests; try again later.</Message>
              </Error>
failed checks.x86_64-linux."home-manager-enzime@gaia" 54s
setup: don't know how to build these paths: /nix/store/55a7fill6hrpwbf8mwz3s9vh6z5ma9r5-home-manager-generation.drv warning: ignoring the client-specified set …
setup:
don't know how to build these paths:
  /nix/store/55a7fill6hrpwbf8mwz3s9vh6z5ma9r5-home-manager-generation.drv
warning: ignoring the client-specified setting 'store', because it is a restricted setting and you are not a trusted user
i0ijcxsgyimi921glyn2h4p6jxhvfxdx-activation-script.drv: error: gRPC QueryValidPaths on 'nix-store.geninf.io:50051' failed: error: unable to download 'https://cache.clan.lol/wskj7pii2hwc3hnfr4l6z5lqxj3ppx8i.narinfo': HTTP error 503

              response body:

              <?xml version="1.0" encoding="UTF-8" standalone="yes"?>
              <Error>
                  <Code>SlowDown</Code>
                  <Message>Your account has made too many requests; try again later.</Message>
              </Error>
error: dependency 'i0ijcxsgyimi921glyn2h4p6jxhvfxdx-activation-script.drv' failed
failed checks.x86_64-linux."home-manager-enzime@phi-nixos" 48s
setup: these 2 derivations will be built: /nix/store/gjznhh9kak936khjr05pbr0sh7cnyq49-activation-script.drv /nix/store/mhhs3hk66d67qq66kajrgp00alnlwhrg-home …
setup:
these 2 derivations will be built:
  /nix/store/gjznhh9kak936khjr05pbr0sh7cnyq49-activation-script.drv
  /nix/store/mhhs3hk66d67qq66kajrgp00alnlwhrg-home-manager-generation.drv
warning: ignoring the client-specified setting 'store', because it is a restricted setting and you are not a trusted user
error: gRPC QueryValidPaths on 'nix-store.geninf.io:50051' failed: error: unable to download 'https://cache.clan.lol/x404j7683lp304l4vm1wzqjfk46njscc.narinfo': HTTP error 503

              response body:

              <?xml version="1.0" encoding="UTF-8" standalone="yes"?>
              <Error>
                  <Code>SlowDown</Code>
                  <Message>Your account has made too many requests; try again later.</Message>
              </Error>
failed checks.x86_64-linux."home-manager-enzime@sigma" 1m 23s
setup: don't know how to build these paths: /nix/store/066ywwsg1zmjcz866c0b9q3kq3nwayxf-home-manager-generation.drv warning: ignoring the client-specified set …
setup:
don't know how to build these paths:
  /nix/store/066ywwsg1zmjcz866c0b9q3kq3nwayxf-home-manager-generation.drv
warning: ignoring the client-specified setting 'store', because it is a restricted setting and you are not a trusted user
error: gRPC QueryValidPaths on 'nix-store.geninf.io:50051' failed: error: unable to download 'https://cache.geninf.io/nhsxbg9slzbim6nz30vz9kwik57jfyjz.narinfo': HTTP error 503

              response body:

              <?xml version="1.0" encoding="UTF-8" standalone="yes"?>
              <Error>
                  <Code>SlowDown</Code>
                  <Message>Your account has made too many requests; try again later.</Message>
              </Error>
failed checks.x86_64-linux.nixos-gaia 1m 17s
setup: don't know how to build these paths: /nix/store/qw5bmfddlfbayfysl5fvxyf5x87nhzs0-nixos-system-gaia-26.11.20260922.b6c98e9.drv warning: ignoring the cli …
setup:
don't know how to build these paths:
  /nix/store/qw5bmfddlfbayfysl5fvxyf5x87nhzs0-nixos-system-gaia-26.11.20260922.b6c98e9.drv
warning: ignoring the client-specified setting 'store', because it is a restricted setting and you are not a trusted user
error: gRPC QueryValidPaths on 'nix-store.geninf.io:50051' failed: error: unable to download 'https://cache.geninf.io/4krvj9pwq1lnz4q2k87gn0jbvnmm1aya.narinfo': HTTP error 503

              response body:

              <?xml version="1.0" encoding="UTF-8" standalone="yes"?>
              <Error>
                  <Code>SlowDown</Code>
                  <Message>Your account has made too many requests; try again later.</Message>
              </Error>
failed checks.x86_64-linux.nixos-sigma 31m 38s
setup: /nix/store/klqm7x44c27ci8wrx06y9a1c7wz89ad8-dry-activate /nix/store/bhrnmwxdgs7i4w205jlcq9svsszrghi9-erofs-utils-1.9.4 /nix/store/lgafcbc15xdcw604s …
setup:
  /nix/store/klqm7x44c27ci8wrx06y9a1c7wz89ad8-dry-activate
  /nix/store/bhrnmwxdgs7i4w205jlcq9svsszrghi9-erofs-utils-1.9.4
  /nix/store/lgafcbc15xdcw604sfj20niylscmvm3d-home-manager-generation
  /nix/store/84sggxlzw0adckmzzysvrajmmdl5p6qq-libcap-text-verifier-0-unstable
  /nix/store/azjnwg3za27ccl8czdfsfz83x7gharz2-xkb-validated
warning: ignoring the client-specified setting 'store', because it is a restricted setting and you are not a trusted user
3paj322mz0i8m0a80q0l26pr6bnn5dz1-etc-nix-registry.json.drv: error: gRPC AddMultipleToStore on 'nix-store.geninf.io:50051' failed: error: path '/nix/store/rb1gzbjvkqhk48l8y4gym3bm8g81l0m2-source' is required, but there is no substituter that can build it
error: dependency 'ldfadgj3h9x6d4yis4cd63m6ld5wqkl5-etc.drv' failed
failed checks.x86_64-linux.package-tf-apply 7s
setup: don't know how to build these paths: /nix/store/1mc1gmp0lsgny6avp8kywzhi29wa3vp7-tf-apply.drv warning: ignoring the client-specified setting 'store', b …
setup:
don't know how to build these paths:
  /nix/store/1mc1gmp0lsgny6avp8kywzhi29wa3vp7-tf-apply.drv
warning: ignoring the client-specified setting 'store', because it is a restricted setting and you are not a trusted user
error: gRPC QueryValidPaths on 'nix-store.geninf.io:50051' failed: error: unable to download 'https://cache.geninf.io/15amnr421f3x7yz7dsf2gvlgx8z10fic.narinfo': HTTP error 503

              response body:

              <?xml version="1.0" encoding="UTF-8" standalone="yes"?>
              <Error>
                  <Code>SlowDown</Code>
                  <Message>Your account has made too many requests; try again later.</Message>
              </Error>
failed checks.x86_64-linux.package-tf-destroy 2m 40s
setup: /nix/store/6k9nld75sk451yvydsw1pyinj96isx64-tf-destroy.drv /nix/store/7qrfi75jadplbyvx4xry6lznq4cjgrrw-config.tf.json.drv these 3 paths will be fetch …
setup:
  /nix/store/6k9nld75sk451yvydsw1pyinj96isx64-tf-destroy.drv
  /nix/store/7qrfi75jadplbyvx4xry6lznq4cjgrrw-config.tf.json.drv
these 3 paths will be fetched (0.0 KiB download, 3.9 MiB unpacked):
  /nix/store/wxg84ivnwmb8ch43izii329a8y61pqa4-clan-cli
  /nix/store/vd2h8psr2ji3j6n7a9rgdj1igfll690y-get-clan-secret
  /nix/store/hyfhb3kfaqmxy8m1chhmz81339vwxgml-opentofu-external-key-provider
warning: ignoring the client-specified setting 'store', because it is a restricted setting and you are not a trusted user
error: gRPC QueryValidPaths on 'nix-store.geninf.io:50051' failed: error: unable to download 'https://cache.clan.lol/qv3aawkmvmfi072jsgyki67va6nlpyjk.narinfo': HTTP error 503

              response body:

              <?xml version="1.0" encoding="UTF-8" standalone="yes"?>
              <Error>
                  <Code>SlowDown</Code>
                  <Message>Your account has made too many requests; try again later.</Message>
              </Error>
failed checks.x86_64-linux.package-tf-init 4m 17s
setup: /nix/store/6albh9zdq2x3cipi8i4hawzp7bz7fhg9-tf-init.drv /nix/store/7qrfi75jadplbyvx4xry6lznq4cjgrrw-config.tf.json.drv these 3 paths will be fetched …
setup:
  /nix/store/6albh9zdq2x3cipi8i4hawzp7bz7fhg9-tf-init.drv
  /nix/store/7qrfi75jadplbyvx4xry6lznq4cjgrrw-config.tf.json.drv
these 3 paths will be fetched (0.0 KiB download, 3.9 MiB unpacked):
  /nix/store/wxg84ivnwmb8ch43izii329a8y61pqa4-clan-cli
  /nix/store/vd2h8psr2ji3j6n7a9rgdj1igfll690y-get-clan-secret
  /nix/store/hyfhb3kfaqmxy8m1chhmz81339vwxgml-opentofu-external-key-provider
warning: ignoring the client-specified setting 'store', because it is a restricted setting and you are not a trusted user
error: gRPC QueryValidPaths on 'nix-store.geninf.io:50051' failed: error: substituter 'https://cache.clan.lol' is disabled
13 succeeded
succeeded attributes
status attribute duration
loading…
21 already built
skipped attributes
status attribute duration
loading…