nixbot

builds

Enzime/hyperconfig build #933 failed

branch next · PR #1026 · commit 721db56b9d · · took 16m 40s · eval 1m 23s

eval warnings 3 kinds · 488 occurrences
  • error unable to download 'https://cache.clan.lol/…': HTTP error 503 ×38
  • warn unable to download 'https://cache.clan.lol/…': HTTP error 503 ×448
  • warn A legacy Nextcloud install (from before NixOS 26.11) may be installed. ×2

13 failed ⚠ 1
failed attributes
status attribute duration
failed checks.x86_64-linux.nixos-phi-nixos
  • A legacy Nextcloud install (from before NixOS 26.11) may be installed. After nextcloud33 is installed successfully, you can safely upgrade to 34. The latest version available is Nextcloud35. Please note that Nextcloud doesn't support upgrades across multiple major versions (i.e. an upgrade from 16 is possible to 17, but not 16 to 18). The package can be upgraded by explicitly declaring the service-option `services.nextcloud.package`.
  • A legacy Nextcloud install (from before NixOS 26.11) may be installed. After nextcloud34 is installed successfully, you can safely upgrade to 35. The latest version available is Nextcloud35. Please note that Nextcloud doesn't support upgrades across multiple major versions (i.e. an upgrade from 16 is possible to 17, but not 16 to 18). The package can be upgraded by explicitly declaring the service-option `services.nextcloud.package`.
15m 14s
setup: /nix/store/zq3w0nnlkg1fmndx9m3xb1rp86k97d7l-unit-pipewire-pulse.socket-disabled.drv these 4 paths will be fetched (0.1 KiB download, 40.3 KiB unpacked) …
setup:
  /nix/store/zq3w0nnlkg1fmndx9m3xb1rp86k97d7l-unit-pipewire-pulse.socket-disabled.drv
these 4 paths will be fetched (0.1 KiB download, 40.3 KiB unpacked):
  /nix/store/c50zz1zkx6bk5nrn1na754yq56pdjj89-check-sshd-config
  /nix/store/84sggxlzw0adckmzzysvrajmmdl5p6qq-libcap-text-verifier-0-unstable
  /nix/store/4cj18ri8yyjbiragdkxm0q3y6bqr0dqs-lndir-1.0.5
  /nix/store/azjnwg3za27ccl8czdfsfz83x7gharz2-xkb-validated
warning: ignoring the client-specified setting 'store', because it is a restricted setting and you are not a trusted user
error: gRPC QueryValidPaths on 'nix-store.geninf.io:50051' failed: error: unable to download 'https://cache.geninf.io/31qs7xhl7gk2nx7chkc0xlr8lcxq45rf.narinfo': HTTP error 503

              response body:

              <?xml version="1.0" encoding="UTF-8" standalone="yes"?>
              <Error>
                  <Code>SlowDown</Code>
                  <Message>Your account has made too many requests; try again later.</Message>
              </Error>
failed checks.aarch64-darwin."home-manager-enzime@hyperion-macos" 1m 13s
setup: don't know how to build these paths: /nix/store/i8420n31861f2k8wzjqsxada56jdxlcy-home-manager-generation.drv warning: ignoring the client-specified set …
setup:
don't know how to build these paths:
  /nix/store/i8420n31861f2k8wzjqsxada56jdxlcy-home-manager-generation.drv
warning: ignoring the client-specified setting 'store', because it is a restricted setting and you are not a trusted user
error: gRPC QueryValidPaths on 'nix-store.geninf.io:50051' failed: error: unable to download 'https://cache.clan.lol/i1rr2i8q5whbcrxb5yqgc66ps2rh19ga.narinfo': HTTP error 503

              response body:

              <?xml version="1.0" encoding="UTF-8" standalone="yes"?>
              <Error>
                  <Code>SlowDown</Code>
                  <Message>Your account has made too many requests; try again later.</Message>
              </Error>
failed checks.aarch64-darwin.nix-darwin-hyperion-macos 1m 29s
setup: don't know how to build these paths: /nix/store/fq81fag3pqw7wvcaf68igdmfyx5j69vs-darwin-system-26.11.4cff07d.drv warning: ignoring the client-specified …
setup:
don't know how to build these paths:
  /nix/store/fq81fag3pqw7wvcaf68igdmfyx5j69vs-darwin-system-26.11.4cff07d.drv
warning: ignoring the client-specified setting 'store', because it is a restricted setting and you are not a trusted user
error: gRPC QueryValidPaths on 'nix-store.geninf.io:50051' failed: error: unable to download 'https://cache.clan.lol/mc1n7dfnlfwih0wmqd1wvr11wbir88sw.narinfo': HTTP error 503

              response body:

              <?xml version="1.0" encoding="UTF-8" standalone="yes"?>
              <Error>
                  <Code>SlowDown</Code>
                  <Message>Your account has made too many requests; try again later.</Message>
              </Error>
failed checks.aarch64-darwin.package-phi-nixos-vm 2m 55s
setup: this derivation will be built: /nix/store/i9xk45s59brk432gyz8bmzqgrmrwlb6k-run-phi-nixos-vm-on-aarch64-darwin.drv warning: ignoring the client-specifie …
setup:
this derivation will be built:
  /nix/store/i9xk45s59brk432gyz8bmzqgrmrwlb6k-run-phi-nixos-vm-on-aarch64-darwin.drv
warning: ignoring the client-specified setting 'store', because it is a restricted setting and you are not a trusted user
error: gRPC QueryValidPaths on 'nix-store.geninf.io:50051' failed: error: unable to download 'https://cache.clan.lol/yq3v10l2pkf4nsq9d2ylgmzjwvfs3k7q.narinfo': HTTP error 503

              response body:

              <?xml version="1.0" encoding="UTF-8" standalone="yes"?>
              <Error>
                  <Code>SlowDown</Code>
                  <Message>Your account has made too many requests; try again later.</Message>
              </Error>
failed checks.aarch64-linux.package-phi-nixos-vm 1m 16s
setup: don't know how to build these paths: /nix/store/k1w567vzy5hj8q95sbr3y8a5vdmjlygd-run-phi-nixos-vm-on-aarch64-linux.drv warning: ignoring the client-spe …
setup:
don't know how to build these paths:
  /nix/store/k1w567vzy5hj8q95sbr3y8a5vdmjlygd-run-phi-nixos-vm-on-aarch64-linux.drv
warning: ignoring the client-specified setting 'store', because it is a restricted setting and you are not a trusted user
k1w567vzy5hj8q95sbr3y8a5vdmjlygd-run-phi-nixos-vm-on-aarch64-linux.drv: error: gRPC QueryValidPaths on 'nix-store.geninf.io:50051' failed: error: substituter 'https://cache.geninf.io' is disabled
error: error: gRPC QueryValidPaths on 'nix-store.geninf.io:50051' failed: error: substituter 'https://cache.geninf.io' is disabled
failed checks.aarch64-linux.package-sigma-vm 1m 19s
setup: don't know how to build these paths: /nix/store/wlm29qb900b43z278n3c96wr129qwrdr-run-sigma-vm-on-aarch64-linux.drv warning: ignoring the client-specifi …
setup:
don't know how to build these paths:
  /nix/store/wlm29qb900b43z278n3c96wr129qwrdr-run-sigma-vm-on-aarch64-linux.drv
warning: ignoring the client-specified setting 'store', because it is a restricted setting and you are not a trusted user
wlm29qb900b43z278n3c96wr129qwrdr-run-sigma-vm-on-aarch64-linux.drv: error: gRPC QueryValidPaths on 'nix-store.geninf.io:50051' failed: error: substituter 'https://cache.geninf.io' is disabled
error: error: gRPC QueryValidPaths on 'nix-store.geninf.io:50051' failed: error: substituter 'https://cache.geninf.io' is disabled
failed checks.aarch64-linux.treefmt 15s
setup: don't know how to build these paths: /nix/store/51ppgq5xbj890bclj4mj1qmrnlzzjal8-treefmt-check.drv warning: ignoring the client-specified setting 'stor …
setup:
don't know how to build these paths:
  /nix/store/51ppgq5xbj890bclj4mj1qmrnlzzjal8-treefmt-check.drv
warning: ignoring the client-specified setting 'store', because it is a restricted setting and you are not a trusted user
error: gRPC QueryValidPaths on 'nix-store.geninf.io:50051' failed: error: unable to download 'https://cache.clan.lol/7dq85g2jdb88ml5k2ix09v49w862pxy7.narinfo': HTTP error 503

              response body:

              <?xml version="1.0" encoding="UTF-8" standalone="yes"?>
              <Error>
                  <Code>SlowDown</Code>
                  <Message>Your account has made too many requests; try again later.</Message>
              </Error>
failed checks.x86_64-linux."home-manager-enzime@gaia" 3m 3s
setup: don't know how to build these paths: /nix/store/9zi25syar1qah8lb3dkwcih231ak661a-home-manager-generation.drv warning: ignoring the client-specified set …
setup:
don't know how to build these paths:
  /nix/store/9zi25syar1qah8lb3dkwcih231ak661a-home-manager-generation.drv
warning: ignoring the client-specified setting 'store', because it is a restricted setting and you are not a trusted user
error: gRPC QueryValidPaths on 'nix-store.geninf.io:50051' failed: error: unable to download 'https://cache.geninf.io/2v1icfjf3446m2pgx28pbb7pxab08xlk.narinfo': HTTP error 503

              response body:

              <?xml version="1.0" encoding="UTF-8" standalone="yes"?>
              <Error>
                  <Code>SlowDown</Code>
                  <Message>Your account has made too many requests; try again later.</Message>
              </Error>
failed checks.x86_64-linux."home-manager-enzime@phi-nixos" 42s
setup: don't know how to build these paths: /nix/store/jfzsga9gknc0s49rpa2d2qiskxbbshcl-home-manager-generation.drv warning: ignoring the client-specified set …
setup:
don't know how to build these paths:
  /nix/store/jfzsga9gknc0s49rpa2d2qiskxbbshcl-home-manager-generation.drv
warning: ignoring the client-specified setting 'store', because it is a restricted setting and you are not a trusted user
error: gRPC QueryValidPaths on 'nix-store.geninf.io:50051' failed: error: unable to download 'https://cache.clan.lol/w5b3zyr98sfh1s0pd28yma77lxk6q52r.narinfo': HTTP error 503

              response body:

              <?xml version="1.0" encoding="UTF-8" standalone="yes"?>
              <Error>
                  <Code>SlowDown</Code>
                  <Message>Your account has made too many requests; try again later.</Message>
              </Error>
failed checks.x86_64-linux."home-manager-enzime@sigma" 1m 46s
setup: don't know how to build these paths: /nix/store/v2k1ys2p31wi5rh6cirqckzc3j5b6ml7-home-manager-generation.drv warning: ignoring the client-specified set …
setup:
don't know how to build these paths:
  /nix/store/v2k1ys2p31wi5rh6cirqckzc3j5b6ml7-home-manager-generation.drv
warning: ignoring the client-specified setting 'store', because it is a restricted setting and you are not a trusted user
error: gRPC QueryValidPaths on 'nix-store.geninf.io:50051' failed: error: unable to download 'https://cache.clan.lol/2zf9z4f9dm6w92p6935m09d4d6p2sx5j.narinfo': HTTP error 503

              response body:

              <?xml version="1.0" encoding="UTF-8" standalone="yes"?>
              <Error>
                  <Code>SlowDown</Code>
                  <Message>Your account has made too many requests; try again later.</Message>
              </Error>
failed checks.x86_64-linux.nixos-gaia 39s
setup: don't know how to build these paths: /nix/store/vbnmk6c3x7my6a3wxyg9sncpdaa8cs0w-nixos-system-gaia-26.11.20260922.b6c98e9.drv warning: ignoring the cli …
setup:
don't know how to build these paths:
  /nix/store/vbnmk6c3x7my6a3wxyg9sncpdaa8cs0w-nixos-system-gaia-26.11.20260922.b6c98e9.drv
warning: ignoring the client-specified setting 'store', because it is a restricted setting and you are not a trusted user
error: gRPC QueryValidPaths on 'nix-store.geninf.io:50051' failed: error: unable to download 'https://cache.clan.lol/jb8x0zkfhng8iav88wwb759bcirblaxa.narinfo': HTTP error 503

              response body:

              <?xml version="1.0" encoding="UTF-8" standalone="yes"?>
              <Error>
                  <Code>SlowDown</Code>
                  <Message>Your account has made too many requests; try again later.</Message>
              </Error>
failed checks.x86_64-linux.nixos-sigma 1m 23s
setup: don't know how to build these paths: /nix/store/jsm5yb4imngwjvxm95yf4s7m34dml8jg-nixos-system-sigma-26.11.20260922.b6c98e9.drv warning: ignoring the cl …
setup:
don't know how to build these paths:
  /nix/store/jsm5yb4imngwjvxm95yf4s7m34dml8jg-nixos-system-sigma-26.11.20260922.b6c98e9.drv
warning: ignoring the client-specified setting 'store', because it is a restricted setting and you are not a trusted user
error: gRPC QueryValidPaths on 'nix-store.geninf.io:50051' failed: error: unable to download 'https://cache.clan.lol/rcci6nj8ij3430yfny47xgsdmkxapi78.narinfo': HTTP error 503

              response body:

              <?xml version="1.0" encoding="UTF-8" standalone="yes"?>
              <Error>
                  <Code>SlowDown</Code>
                  <Message>Your account has made too many requests; try again later.</Message>
              </Error>
failed checks.x86_64-linux.treefmt 1m 25s
setup: don't know how to build these paths: /nix/store/lv1jkrhs9bhfphss6kbfng8wymnnpqf0-treefmt-check.drv warning: ignoring the client-specified setting 'stor …
setup:
don't know how to build these paths:
  /nix/store/lv1jkrhs9bhfphss6kbfng8wymnnpqf0-treefmt-check.drv
warning: ignoring the client-specified setting 'store', because it is a restricted setting and you are not a trusted user
error: gRPC QueryValidPaths on 'nix-store.geninf.io:50051' failed: error: substituter 'https://cache.clan.lol' is disabled
7 succeeded
succeeded attributes
status attribute duration
loading…
39 already built
skipped attributes
status attribute duration
loading…