nixbot

builds

Enzime/hyperconfig build #936 failed

branch next · PR #1029 · commit 2b17cca4d6 · · took 11m 56s · eval 2m 7s

eval warnings 4 kinds · 954 occurrences
  • error unable to download 'https://cache.clan.lol/…': HTTP error 503 ×61
  • warn unable to download 'https://cache.clan.lol/…': HTTP error 503 ×790
  • warn A legacy Nextcloud install (from before NixOS 26.11) may be installed. ×2
  • warn unable to download 'https://cache.geninf.io/…': HTTP error 503 ×101

11 failed ⚠ 1
failed attributes
status attribute duration
failed checks.x86_64-linux.nixos-phi-nixos
  • A legacy Nextcloud install (from before NixOS 26.11) may be installed. After nextcloud33 is installed successfully, you can safely upgrade to 34. The latest version available is Nextcloud35. Please note that Nextcloud doesn't support upgrades across multiple major versions (i.e. an upgrade from 16 is possible to 17, but not 16 to 18). The package can be upgraded by explicitly declaring the service-option `services.nextcloud.package`.
  • A legacy Nextcloud install (from before NixOS 26.11) may be installed. After nextcloud34 is installed successfully, you can safely upgrade to 35. The latest version available is Nextcloud35. Please note that Nextcloud doesn't support upgrades across multiple major versions (i.e. an upgrade from 16 is possible to 17, but not 16 to 18). The package can be upgraded by explicitly declaring the service-option `services.nextcloud.package`.
1m 21s
setup: don't know how to build these paths: /nix/store/3678dhp0hxxa0abmdn78sraw80jzprbj-nixos-system-phi-nixos-26.11.20260922.b6c98e9.drv warning: ignoring th …
setup:
don't know how to build these paths:
  /nix/store/3678dhp0hxxa0abmdn78sraw80jzprbj-nixos-system-phi-nixos-26.11.20260922.b6c98e9.drv
warning: ignoring the client-specified setting 'store', because it is a restricted setting and you are not a trusted user
error: gRPC QueryValidPaths on 'nix-store.geninf.io:50051' failed: error: unable to download 'https://cache.clan.lol/qclzr1by99i9qb95ijr6ny54kpil1jdx.narinfo': HTTP error 503

              response body:

              <?xml version="1.0" encoding="UTF-8" standalone="yes"?>
              <Error>
                  <Code>SlowDown</Code>
                  <Message>Your account has made too many requests; try again later.</Message>
              </Error>
failed checks.aarch64-darwin."home-manager-enzime@hyperion-macos" 1m 11s
setup: don't know how to build these paths: /nix/store/nl742sayyk4v35lk80zysmwf7qzmgws8-home-manager-generation.drv warning: ignoring the client-specified set …
setup:
don't know how to build these paths:
  /nix/store/nl742sayyk4v35lk80zysmwf7qzmgws8-home-manager-generation.drv
warning: ignoring the client-specified setting 'store', because it is a restricted setting and you are not a trusted user
error: gRPC QueryValidPaths on 'nix-store.geninf.io:50051' failed: error: unable to download 'https://cache.clan.lol/lmyvsqwkqw37yy7k4fjgk9qlszw40b5q.narinfo': HTTP error 503

              response body:

              <?xml version="1.0" encoding="UTF-8" standalone="yes"?>
              <Error>
                  <Code>SlowDown</Code>
                  <Message>Your account has made too many requests; try again later.</Message>
              </Error>
failed checks.aarch64-darwin.nix-darwin-hyperion-macos 1m 38s
setup: don't know how to build these paths: /nix/store/440qd3s1h5n2pr3y5k18glsbhgx5qnsn-darwin-system-26.11.4cff07d.drv warning: ignoring the client-specified …
setup:
don't know how to build these paths:
  /nix/store/440qd3s1h5n2pr3y5k18glsbhgx5qnsn-darwin-system-26.11.4cff07d.drv
warning: ignoring the client-specified setting 'store', because it is a restricted setting and you are not a trusted user
error: gRPC QueryValidPaths on 'nix-store.geninf.io:50051' failed: error: unable to download 'https://cache.clan.lol/0ybv89kscisqvnfjp413nmj56xr49qi1.narinfo': HTTP error 503

              response body:

              <?xml version="1.0" encoding="UTF-8" standalone="yes"?>
              <Error>
                  <Code>SlowDown</Code>
                  <Message>Your account has made too many requests; try again later.</Message>
              </Error>
failed checks.aarch64-darwin.package-phi-nixos-vm 7m 13s
setup: don't know how to build these paths: /nix/store/4b8x0ipgcjfqn1qccsa3vgsswqjixpa9-run-phi-nixos-vm-on-aarch64-darwin.drv warning: ignoring the client-sp …
setup:
don't know how to build these paths:
  /nix/store/4b8x0ipgcjfqn1qccsa3vgsswqjixpa9-run-phi-nixos-vm-on-aarch64-darwin.drv
warning: ignoring the client-specified setting 'store', because it is a restricted setting and you are not a trusted user
error: gRPC QueryValidPaths on 'nix-store.geninf.io:50051' failed: error: substituter 'https://cache.clan.lol' is disabled
failed checks.aarch64-darwin.treefmt 4m 12s
setup: don't know how to build these paths: /nix/store/gqx8jbh7yw94a91d81gsjk68hw907f7m-treefmt-check.drv warning: ignoring the client-specified setting 'stor …
setup:
don't know how to build these paths:
  /nix/store/gqx8jbh7yw94a91d81gsjk68hw907f7m-treefmt-check.drv
warning: ignoring the client-specified setting 'store', because it is a restricted setting and you are not a trusted user
error: gRPC QueryValidPaths on 'nix-store.geninf.io:50051' failed: error: unable to download 'https://cache.clan.lol/b1km4dhaq9fhkw2p0cgqzjf81fdwpg2y.narinfo': HTTP error 503

              response body:

              <?xml version="1.0" encoding="UTF-8" standalone="yes"?>
              <Error>
                  <Code>SlowDown</Code>
                  <Message>Your account has made too many requests; try again later.</Message>
              </Error>
failed checks.x86_64-linux."home-manager-enzime@gaia" 51s
setup: don't know how to build these paths: /nix/store/16s2a7vljl5x307agja3m1ln4skxzyd4-home-manager-generation.drv warning: ignoring the client-specified set …
setup:
don't know how to build these paths:
  /nix/store/16s2a7vljl5x307agja3m1ln4skxzyd4-home-manager-generation.drv
warning: ignoring the client-specified setting 'store', because it is a restricted setting and you are not a trusted user
error: gRPC QueryValidPaths on 'nix-store.geninf.io:50051' failed: error: unable to download 'https://cache.clan.lol/pi6w7xjb3mysj2q3i36kp4wxl4f52n60.narinfo': HTTP error 503

              response body:

              <?xml version="1.0" encoding="UTF-8" standalone="yes"?>
              <Error>
                  <Code>SlowDown</Code>
                  <Message>Your account has made too many requests; try again later.</Message>
              </Error>
failed checks.x86_64-linux."home-manager-enzime@phi-nixos" 9m 54s
setup: don't know how to build these paths: /nix/store/khlh9k4scldl35qjv4pkx0vf55xv0msi-home-manager-generation.drv warning: ignoring the client-specified set …
setup:
don't know how to build these paths:
  /nix/store/khlh9k4scldl35qjv4pkx0vf55xv0msi-home-manager-generation.drv
warning: ignoring the client-specified setting 'store', because it is a restricted setting and you are not a trusted user
error: gRPC QueryValidPaths on 'nix-store.geninf.io:50051' failed: error: unable to download 'https://cache.geninf.io/6fx9hd8irlvawpm2l2hxgzadya6lp4xs.narinfo': HTTP error 503

              response body:

              <?xml version="1.0" encoding="UTF-8" standalone="yes"?>
              <Error>
                  <Code>SlowDown</Code>
                  <Message>Your account has made too many requests; try again later.</Message>
              </Error>
failed checks.x86_64-linux."home-manager-enzime@sigma" 21s
setup: don't know how to build these paths: /nix/store/y3sfhqfjcgjmngyk26ksylnixyybdv18-home-manager-generation.drv warning: ignoring the client-specified set …
setup:
don't know how to build these paths:
  /nix/store/y3sfhqfjcgjmngyk26ksylnixyybdv18-home-manager-generation.drv
warning: ignoring the client-specified setting 'store', because it is a restricted setting and you are not a trusted user
error: gRPC QueryValidPaths on 'nix-store.geninf.io:50051' failed: error: unable to download 'https://cache.clan.lol/69nhhlp1px4gi89v5v87i3c7c6j8lpnr.narinfo': HTTP error 503

              response body:

              <?xml version="1.0" encoding="UTF-8" standalone="yes"?>
              <Error>
                  <Code>SlowDown</Code>
                  <Message>Your account has made too many requests; try again later.</Message>
              </Error>
failed checks.x86_64-linux.nixos-gaia 27s
setup: don't know how to build these paths: /nix/store/5aycbvrwybnjli8b2chfyi7arq3lx4nn-nixos-system-gaia-26.11.20260922.b6c98e9.drv warning: ignoring the cli …
setup:
don't know how to build these paths:
  /nix/store/5aycbvrwybnjli8b2chfyi7arq3lx4nn-nixos-system-gaia-26.11.20260922.b6c98e9.drv
warning: ignoring the client-specified setting 'store', because it is a restricted setting and you are not a trusted user
error: gRPC QueryValidPaths on 'nix-store.geninf.io:50051' failed: error: unable to download 'https://cache.clan.lol/q4bz01ram3a880bj3yjqqifx5np11cxf.narinfo': HTTP error 503

              response body:

              <?xml version="1.0" encoding="UTF-8" standalone="yes"?>
              <Error>
                  <Code>SlowDown</Code>
                  <Message>Your account has made too many requests; try again later.</Message>
              </Error>
failed checks.x86_64-linux.nixos-sigma 42s
setup: don't know how to build these paths: /nix/store/8jgbs2ckpkwn612dlgxhvl1gl28q6ds6-nixos-system-sigma-26.11.20260922.b6c98e9.drv warning: ignoring the cl …
setup:
don't know how to build these paths:
  /nix/store/8jgbs2ckpkwn612dlgxhvl1gl28q6ds6-nixos-system-sigma-26.11.20260922.b6c98e9.drv
warning: ignoring the client-specified setting 'store', because it is a restricted setting and you are not a trusted user
error: gRPC QueryValidPaths on 'nix-store.geninf.io:50051' failed: error: unable to download 'https://cache.clan.lol/7jk50l60d66wdbhqw8w6paz5vb954b0w.narinfo': HTTP error 503

              response body:

              <?xml version="1.0" encoding="UTF-8" standalone="yes"?>
              <Error>
                  <Code>SlowDown</Code>
                  <Message>Your account has made too many requests; try again later.</Message>
              </Error>
failed checks.x86_64-linux.treefmt 5m 55s
setup: /nix/store/53hiqdn04j54kn0gjmcwivg026rk8spq-treefmt-check.drv these 3 paths will be fetched (0.0 KiB download, 12.9 MiB unpacked): /nix/store/znvkn5y …
setup:
  /nix/store/53hiqdn04j54kn0gjmcwivg026rk8spq-treefmt-check.drv
these 3 paths will be fetched (0.0 KiB download, 12.9 MiB unpacked):
  /nix/store/znvkn5yky0cq9npv4xnii8dlq400lkr1-git-lfs-3.7.1
  /nix/store/37048jgy1gfkx8kafik6gk1w2yslki72-nil
  /nix/store/8jmv4kv9wmhamjxa91sfmfcn3plli21a-treefmt.toml
warning: ignoring the client-specified setting 'store', because it is a restricted setting and you are not a trusted user
53hiqdn04j54kn0gjmcwivg026rk8spq-treefmt-check.drv: error: gRPC QueryValidPaths on 'nix-store.geninf.io:50051' failed: error: substituter 'https://cache.clan.lol' is disabled
error: error: gRPC QueryValidPaths on 'nix-store.geninf.io:50051' failed: error: substituter 'https://cache.clan.lol' is disabled
9 succeeded
succeeded attributes
status attribute duration
loading…
39 already built
skipped attributes
status attribute duration
loading…