nixbot

builds

Enzime/hyperconfig build #935 failed

branch next · PR #1028 · commit 1a94b1f769 · · took 17m 20s · eval 2m 7s

eval warnings 4 kinds · 645 occurrences
  • error unable to download 'https://cache.clan.lol/…': HTTP error 503 ×18
  • warn unable to download 'https://cache.clan.lol/…': HTTP error 503 ×590
  • warn unable to download 'https://cache.geninf.io/…': HTTP error 503 ×35
  • warn A legacy Nextcloud install (from before NixOS 26.11) may be installed. ×2

12 failed ⚠ 1
failed attributes
status attribute duration
failed checks.x86_64-linux.nixos-phi-nixos
  • A legacy Nextcloud install (from before NixOS 26.11) may be installed. After nextcloud33 is installed successfully, you can safely upgrade to 34. The latest version available is Nextcloud35. Please note that Nextcloud doesn't support upgrades across multiple major versions (i.e. an upgrade from 16 is possible to 17, but not 16 to 18). The package can be upgraded by explicitly declaring the service-option `services.nextcloud.package`.
  • A legacy Nextcloud install (from before NixOS 26.11) may be installed. After nextcloud34 is installed successfully, you can safely upgrade to 35. The latest version available is Nextcloud35. Please note that Nextcloud doesn't support upgrades across multiple major versions (i.e. an upgrade from 16 is possible to 17, but not 16 to 18). The package can be upgraded by explicitly declaring the service-option `services.nextcloud.package`.
3m 42s
setup: don't know how to build these paths: /nix/store/6b0da82agj9b9ywmbc8jiw6x77m96m53-nixos-system-phi-nixos-26.11.20260922.b6c98e9.drv warning: ignoring th …
setup:
don't know how to build these paths:
  /nix/store/6b0da82agj9b9ywmbc8jiw6x77m96m53-nixos-system-phi-nixos-26.11.20260922.b6c98e9.drv
warning: ignoring the client-specified setting 'store', because it is a restricted setting and you are not a trusted user
error: gRPC QueryValidPaths on 'nix-store.geninf.io:50051' failed: error: unable to download 'https://cache.clan.lol/pldgr4kyn8qhd73h7q6f5dajj2dh09z9.narinfo': HTTP error 503

              response body:

              <?xml version="1.0" encoding="UTF-8" standalone="yes"?>
              <Error>
                  <Code>SlowDown</Code>
                  <Message>Your account has made too many requests; try again later.</Message>
              </Error>
failed checks.aarch64-darwin.devShell-default 1m 54s
setup: pinr3l657n79gdarsjlfj484bmmk8pq9-nix-shell.drv: build04: build04: input not substitutable: error: some references of path '/nix/store/6hbxwipydk9zksdlryw …
setup:
pinr3l657n79gdarsjlfj484bmmk8pq9-nix-shell.drv: build04: build04: input not substitutable: error: some references of path '/nix/store/6hbxwipydk9zksdlrywzi6n2y7m5qzam-opentofu-1.12.6' could not be realised, asking the scheduler again
pinr3l657n79gdarsjlfj484bmmk8pq9-nix-shell.drv: build04: build04: input not substitutable: error: some references of path '/nix/store/6hbxwipydk9zksdlrywzi6n2y7m5qzam-opentofu-1.12.6' could not be realised, asking the scheduler again
pinr3l657n79gdarsjlfj484bmmk8pq9-nix-shell.drv: build04: build04: input not substitutable: error: some references of path '/nix/store/6hbxwipydk9zksdlrywzi6n2y7m5qzam-opentofu-1.12.6' could not be realised, asking the scheduler again
pinr3l657n79gdarsjlfj484bmmk8pq9-nix-shell.drv: build04: build04: input not substitutable: error: some references of path '/nix/store/6hbxwipydk9zksdlrywzi6n2y7m5qzam-opentofu-1.12.6' could not be realised, asking the scheduler again
pinr3l657n79gdarsjlfj484bmmk8pq9-nix-shell.drv: build04: build04: input not substitutable: error: some references of path '/nix/store/6hbxwipydk9zksdlrywzi6n2y7m5qzam-opentofu-1.12.6' could not be realised, asking the scheduler again
pinr3l657n79gdarsjlfj484bmmk8pq9-nix-shell.drv: build04: build04: input not substitutable: error: some references of path '/nix/store/6hbxwipydk9zksdlrywzi6n2y7m5qzam-opentofu-1.12.6' could not be realised, asking the scheduler again
pinr3l657n79gdarsjlfj484bmmk8pq9-nix-shell.drv: build04: build04: input not substitutable: error: some references of path '/nix/store/6hbxwipydk9zksdlrywzi6n2y7m5qzam-opentofu-1.12.6' could not be realised, asking the scheduler again
error: gave up after 9 reschedules
failed checks.aarch64-darwin."home-manager-enzime@hyperion-macos" 30s
setup: don't know how to build these paths: /nix/store/9a7lsd3c8smclv2arl6661phjh24w13m-home-manager-generation.drv warning: ignoring the client-specified set …
setup:
don't know how to build these paths:
  /nix/store/9a7lsd3c8smclv2arl6661phjh24w13m-home-manager-generation.drv
warning: ignoring the client-specified setting 'store', because it is a restricted setting and you are not a trusted user
error: gRPC QueryValidPaths on 'nix-store.geninf.io:50051' failed: error: unable to download 'https://cache.geninf.io/gv1vhhivj75x21mxhwhb381bcy0089l9.narinfo': HTTP error 503

              response body:

              <?xml version="1.0" encoding="UTF-8" standalone="yes"?>
              <Error>
                  <Code>SlowDown</Code>
                  <Message>Your account has made too many requests; try again later.</Message>
              </Error>
failed checks.aarch64-darwin.nix-darwin-hyperion-macos 50s
setup: don't know how to build these paths: /nix/store/i4r2bdrnydrb22x5qnbn4w7bd0rqwbvk-darwin-system-26.11.4cff07d.drv warning: ignoring the client-specified …
setup:
don't know how to build these paths:
  /nix/store/i4r2bdrnydrb22x5qnbn4w7bd0rqwbvk-darwin-system-26.11.4cff07d.drv
warning: ignoring the client-specified setting 'store', because it is a restricted setting and you are not a trusted user
error: gRPC QueryValidPaths on 'nix-store.geninf.io:50051' failed: error: unable to download 'https://cache.clan.lol/rccygprk862fw018fah2zgihfvrdrijm.narinfo': HTTP error 503

              response body:

              <?xml version="1.0" encoding="UTF-8" standalone="yes"?>
              <Error>
                  <Code>SlowDown</Code>
                  <Message>Your account has made too many requests; try again later.</Message>
              </Error>
failed checks.aarch64-linux.devShell-default 5m 0s
setup: don't know how to build these paths: /nix/store/f6xnn5zx4kbqd8gx87cxlm08pr62jgnj-nix-shell.drv warning: ignoring the client-specified setting 'store', …
setup:
don't know how to build these paths:
  /nix/store/f6xnn5zx4kbqd8gx87cxlm08pr62jgnj-nix-shell.drv
warning: ignoring the client-specified setting 'store', because it is a restricted setting and you are not a trusted user
pc9qczwy8skxncr7m52d5d5wc5plmdg9-clan-cli.drv: error: gRPC QueryValidPaths on 'nix-store.geninf.io:50051' failed: error: substituter 'https://cache.clan.lol' is disabled
l6pafia2xx8jjk1wqmmwqym4kag8q9is-opentofu-1.12.6.drv: error: gRPC QueryValidPaths on 'nix-store.geninf.io:50051' failed: error: substituter 'https://cache.clan.lol' is disabled
error: dependency 'pc9qczwy8skxncr7m52d5d5wc5plmdg9-clan-cli.drv' failed
failed checks.aarch64-linux.package-phi-nixos-vm 4m 59s
setup: don't know how to build these paths: /nix/store/vik77zsk1q8q3rdj39gzdi7j18x25bbq-run-phi-nixos-vm-on-aarch64-linux.drv warning: ignoring the client-spe …
setup:
don't know how to build these paths:
  /nix/store/vik77zsk1q8q3rdj39gzdi7j18x25bbq-run-phi-nixos-vm-on-aarch64-linux.drv
warning: ignoring the client-specified setting 'store', because it is a restricted setting and you are not a trusted user
vik77zsk1q8q3rdj39gzdi7j18x25bbq-run-phi-nixos-vm-on-aarch64-linux.drv: error: gRPC QueryValidPaths on 'nix-store.geninf.io:50051' failed: error: substituter 'https://cache.clan.lol' is disabled
error: error: gRPC QueryValidPaths on 'nix-store.geninf.io:50051' failed: error: substituter 'https://cache.clan.lol' is disabled
failed checks.x86_64-linux.devShell-default 37s
setup: don't know how to build these paths: /nix/store/rna3hfdzqdv2l8mppsbclhd2y1s18sjb-nix-shell.drv warning: ignoring the client-specified setting 'store', …
setup:
don't know how to build these paths:
  /nix/store/rna3hfdzqdv2l8mppsbclhd2y1s18sjb-nix-shell.drv
warning: ignoring the client-specified setting 'store', because it is a restricted setting and you are not a trusted user
error: gRPC QueryValidPaths on 'nix-store.geninf.io:50051' failed: error: unable to download 'https://cache.clan.lol/pndwbsqiyknpvfxkr2z58z8d0m1v9zjn.narinfo': HTTP error 503

              response body:

              <?xml version="1.0" encoding="UTF-8" standalone="yes"?>
              <Error>
                  <Code>SlowDown</Code>
                  <Message>Your account has made too many requests; try again later.</Message>
              </Error>
failed checks.x86_64-linux."home-manager-enzime@gaia" 1m 19s
setup: don't know how to build these paths: /nix/store/066v1i3baacl75vlzhdi732gcxgwx62v-home-manager-generation.drv warning: ignoring the client-specified set …
setup:
don't know how to build these paths:
  /nix/store/066v1i3baacl75vlzhdi732gcxgwx62v-home-manager-generation.drv
warning: ignoring the client-specified setting 'store', because it is a restricted setting and you are not a trusted user
error: gRPC QueryValidPaths on 'nix-store.geninf.io:50051' failed: error: unable to download 'https://cache.geninf.io/9wybp15has33jpia24lmvalhbbswmhf7.narinfo': HTTP error 503

              response body:

              <?xml version="1.0" encoding="UTF-8" standalone="yes"?>
              <Error>
                  <Code>SlowDown</Code>
                  <Message>Your account has made too many requests; try again later.</Message>
              </Error>
failed checks.x86_64-linux."home-manager-enzime@phi-nixos" 2m 18s
setup: don't know how to build these paths: /nix/store/ahkhy686fg4baiy2xi5baqjfdnnk9j1i-home-manager-generation.drv warning: ignoring the client-specified set …
setup:
don't know how to build these paths:
  /nix/store/ahkhy686fg4baiy2xi5baqjfdnnk9j1i-home-manager-generation.drv
warning: ignoring the client-specified setting 'store', because it is a restricted setting and you are not a trusted user
error: gRPC QueryValidPaths on 'nix-store.geninf.io:50051' failed: error: unable to download 'https://cache.geninf.io/vya76kssqxypark6mf62snf8hff5gsmn.narinfo': HTTP error 503

              response body:

              <?xml version="1.0" encoding="UTF-8" standalone="yes"?>
              <Error>
                  <Code>SlowDown</Code>
                  <Message>Your account has made too many requests; try again later.</Message>
              </Error>
failed checks.x86_64-linux."home-manager-enzime@sigma" 12m 55s
setup: /nix/store/yzrss1pc91v3vsh4yis2c8prb24rxm3y-hm-firefox-extensions.drv these 4 paths will be fetched (0.0 KiB download, 2.4 MiB unpacked): /nix/store/ …
setup:
  /nix/store/yzrss1pc91v3vsh4yis2c8prb24rxm3y-hm-firefox-extensions.drv
these 4 paths will be fetched (0.0 KiB download, 2.4 MiB unpacked):
  /nix/store/4cj18ri8yyjbiragdkxm0q3y6bqr0dqs-lndir-1.0.5
  /nix/store/xv8nd43y9zw4vcnilxbagv6zmghfnxjk-nixos-render-docs-0.0
  /nix/store/hx1j4ilpbfjmmv31w0f20agk0asjcjjz-python3.14-markdown-it-py-4.2.0
  /nix/store/ym89dm8b2bpspsk8l22b10fvnpm3h8w9-python3.14-mdit-py-plugins-0.6.1
warning: ignoring the client-specified setting 'store', because it is a restricted setting and you are not a trusted user
error: gRPC QueryValidPaths on 'nix-store.geninf.io:50051' failed: error: unable to download 'https://cache.clan.lol/gli505p560dj1nx9lj2gz0znrdpzmyd1.narinfo': HTTP error 503

              response body:

              <?xml version="1.0" encoding="UTF-8" standalone="yes"?>
              <Error>
                  <Code>SlowDown</Code>
                  <Message>Your account has made too many requests; try again later.</Message>
              </Error>
failed checks.x86_64-linux.nixos-gaia 1m 7s
setup: don't know how to build these paths: /nix/store/mv0vah6g9n4qjgvag7ccqb6mphnw2g4s-nixos-system-gaia-26.11.20260922.b6c98e9.drv warning: ignoring the cli …
setup:
don't know how to build these paths:
  /nix/store/mv0vah6g9n4qjgvag7ccqb6mphnw2g4s-nixos-system-gaia-26.11.20260922.b6c98e9.drv
warning: ignoring the client-specified setting 'store', because it is a restricted setting and you are not a trusted user
error: gRPC QueryValidPaths on 'nix-store.geninf.io:50051' failed: error: unable to download 'https://cache.clan.lol/ggvvjazhm043a5zir797z6ak28dlck5g.narinfo': HTTP error 503

              response body:

              <?xml version="1.0" encoding="UTF-8" standalone="yes"?>
              <Error>
                  <Code>SlowDown</Code>
                  <Message>Your account has made too many requests; try again later.</Message>
              </Error>
failed checks.x86_64-linux.nixos-sigma 15m 11s
setup: /nix/store/84sggxlzw0adckmzzysvrajmmdl5p6qq-libcap-text-verifier-0-unstable /nix/store/4cj18ri8yyjbiragdkxm0q3y6bqr0dqs-lndir-1.0.5 /nix/store/xv8n …
setup:
  /nix/store/84sggxlzw0adckmzzysvrajmmdl5p6qq-libcap-text-verifier-0-unstable
  /nix/store/4cj18ri8yyjbiragdkxm0q3y6bqr0dqs-lndir-1.0.5
  /nix/store/xv8nd43y9zw4vcnilxbagv6zmghfnxjk-nixos-render-docs-0.0
  /nix/store/hx1j4ilpbfjmmv31w0f20agk0asjcjjz-python3.14-markdown-it-py-4.2.0
  /nix/store/ym89dm8b2bpspsk8l22b10fvnpm3h8w9-python3.14-mdit-py-plugins-0.6.1
  /nix/store/azjnwg3za27ccl8czdfsfz83x7gharz2-xkb-validated
warning: ignoring the client-specified setting 'store', because it is a restricted setting and you are not a trusted user
error: gRPC QueryValidPaths on 'nix-store.geninf.io:50051' failed: error: unable to download 'https://cache.geninf.io/ay4iwjn1vlfvr452gq0jf7a0a9fcqzag.narinfo': HTTP error 503

              response body:

              <?xml version="1.0" encoding="UTF-8" standalone="yes"?>
              <Error>
                  <Code>SlowDown</Code>
                  <Message>Your account has made too many requests; try again later.</Message>
              </Error>
11 succeeded
succeeded attributes
status attribute duration
loading…
36 already built
skipped attributes
status attribute duration
loading…