nixbot

builds

Enzime/hyperconfig build #938 failed

branch next · PR #1031 · commit 85ba56cbe3 · · took 15m 25s · eval 1m 28s

eval warnings 4 kinds · 53 occurrences
  • error unable to download 'https://cache.clan.lol/…': HTTP error 503 ×5
  • warn unable to download 'https://cache.clan.lol/…': HTTP error 503 ×35
  • warn A legacy Nextcloud install (from before NixOS 26.11) may be installed. ×2
  • warn unable to download 'https://cache.geninf.io/…': HTTP error 503 ×11

20 failed ⚠ 1
failed attributes
status attribute duration
failed checks.x86_64-linux.nixos-phi-nixos
  • A legacy Nextcloud install (from before NixOS 26.11) may be installed. After nextcloud33 is installed successfully, you can safely upgrade to 34. The latest version available is Nextcloud35. Please note that Nextcloud doesn't support upgrades across multiple major versions (i.e. an upgrade from 16 is possible to 17, but not 16 to 18). The package can be upgraded by explicitly declaring the service-option `services.nextcloud.package`.
  • A legacy Nextcloud install (from before NixOS 26.11) may be installed. After nextcloud34 is installed successfully, you can safely upgrade to 35. The latest version available is Nextcloud35. Please note that Nextcloud doesn't support upgrades across multiple major versions (i.e. an upgrade from 16 is possible to 17, but not 16 to 18). The package can be upgraded by explicitly declaring the service-option `services.nextcloud.package`.
1m 24s
setup: don't know how to build these paths: /nix/store/zqwxip2kp1xz6xfca57y91wh206wnwji-nixos-system-phi-nixos-26.11.20260923.8825beb.drv warning: ignoring th …
setup:
don't know how to build these paths:
  /nix/store/zqwxip2kp1xz6xfca57y91wh206wnwji-nixos-system-phi-nixos-26.11.20260923.8825beb.drv
warning: ignoring the client-specified setting 'store', because it is a restricted setting and you are not a trusted user
error: gRPC QueryValidPaths on 'nix-store.geninf.io:50051' failed: error: unable to download 'https://cache.clan.lol/3njgjnw59a5wik97r6fd9rn30cvcmf9j.narinfo': HTTP error 503

              response body:

              <?xml version="1.0" encoding="UTF-8" standalone="yes"?>
              <Error>
                  <Code>SlowDown</Code>
                  <Message>Your account has made too many requests; try again later.</Message>
              </Error>
failed checks.aarch64-darwin.devShell-default 3m 41s
setup: 46646v01n3bwj1b44nmc68pazf9lmh0z-nix-shell.drv: build04: build04: input not substitutable: error: some references of path '/nix/store/6hbxwipydk9zksdlryw …
setup:
46646v01n3bwj1b44nmc68pazf9lmh0z-nix-shell.drv: build04: build04: input not substitutable: error: some references of path '/nix/store/6hbxwipydk9zksdlrywzi6n2y7m5qzam-opentofu-1.12.6' could not be realised, asking the scheduler again
46646v01n3bwj1b44nmc68pazf9lmh0z-nix-shell.drv: build04: build04: input not substitutable: error: some references of path '/nix/store/6hbxwipydk9zksdlrywzi6n2y7m5qzam-opentofu-1.12.6' could not be realised, asking the scheduler again
46646v01n3bwj1b44nmc68pazf9lmh0z-nix-shell.drv: build04: build04: input not substitutable: error: some references of path '/nix/store/6hbxwipydk9zksdlrywzi6n2y7m5qzam-opentofu-1.12.6' could not be realised, asking the scheduler again
46646v01n3bwj1b44nmc68pazf9lmh0z-nix-shell.drv: build04: build04: input not substitutable: error: some references of path '/nix/store/6hbxwipydk9zksdlrywzi6n2y7m5qzam-opentofu-1.12.6' could not be realised, asking the scheduler again
46646v01n3bwj1b44nmc68pazf9lmh0z-nix-shell.drv: build04: build04: input not substitutable: error: some references of path '/nix/store/6hbxwipydk9zksdlrywzi6n2y7m5qzam-opentofu-1.12.6' could not be realised, asking the scheduler again
46646v01n3bwj1b44nmc68pazf9lmh0z-nix-shell.drv: build04: build04: input not substitutable: error: some references of path '/nix/store/6hbxwipydk9zksdlrywzi6n2y7m5qzam-opentofu-1.12.6' could not be realised, asking the scheduler again
46646v01n3bwj1b44nmc68pazf9lmh0z-nix-shell.drv: build04: build04: input not substitutable: error: some references of path '/nix/store/6hbxwipydk9zksdlrywzi6n2y7m5qzam-opentofu-1.12.6' could not be realised, asking the scheduler again
error: gave up after 9 reschedules
failed checks.aarch64-darwin."home-manager-enzime@hyperion-macos" 21s
setup: don't know how to build these paths: /nix/store/0v41qj1kk9ygpclravf73r9s4x3xwida-home-manager-generation.drv warning: ignoring the client-specified set …
setup:
don't know how to build these paths:
  /nix/store/0v41qj1kk9ygpclravf73r9s4x3xwida-home-manager-generation.drv
warning: ignoring the client-specified setting 'store', because it is a restricted setting and you are not a trusted user
error: gRPC QueryValidPaths on 'nix-store.geninf.io:50051' failed: error: unable to download 'https://cache.geninf.io/immgg9bm0bfr1b7jyi0yq9sqcxxd2x1c.narinfo': HTTP error 503

              response body:

              <?xml version="1.0" encoding="UTF-8" standalone="yes"?>
              <Error>
                  <Code>SlowDown</Code>
                  <Message>Your account has made too many requests; try again later.</Message>
              </Error>
failed checks.aarch64-darwin.nix-darwin-hyperion-macos 13m 40s
setup: /nix/store/0lb9f2g2qnxmhm00gldwd394l8c646wc-wrap-python-hook warning: ignoring the client-specified setting 'store', because it is a restricted setting …
setup:
  /nix/store/0lb9f2g2qnxmhm00gldwd394l8c646wc-wrap-python-hook
warning: ignoring the client-specified setting 'store', because it is a restricted setting and you are not a trusted user
w2cm009npqvf6i2f3x8mpnjx9cqi1s0x-etc-registry.json.drv: error: gRPC AddMultipleToStore on 'nix-store.geninf.io:50051' failed: error: path '/nix/store/rb1gzbjvkqhk48l8y4gym3bm8g81l0m2-source' is required, but there is no substituter that can build it
rclmzvsdi9xwfx12k9chdxhkb1lw2ma8-home-manager-generation.drv: build02: not scheduled here: rclmzvsdi9xwfx12k9chdxhkb1lw2ma8-home-manager-generation.drv, asking the scheduler again
a40ns80lm7x2f0fhp0xsnn6xm5m65xa4-home-manager-fonts.drv: error: gRPC AddMultipleToStore on 'nix-store.geninf.io:50051' failed: error: path '/nix/store/0r3kv2l8hjmshbgkz3jk5gp15rnd3q83-resolve-catalog.ts' is required, but there is no substituter that can build it
yaa6lp3ss08fn0ijm693bcpvmw7x49sb-home-manager-applications.drv: error: gRPC AddMultipleToStore on 'nix-store.geninf.io:50051' failed: error: path '/nix/store/0r3kv2l8hjmshbgkz3jk5gp15rnd3q83-resolve-catalog.ts' is required, but there is no substituter that can build it
wm86dv89g3w6q64s6a822snbw0yyicr6-home-manager-path.drv: error: gRPC AddMultipleToStore on 'nix-store.geninf.io:50051' failed: error: path '/nix/store/0r3kv2l8hjmshbgkz3jk5gp15rnd3q83-resolve-catalog.ts' is required, but there is no substituter that can build it
error: dependency 'ch4cv6j49cqbi5j859px4i8q3r5x8hr2-etc.drv' failed
failed checks.aarch64-darwin.package-gaia-vm 42s
setup: don't know how to build these paths: /nix/store/rdhf80954ain6i9vyylagkwrysd6dijy-run-gaia-vm-on-aarch64-darwin.drv warning: ignoring the client-specifi …
setup:
don't know how to build these paths:
  /nix/store/rdhf80954ain6i9vyylagkwrysd6dijy-run-gaia-vm-on-aarch64-darwin.drv
warning: ignoring the client-specified setting 'store', because it is a restricted setting and you are not a trusted user
error: gRPC QueryValidPaths on 'nix-store.geninf.io:50051' failed: error: substituter 'https://cache.clan.lol' is disabled
failed checks.aarch64-darwin.package-sigma-vm 1m 40s
setup: don't know how to build these paths: /nix/store/grscl0z7rxxk7x7mvd6wb91dvkpb23na-run-sigma-vm-on-aarch64-darwin.drv warning: ignoring the client-specif …
setup:
don't know how to build these paths:
  /nix/store/grscl0z7rxxk7x7mvd6wb91dvkpb23na-run-sigma-vm-on-aarch64-darwin.drv
warning: ignoring the client-specified setting 'store', because it is a restricted setting and you are not a trusted user
error: gRPC QueryValidPaths on 'nix-store.geninf.io:50051' failed: error: substituter 'https://cache.clan.lol' is disabled
failed checks.aarch64-darwin.package-tf-apply 4m 29s
setup: jpdsvg9lwzxxmfdb13gbxdd2grp2vy13-tf-apply.drv: build04: build04: input not substitutable: error: some references of path '/nix/store/6hbxwipydk9zksdlrywz …
setup:
jpdsvg9lwzxxmfdb13gbxdd2grp2vy13-tf-apply.drv: build04: build04: input not substitutable: error: some references of path '/nix/store/6hbxwipydk9zksdlrywzi6n2y7m5qzam-opentofu-1.12.6' could not be realised, asking the scheduler again
jpdsvg9lwzxxmfdb13gbxdd2grp2vy13-tf-apply.drv: build04: build04: input not substitutable: error: some references of path '/nix/store/6hbxwipydk9zksdlrywzi6n2y7m5qzam-opentofu-1.12.6' could not be realised, asking the scheduler again
jpdsvg9lwzxxmfdb13gbxdd2grp2vy13-tf-apply.drv: build04: build04: input not substitutable: error: some references of path '/nix/store/6hbxwipydk9zksdlrywzi6n2y7m5qzam-opentofu-1.12.6' could not be realised, asking the scheduler again
jpdsvg9lwzxxmfdb13gbxdd2grp2vy13-tf-apply.drv: build04: build04: input not substitutable: error: some references of path '/nix/store/6hbxwipydk9zksdlrywzi6n2y7m5qzam-opentofu-1.12.6' could not be realised, asking the scheduler again
jpdsvg9lwzxxmfdb13gbxdd2grp2vy13-tf-apply.drv: build04: build04: input not substitutable: error: some references of path '/nix/store/6hbxwipydk9zksdlrywzi6n2y7m5qzam-opentofu-1.12.6' could not be realised, asking the scheduler again
jpdsvg9lwzxxmfdb13gbxdd2grp2vy13-tf-apply.drv: build04: build04: input not substitutable: error: some references of path '/nix/store/6hbxwipydk9zksdlrywzi6n2y7m5qzam-opentofu-1.12.6' could not be realised, asking the scheduler again
jpdsvg9lwzxxmfdb13gbxdd2grp2vy13-tf-apply.drv: build04: build04: input not substitutable: error: some references of path '/nix/store/6hbxwipydk9zksdlrywzi6n2y7m5qzam-opentofu-1.12.6' could not be realised, asking the scheduler again
error: gave up after 9 reschedules
failed checks.aarch64-darwin.package-tf-destroy 1m 0s
setup: /nix/store/g029045w709ysf1r5myjfxp6a58hzm25-config.tf.json.drv /nix/store/4navhqdagpl2gwpflxl4fr0qf9ln96y0-tf-destroy.drv these 3 paths will be fetch …
setup:
  /nix/store/g029045w709ysf1r5myjfxp6a58hzm25-config.tf.json.drv
  /nix/store/4navhqdagpl2gwpflxl4fr0qf9ln96y0-tf-destroy.drv
these 3 paths will be fetched (0.0 KiB download, 3.9 MiB unpacked):
  /nix/store/y7mnir37xijxx1dwxwpcpv4raslhz0sh-clan-cli
  /nix/store/ysfw5j1z22d9bkh8wxrqwvm07fc97y8m-get-clan-secret
  /nix/store/dxn7ywn0sfildxivxvqvrp39735pcriy-opentofu-external-key-provider
warning: ignoring the client-specified setting 'store', because it is a restricted setting and you are not a trusted user
error: gRPC QueryValidPaths on 'nix-store.geninf.io:50051' failed: error: unable to download 'https://cache.clan.lol/0h8cvp0pdzyprjak6jg6vyymknssg7lg.narinfo': HTTP error 503

              response body:

              <?xml version="1.0" encoding="UTF-8" standalone="yes"?>
              <Error>
                  <Code>SlowDown</Code>
                  <Message>Your account has made too many requests; try again later.</Message>
              </Error>
failed checks.aarch64-darwin.package-tf-init 1m 29s
setup: 8ybw304kl4p839zfsjp5n31g2yrdqq6w-tf-init.drv: build04: build04: input not substitutable: error: some references of path '/nix/store/6hbxwipydk9zksdlrywzi …
setup:
8ybw304kl4p839zfsjp5n31g2yrdqq6w-tf-init.drv: build04: build04: input not substitutable: error: some references of path '/nix/store/6hbxwipydk9zksdlrywzi6n2y7m5qzam-opentofu-1.12.6' could not be realised, asking the scheduler again
8ybw304kl4p839zfsjp5n31g2yrdqq6w-tf-init.drv: build04: build04: input not substitutable: error: some references of path '/nix/store/6hbxwipydk9zksdlrywzi6n2y7m5qzam-opentofu-1.12.6' could not be realised, asking the scheduler again
8ybw304kl4p839zfsjp5n31g2yrdqq6w-tf-init.drv: build04: build04: input not substitutable: error: some references of path '/nix/store/6hbxwipydk9zksdlrywzi6n2y7m5qzam-opentofu-1.12.6' could not be realised, asking the scheduler again
8ybw304kl4p839zfsjp5n31g2yrdqq6w-tf-init.drv: build04: build04: input not substitutable: error: some references of path '/nix/store/6hbxwipydk9zksdlrywzi6n2y7m5qzam-opentofu-1.12.6' could not be realised, asking the scheduler again
8ybw304kl4p839zfsjp5n31g2yrdqq6w-tf-init.drv: build04: build04: input not substitutable: error: some references of path '/nix/store/6hbxwipydk9zksdlrywzi6n2y7m5qzam-opentofu-1.12.6' could not be realised, asking the scheduler again
8ybw304kl4p839zfsjp5n31g2yrdqq6w-tf-init.drv: build04: build04: input not substitutable: error: some references of path '/nix/store/6hbxwipydk9zksdlrywzi6n2y7m5qzam-opentofu-1.12.6' could not be realised, asking the scheduler again
8ybw304kl4p839zfsjp5n31g2yrdqq6w-tf-init.drv: build04: build04: input not substitutable: error: some references of path '/nix/store/6hbxwipydk9zksdlrywzi6n2y7m5qzam-opentofu-1.12.6' could not be realised, asking the scheduler again
error: gave up after 9 reschedules
failed checks.aarch64-linux.treefmt 1m 41s
setup: don't know how to build these paths: /nix/store/l5k1y97mmqjmwqc1db200ihglp36mmh7-treefmt-check.drv warning: ignoring the client-specified setting 'stor …
setup:
don't know how to build these paths:
  /nix/store/l5k1y97mmqjmwqc1db200ihglp36mmh7-treefmt-check.drv
warning: ignoring the client-specified setting 'store', because it is a restricted setting and you are not a trusted user
error: gRPC QueryValidPaths on 'nix-store.geninf.io:50051' failed: error: substituter 'https://cache.clan.lol' is disabled
failed checks.x86_64-linux."home-manager-enzime@gaia" 1m 30s
setup: don't know how to build these paths: /nix/store/028x6zzx30zi2hr8313cschczkpvj1in-home-manager-generation.drv warning: ignoring the client-specified set …
setup:
don't know how to build these paths:
  /nix/store/028x6zzx30zi2hr8313cschczkpvj1in-home-manager-generation.drv
warning: ignoring the client-specified setting 'store', because it is a restricted setting and you are not a trusted user
error: gRPC QueryValidPaths on 'nix-store.geninf.io:50051' failed: error: substituter 'https://cache.clan.lol' is disabled
failed checks.x86_64-linux."home-manager-enzime@phi-nixos" 12m 38s
setup: warning: ignoring the client-specified setting 'store', because it is a restricted setting and you are not a trusted user jad8qc6ymaj2nvn5dlc3qx3ibviiiyq …
setup:
warning: ignoring the client-specified setting 'store', because it is a restricted setting and you are not a trusted user
jad8qc6ymaj2nvn5dlc3qx3ibviiiyqd-sway.conf.drv: gi-build-x86-02: not scheduled here: jad8qc6ymaj2nvn5dlc3qx3ibviiiyqd-sway.conf.drv, asking the scheduler again
fz0d86wrzggmbwgcavjzrpxk9rl10rwz-hm-firefox-extensions.drv: error: gRPC QueryValidPaths on 'nix-store.geninf.io:50051' failed: error: substituter 'https://cache.clan.lol' is disabled
yzrss1pc91v3vsh4yis2c8prb24rxm3y-hm-firefox-extensions.drv: error: gRPC QueryValidPaths on 'nix-store.geninf.io:50051' failed: error: substituter 'https://cache.clan.lol' is disabled
bdrl2884z0drsmn4bgnzx76268rrm771-home-manager-path.drv: gi-build-x86-02: not scheduled here: bdrl2884z0drsmn4bgnzx76268rrm771-home-manager-path.drv, asking the scheduler again
bdrl2884z0drsmn4bgnzx76268rrm771-home-manager-path.drv: build-x86-01: not scheduled here: bdrl2884z0drsmn4bgnzx76268rrm771-home-manager-path.drv, asking the scheduler again
bdrl2884z0drsmn4bgnzx76268rrm771-home-manager-path.drv: gi-build-x86-02: not scheduled here: bdrl2884z0drsmn4bgnzx76268rrm771-home-manager-path.drv, asking the scheduler again
error: dependency 'j3a4x34s3s08kd04hahb4i6c8a6nwq67-home-manager-files.drv' failed
failed checks.x86_64-linux."home-manager-enzime@sigma" 13m 56s
setup: /nix/store/n7m5c4p3v2r1i2c48as1hf6jkx09svg4-home-manager-files.drv /nix/store/yzrss1pc91v3vsh4yis2c8prb24rxm3y-hm-firefox-extensions.drv these 3 path …
setup:
  /nix/store/n7m5c4p3v2r1i2c48as1hf6jkx09svg4-home-manager-files.drv
  /nix/store/yzrss1pc91v3vsh4yis2c8prb24rxm3y-hm-firefox-extensions.drv
these 3 paths will be fetched (0.0 KiB download, 6.0 MiB unpacked):
  /nix/store/vgijkb3wb5wsihhrrgcfylc632j6ypl6-hm_hmfontconfigfonts.xml
  /nix/store/bxff73h2pnhx9f7i2myzlzi27famijgq-home-configuration-reference-manpage
  /nix/store/vhh50hbcqb66cc4xnjvxlhf1n8qza4qb-home-manager-path
warning: ignoring the client-specified setting 'store', because it is a restricted setting and you are not a trusted user
error: gRPC QueryValidPaths on 'nix-store.geninf.io:50051' failed: error: unable to download 'https://cache.clan.lol/2kd1irci8q9q68d5kbc8xp6v0l1zb5l9.narinfo': HTTP error 503

              response body:

              <?xml version="1.0" encoding="UTF-8" standalone="yes"?>
              <Error>
                  <Code>SlowDown</Code>
                  <Message>Your account has made too many requests; try again later.</Message>
              </Error>
failed checks.x86_64-linux.nixos-gaia 12m 12s
setup: a4d91jrqynx54dgm2fqrv9dsslkj2hwi-unit-hoopsnake.service.drv: error: gRPC QueryValidPaths on 'nix-store.geninf.io:50051' failed: error: substituter 'https …
setup:
a4d91jrqynx54dgm2fqrv9dsslkj2hwi-unit-hoopsnake.service.drv: error: gRPC QueryValidPaths on 'nix-store.geninf.io:50051' failed: error: substituter 'https://cache.clan.lol' is disabled
ghhdizxa1bvd2cs4p1vfrpcf0n5xhk5z-unit-acme-setup.service.drv: build-x86-01: not scheduled here: ghhdizxa1bvd2cs4p1vfrpcf0n5xhk5z-unit-acme-setup.service.drv, asking the scheduler again
dgdq26f4242qdjj0zr2bq1gxq8lz27v2-unit-matrix-synapse.service.drv: build-x86-01: not scheduled here: dgdq26f4242qdjj0zr2bq1gxq8lz27v2-unit-matrix-synapse.service.drv, asking the scheduler again
mq1isgxyj0n5r41ikcrjzzg65ny7bclp-home-manager-files.drv: build-x86-01: not scheduled here: mq1isgxyj0n5r41ikcrjzzg65ny7bclp-home-manager-files.drv, asking the scheduler again
lf3vp4i3qmdf6ll1fpvhmiy8whnvfcj5-system-path.drv: build-x86-01: not scheduled here: lf3vp4i3qmdf6ll1fpvhmiy8whnvfcj5-system-path.drv, asking the scheduler again
ghhdizxa1bvd2cs4p1vfrpcf0n5xhk5z-unit-acme-setup.service.drv: gi-build-x86-02: not scheduled here: ghhdizxa1bvd2cs4p1vfrpcf0n5xhk5z-unit-acme-setup.service.drv, asking the scheduler again
dgdq26f4242qdjj0zr2bq1gxq8lz27v2-unit-matrix-synapse.service.drv: gi-build-x86-02: not scheduled here: dgdq26f4242qdjj0zr2bq1gxq8lz27v2-unit-matrix-synapse.service.drv, asking the scheduler again
error: dependency '7x4q61b2533gk74w5pl68kzrl108a7di-initrd-linux-6.18.53.drv' failed
failed checks.x86_64-linux.nixos-sigma 9m 3s
setup: /nix/store/4cahraqqkmfws6i3l5kwpayn0i0i12s5-python3.14-installer-1.0.1 /nix/store/hx1j4ilpbfjmmv31w0f20agk0asjcjjz-python3.14-markdown-it-py-4.2.0 …
setup:
  /nix/store/4cahraqqkmfws6i3l5kwpayn0i0i12s5-python3.14-installer-1.0.1
  /nix/store/hx1j4ilpbfjmmv31w0f20agk0asjcjjz-python3.14-markdown-it-py-4.2.0
  /nix/store/ym89dm8b2bpspsk8l22b10fvnpm3h8w9-python3.14-mdit-py-plugins-0.6.1
  /nix/store/khhd398h6fy0alc7fjfyqssd1bz58xr1-python3.14-pyproject-hooks-1.2.0
  /nix/store/bnm3ppcxy786lcfq6lqni25mi9svpj32-wrap-python-hook
  /nix/store/azjnwg3za27ccl8czdfsfz83x7gharz2-xkb-validated
warning: ignoring the client-specified setting 'store', because it is a restricted setting and you are not a trusted user
error: gRPC QueryValidPaths on 'nix-store.geninf.io:50051' failed: error: unable to download 'https://cache.clan.lol/12ghgkdfvnndk5anl49vrxkhbyx1248l.narinfo': HTTP error 503

              response body:

              <?xml version="1.0" encoding="UTF-8" standalone="yes"?>
              <Error>
                  <Code>SlowDown</Code>
                  <Message>Your account has made too many requests; try again later.</Message>
              </Error>
failed checks.x86_64-linux.package-provide-tf-passphrase 1m 6s
setup: don't know how to build these paths: /nix/store/gnsqxczkfgiz0fkl01wclvp4gl7fjaff-opentofu-external-key-provider.drv warning: ignoring the client-specif …
setup:
don't know how to build these paths:
  /nix/store/gnsqxczkfgiz0fkl01wclvp4gl7fjaff-opentofu-external-key-provider.drv
warning: ignoring the client-specified setting 'store', because it is a restricted setting and you are not a trusted user
error: gRPC QueryValidPaths on 'nix-store.geninf.io:50051' failed: error: substituter 'https://cache.clan.lol' is disabled
dependency failed checks.x86_64-linux.package-tf-apply —
dependency failed checks.x86_64-linux.package-tf-destroy —
dependency failed checks.x86_64-linux.package-tf-init —
failed checks.x86_64-linux.treefmt 1m 30s
setup: don't know how to build these paths: /nix/store/psj2a0g9q7kflrwzb553jwx05wmrdbdv-treefmt-check.drv warning: ignoring the client-specified setting 'stor …
setup:
don't know how to build these paths:
  /nix/store/psj2a0g9q7kflrwzb553jwx05wmrdbdv-treefmt-check.drv
warning: ignoring the client-specified setting 'store', because it is a restricted setting and you are not a trusted user
error: gRPC QueryValidPaths on 'nix-store.geninf.io:50051' failed: error: substituter 'https://cache.clan.lol' is disabled
18 succeeded
succeeded attributes
status attribute duration
loading…
21 already built
skipped attributes
status attribute duration
loading…