nixbot

builds

Enzime/hyperconfig build #939 failed

branch main · PR #1032 · commit 5788feeb3d · · took 5m 29s · eval 1m 27s

eval warnings 1 kind · 2 occurrences
  • warn A legacy Nextcloud install (from before NixOS 26.11) may be installed. ×2

2 failed ⚠ 1
failed attributes
status attribute duration
failed checks.x86_64-linux.nixos-phi-nixos
  • A legacy Nextcloud install (from before NixOS 26.11) may be installed. After nextcloud33 is installed successfully, you can safely upgrade to 34. The latest version available is Nextcloud35. Please note that Nextcloud doesn't support upgrades across multiple major versions (i.e. an upgrade from 16 is possible to 17, but not 16 to 18). The package can be upgraded by explicitly declaring the service-option `services.nextcloud.package`.
  • A legacy Nextcloud install (from before NixOS 26.11) may be installed. After nextcloud34 is installed successfully, you can safely upgrade to 35. The latest version available is Nextcloud35. Please note that Nextcloud doesn't support upgrades across multiple major versions (i.e. an upgrade from 16 is possible to 17, but not 16 to 18). The package can be upgraded by explicitly declaring the service-option `services.nextcloud.package`.
3m 1s
setup: /nix/store/c50zz1zkx6bk5nrn1na754yq56pdjj89-check-sshd-config /nix/store/2xrph41m8g5g3fdrf0s6xwiswpn7v4wl-dry-activate /nix/store/nb2dws4j56b5prgv1 …
setup:
  /nix/store/c50zz1zkx6bk5nrn1na754yq56pdjj89-check-sshd-config
  /nix/store/2xrph41m8g5g3fdrf0s6xwiswpn7v4wl-dry-activate
  /nix/store/nb2dws4j56b5prgv18p4bmf5ydmmks7d-install-shell-files
  /nix/store/84sggxlzw0adckmzzysvrajmmdl5p6qq-libcap-text-verifier-0-unstable
  /nix/store/azjnwg3za27ccl8czdfsfz83x7gharz2-xkb-validated
warning: ignoring the client-specified setting 'store', because it is a restricted setting and you are not a trusted user
smyfdb2bhncj8h1dvmrqp45w355p2rdv-etc.drv: error: gRPC AddMultipleToStore on 'nix-store.geninf.io:50051' failed: error: niks3 push: creating pending closures: creating push: server returned 413: <html>
              <head><title>413 Request Entity Too Large</title></head>
              <body>
              <center><h1>413 Request Entity Too Large</h1></center>
              <hr><center>nginx</center>
              </body>
              </html>
              
error: dependency 'smyfdb2bhncj8h1dvmrqp45w355p2rdv-etc.drv' failed
failed checks.x86_64-linux.nixos-sigma 2m 53s
setup: don't know how to build these paths: /nix/store/v47j8d1hrhpv77gy65zlwms3qb8jvdb4-nixos-system-sigma-26.11.20260922.b6c98e9.drv warning: ignoring the cl …
setup:
don't know how to build these paths:
  /nix/store/v47j8d1hrhpv77gy65zlwms3qb8jvdb4-nixos-system-sigma-26.11.20260922.b6c98e9.drv
warning: ignoring the client-specified setting 'store', because it is a restricted setting and you are not a trusted user
n26wd20hbyyj9cpcd8iy84aq2dwhydz3-etc-json.drv: error: gRPC AddMultipleToStore on 'nix-store.geninf.io:50051' failed: error: niks3 push: creating pending closures: creating push: server returned 413: <html>
              <head><title>413 Request Entity Too Large</title></head>
              <body>
              <center><h1>413 Request Entity Too Large</h1></center>
              <hr><center>nginx</center>
              </body>
              </html>
              
2qv29a2w1mz1idjq36jiyv45gm7pwxg7-etc.drv: error: gRPC AddMultipleToStore on 'nix-store.geninf.io:50051' failed: error: niks3 push: creating pending closures: creating push: server returned 413: <html>
              <head><title>413 Request Entity Too Large</title></head>
              <body>
              <center><h1>413 Request Entity Too Large</h1></center>
              <hr><center>nginx</center>
              </body>
              </html>
              
error: dependency 's7n3cn7qyi5al8zc2nzkjyj959q9zl7l-boot.json.drv' failed
5 succeeded
succeeded attributes
status attribute duration
loading…
52 already built
skipped attributes
status attribute duration
loading…