nixbot

builds

Enzime/hyperconfig build #945 failed

branch next · PR #1027 · commit eab9098319 · · took 5m 40s · eval 27s

eval warnings 1 kind · 2 occurrences
  • warn A legacy Nextcloud install (from before NixOS 26.11) may be installed. ×2

2 failed ⚠ 1
failed attributes
status attribute duration
failed checks.x86_64-linux.nixos-phi-nixos
  • A legacy Nextcloud install (from before NixOS 26.11) may be installed. After nextcloud33 is installed successfully, you can safely upgrade to 34. The latest version available is Nextcloud35. Please note that Nextcloud doesn't support upgrades across multiple major versions (i.e. an upgrade from 16 is possible to 17, but not 16 to 18). The package can be upgraded by explicitly declaring the service-option `services.nextcloud.package`.
  • A legacy Nextcloud install (from before NixOS 26.11) may be installed. After nextcloud34 is installed successfully, you can safely upgrade to 35. The latest version available is Nextcloud35. Please note that Nextcloud doesn't support upgrades across multiple major versions (i.e. an upgrade from 16 is possible to 17, but not 16 to 18). The package can be upgraded by explicitly declaring the service-option `services.nextcloud.package`.
4m 18s
setup: these 4 paths will be fetched (0.1 KiB download, 4.3 MiB unpacked): /nix/store/nb2dws4j56b5prgv18p4bmf5ydmmks7d-install-shell-files /nix/store/84sggx …
setup:
these 4 paths will be fetched (0.1 KiB download, 4.3 MiB unpacked):
  /nix/store/nb2dws4j56b5prgv18p4bmf5ydmmks7d-install-shell-files
  /nix/store/84sggxlzw0adckmzzysvrajmmdl5p6qq-libcap-text-verifier-0-unstable
  /nix/store/kzlszz3glifbzgnldrw2n9bxwn3675iz-reddit-enhancement-suite-5.24.11
  /nix/store/azjnwg3za27ccl8czdfsfz83x7gharz2-xkb-validated
warning: ignoring the client-specified setting 'store', because it is a restricted setting and you are not a trusted user
xn0f8aza6bpq63lxfckqq9cm1cr9vsg5-etc.drv: error: gRPC AddMultipleToStore on 'nix-store.geninf.io:50051' failed: error: niks3 push: creating pending closures: creating push: server returned 413: <html>
              <head><title>413 Request Entity Too Large</title></head>
              <body>
              <center><h1>413 Request Entity Too Large</h1></center>
              <hr><center>nginx</center>
              </body>
              </html>
              
error: dependency 'xn0f8aza6bpq63lxfckqq9cm1cr9vsg5-etc.drv' failed
failed checks.x86_64-linux.nixos-sigma 4m 12s
setup: don't know how to build these paths: /nix/store/vrvwkv8833ahydcc74wllk9d3axp36g2-nixos-system-sigma-26.11.20260922.b6c98e9.drv warning: ignoring the cl …
setup:
don't know how to build these paths:
  /nix/store/vrvwkv8833ahydcc74wllk9d3axp36g2-nixos-system-sigma-26.11.20260922.b6c98e9.drv
warning: ignoring the client-specified setting 'store', because it is a restricted setting and you are not a trusted user
23zd09n95q1h76pxc4s6flqgj549riwz-etc.drv: error: gRPC AddMultipleToStore on 'nix-store.geninf.io:50051' failed: error: niks3 push: creating pending closures: creating push: server returned 413: <html>
              <head><title>413 Request Entity Too Large</title></head>
              <body>
              <center><h1>413 Request Entity Too Large</h1></center>
              <hr><center>nginx</center>
              </body>
              </html>
              
s8y3v74a86hgjlczk156c136gw4lnsm4-etc-json.drv: error: gRPC AddMultipleToStore on 'nix-store.geninf.io:50051' failed: error: niks3 push: creating pending closures: creating push: server returned 413: <html>
              <head><title>413 Request Entity Too Large</title></head>
              <body>
              <center><h1>413 Request Entity Too Large</h1></center>
              <hr><center>nginx</center>
              </body>
              </html>
              
error: dependency '23zd09n95q1h76pxc4s6flqgj549riwz-etc.drv' failed
46 succeeded
succeeded attributes
status attribute duration
loading…
11 already built
skipped attributes
status attribute duration
loading…