nixbot

builds

Enzime/hyperconfig build #944 failed

branch next · PR #1031 · commit ece773776b · · took 6m 36s · eval 3m 31s

eval warnings 5 kinds · 7311 occurrences
  • error unable to download 'https://cache.clan.lol/…': HTTP error 503 ×787
  • error unable to download 'https://cache.geninf.io/…': HTTP error 503 ×9
  • warn A legacy Nextcloud install (from before NixOS 26.11) may be installed. ×2
  • warn unable to download 'https://cache.clan.lol/…': HTTP error 503 ×5799
  • warn unable to download 'https://cache.geninf.io/…': HTTP error 503 ×714

16 failed ⚠ 1
failed attributes
status attribute duration
failed checks.x86_64-linux.nixos-phi-nixos
  • A legacy Nextcloud install (from before NixOS 26.11) may be installed. After nextcloud33 is installed successfully, you can safely upgrade to 34. The latest version available is Nextcloud35. Please note that Nextcloud doesn't support upgrades across multiple major versions (i.e. an upgrade from 16 is possible to 17, but not 16 to 18). The package can be upgraded by explicitly declaring the service-option `services.nextcloud.package`.
  • A legacy Nextcloud install (from before NixOS 26.11) may be installed. After nextcloud34 is installed successfully, you can safely upgrade to 35. The latest version available is Nextcloud35. Please note that Nextcloud doesn't support upgrades across multiple major versions (i.e. an upgrade from 16 is possible to 17, but not 16 to 18). The package can be upgraded by explicitly declaring the service-option `services.nextcloud.package`.
29s
setup: don't know how to build these paths: /nix/store/k3k2pr2la1y0wzd1bdb7v7irk0nk9bh8-nixos-system-phi-nixos-26.11.20260924.34ca302.drv warning: ignoring th …
setup:
don't know how to build these paths:
  /nix/store/k3k2pr2la1y0wzd1bdb7v7irk0nk9bh8-nixos-system-phi-nixos-26.11.20260924.34ca302.drv
warning: ignoring the client-specified setting 'store', because it is a restricted setting and you are not a trusted user
error: gRPC QueryValidPaths on 'nix-store.geninf.io:50051' failed: error: unable to download 'https://cache.clan.lol/b7bdibpvr7rskpfhnhi4n50nshhmfj4a.narinfo': HTTP error 503

              response body:

              <?xml version="1.0" encoding="UTF-8" standalone="yes"?>
              <Error>
                  <Code>SlowDown</Code>
                  <Message>Your account has made too many requests; try again later.</Message>
              </Error>
failed checks.aarch64-darwin.devShell-default 2m 32s
setup: /nix/store/ps6fw8dbs4bs932bwm366xyrjsm3yqfw-python-runtime-deps-check-hook.sh /nix/store/igvgasy84abxk9n3kw0c51w5x4abjdgj-python3.14-build-1.5.1 /n …
setup:
  /nix/store/ps6fw8dbs4bs932bwm366xyrjsm3yqfw-python-runtime-deps-check-hook.sh
  /nix/store/igvgasy84abxk9n3kw0c51w5x4abjdgj-python3.14-build-1.5.1
  /nix/store/6s505iygzjdhl6lbf1vmc4znbz1w3gz7-python3.14-installer-1.0.1
  /nix/store/ynrixpl28nckbmwjfi5qil186i0a6ly6-python3.14-pyproject-hooks-1.2.0
  /nix/store/3yf71hf8qyh4jdc4rqhc0f1r42xgls7p-python3.14-wheel-0.47.0
  /nix/store/0lb9f2g2qnxmhm00gldwd394l8c646wc-wrap-python-hook
warning: ignoring the client-specified setting 'store', because it is a restricted setting and you are not a trusted user
error: gRPC QueryValidPaths on 'nix-store.geninf.io:50051' failed: error: unable to download 'https://cache.geninf.io/1dqsfkcj95lkbjh31ma9kjncqwqjaaic.narinfo': HTTP error 503

              response body:

              <?xml version="1.0" encoding="UTF-8" standalone="yes"?>
              <Error>
                  <Code>SlowDown</Code>
                  <Message>Your account has made too many requests; try again later.</Message>
              </Error>
failed checks.aarch64-darwin."home-manager-enzime@hyperion-macos" 20s
setup: don't know how to build these paths: /nix/store/i5f8q689n2gljw055s6c06sy7lrgc7si-home-manager-generation.drv warning: ignoring the client-specified set …
setup:
don't know how to build these paths:
  /nix/store/i5f8q689n2gljw055s6c06sy7lrgc7si-home-manager-generation.drv
warning: ignoring the client-specified setting 'store', because it is a restricted setting and you are not a trusted user
error: gRPC QueryValidPaths on 'nix-store.geninf.io:50051' failed: error: unable to download 'https://cache.clan.lol/2mkjqgbwz65xx7nc71i4wzkxk6k74l36.narinfo': HTTP error 503

              response body:

              <?xml version="1.0" encoding="UTF-8" standalone="yes"?>
              <Error>
                  <Code>SlowDown</Code>
                  <Message>Your account has made too many requests; try again later.</Message>
              </Error>
failed checks.aarch64-darwin.nix-darwin-hyperion-macos 3m 30s
setup: don't know how to build these paths: /nix/store/jc12jymkwrbml6d48aafg21phsa7kndx-darwin-system-26.11.4cff07d.drv warning: ignoring the client-specified …
setup:
don't know how to build these paths:
  /nix/store/jc12jymkwrbml6d48aafg21phsa7kndx-darwin-system-26.11.4cff07d.drv
warning: ignoring the client-specified setting 'store', because it is a restricted setting and you are not a trusted user
error: gRPC QueryValidPaths on 'nix-store.geninf.io:50051' failed: error: unable to download 'https://cache.clan.lol/1a9xd7qmfhiv0xrqhfg92fjiqn2nrrip.narinfo': HTTP error 503

              response body:

              <?xml version="1.0" encoding="UTF-8" standalone="yes"?>
              <Error>
                  <Code>SlowDown</Code>
                  <Message>Your account has made too many requests; try again later.</Message>
              </Error>
failed checks.aarch64-darwin.package-get-clan-secret 3m 19s
setup: don't know how to build these paths: /nix/store/1n5p91qym4f40ssb24fdv0fp5v542d6d-get-clan-secret.drv warning: ignoring the client-specified setting 'st …
setup:
don't know how to build these paths:
  /nix/store/1n5p91qym4f40ssb24fdv0fp5v542d6d-get-clan-secret.drv
warning: ignoring the client-specified setting 'store', because it is a restricted setting and you are not a trusted user
error: gRPC QueryValidPaths on 'nix-store.geninf.io:50051' failed: error: unable to download 'https://cache.clan.lol/25ghiqpg57ns5xy7npgdal21rlh0v1w5.narinfo': HTTP error 503

              response body:

              <?xml version="1.0" encoding="UTF-8" standalone="yes"?>
              <Error>
                  <Code>SlowDown</Code>
                  <Message>Your account has made too many requests; try again later.</Message>
              </Error>
failed checks.aarch64-darwin.package-provide-tf-passphrase 5m 30s
setup: don't know how to build these paths: /nix/store/2ahx47c2wpm2n540nfxcc6g96dz698md-opentofu-external-key-provider.drv warning: ignoring the client-specif …
setup:
don't know how to build these paths:
  /nix/store/2ahx47c2wpm2n540nfxcc6g96dz698md-opentofu-external-key-provider.drv
warning: ignoring the client-specified setting 'store', because it is a restricted setting and you are not a trusted user
error: gRPC QueryValidPaths on 'nix-store.geninf.io:50051' failed: error: substituter 'https://cache.clan.lol' is disabled
dependency failed checks.aarch64-darwin.package-tf-apply —
dependency failed checks.aarch64-darwin.package-tf-destroy —
dependency failed checks.aarch64-darwin.package-tf-init —
failed checks.aarch64-linux.package-tf-init 3m 46s
setup: don't know how to build these paths: /nix/store/qch28zxr98zfj96i5qiwr6v5glzyj9sh-tf-init.drv warning: ignoring the client-specified setting 'store', be …
setup:
don't know how to build these paths:
  /nix/store/qch28zxr98zfj96i5qiwr6v5glzyj9sh-tf-init.drv
warning: ignoring the client-specified setting 'store', because it is a restricted setting and you are not a trusted user
error: gRPC QueryValidPaths on 'nix-store.geninf.io:50051' failed: error: substituter 'https://cache.clan.lol' is disabled
failed checks.x86_64-linux."home-manager-enzime@phi-nixos" 27s
setup: don't know how to build these paths: /nix/store/qaaxjdcnvqhs40wcvp38cp2ysbqimm4y-home-manager-generation.drv warning: ignoring the client-specified set …
setup:
don't know how to build these paths:
  /nix/store/qaaxjdcnvqhs40wcvp38cp2ysbqimm4y-home-manager-generation.drv
warning: ignoring the client-specified setting 'store', because it is a restricted setting and you are not a trusted user
error: gRPC QueryValidPaths on 'nix-store.geninf.io:50051' failed: error: unable to download 'https://cache.geninf.io/hiim52kfdrkr15z4r8qbpb575c4qz25s.narinfo': HTTP error 503

              response body:

              <?xml version="1.0" encoding="UTF-8" standalone="yes"?>
              <Error>
                  <Code>SlowDown</Code>
                  <Message>Your account has made too many requests; try again later.</Message>
              </Error>
failed checks.x86_64-linux."home-manager-enzime@sigma" 49s
setup: don't know how to build these paths: /nix/store/q51072h7n7gh6n75ywkns6ki7p44jjgc-home-manager-generation.drv warning: ignoring the client-specified set …
setup:
don't know how to build these paths:
  /nix/store/q51072h7n7gh6n75ywkns6ki7p44jjgc-home-manager-generation.drv
warning: ignoring the client-specified setting 'store', because it is a restricted setting and you are not a trusted user
error: gRPC QueryValidPaths on 'nix-store.geninf.io:50051' failed: error: unable to download 'https://cache.geninf.io/32a3iy9lak9icrv68xkj3kj17yk4544m.narinfo': HTTP error 503

              response body:

              <?xml version="1.0" encoding="UTF-8" standalone="yes"?>
              <Error>
                  <Code>SlowDown</Code>
                  <Message>Your account has made too many requests; try again later.</Message>
              </Error>
failed checks.x86_64-linux.nixos-gaia 14s
setup: don't know how to build these paths: /nix/store/58v7jn7aag6a5qkj3sl64bjdcg01v68x-nixos-system-gaia-26.11.20260924.34ca302.drv warning: ignoring the cli …
setup:
don't know how to build these paths:
  /nix/store/58v7jn7aag6a5qkj3sl64bjdcg01v68x-nixos-system-gaia-26.11.20260924.34ca302.drv
warning: ignoring the client-specified setting 'store', because it is a restricted setting and you are not a trusted user
error: gRPC QueryValidPaths on 'nix-store.geninf.io:50051' failed: error: unable to download 'https://cache.geninf.io/53ibaiwa4d0nhqjxsc633jpr3995al7k.narinfo': HTTP error 503

              response body:

              <?xml version="1.0" encoding="UTF-8" standalone="yes"?>
              <Error>
                  <Code>SlowDown</Code>
                  <Message>Your account has made too many requests; try again later.</Message>
              </Error>
failed checks.x86_64-linux.nixos-sigma 1m 25s
setup: don't know how to build these paths: /nix/store/py6q3ci417q9wx9wagh4fb1v6dsah45s-nixos-system-sigma-26.11.20260924.34ca302.drv warning: ignoring the cl …
setup:
don't know how to build these paths:
  /nix/store/py6q3ci417q9wx9wagh4fb1v6dsah45s-nixos-system-sigma-26.11.20260924.34ca302.drv
warning: ignoring the client-specified setting 'store', because it is a restricted setting and you are not a trusted user
error: gRPC QueryValidPaths on 'nix-store.geninf.io:50051' failed: error: unable to download 'https://cache.clan.lol/r5brg98aa7z11p0wzxsn7c7fl4frw26w.narinfo': HTTP error 503

              response body:

              <?xml version="1.0" encoding="UTF-8" standalone="yes"?>
              <Error>
                  <Code>SlowDown</Code>
                  <Message>Your account has made too many requests; try again later.</Message>
              </Error>
failed checks.x86_64-linux.package-tf-destroy 1m 7s
setup: don't know how to build these paths: /nix/store/hz1jb09ra8hq18wgil50881by3ys68zw-tf-destroy.drv warning: ignoring the client-specified setting 'store', …
setup:
don't know how to build these paths:
  /nix/store/hz1jb09ra8hq18wgil50881by3ys68zw-tf-destroy.drv
warning: ignoring the client-specified setting 'store', because it is a restricted setting and you are not a trusted user
hz1jb09ra8hq18wgil50881by3ys68zw-tf-destroy.drv: error: gRPC QueryValidPaths on 'nix-store.geninf.io:50051' failed: error: substituter 'https://cache.clan.lol' is disabled
error: error: gRPC QueryValidPaths on 'nix-store.geninf.io:50051' failed: error: substituter 'https://cache.clan.lol' is disabled
failed checks.x86_64-linux.package-tf-init 1m 3s
setup: don't know how to build these paths: /nix/store/dsqvaww66kfn8yqyvvmxciy4855lq452-tf-init.drv warning: ignoring the client-specified setting 'store', be …
setup:
don't know how to build these paths:
  /nix/store/dsqvaww66kfn8yqyvvmxciy4855lq452-tf-init.drv
warning: ignoring the client-specified setting 'store', because it is a restricted setting and you are not a trusted user
error: gRPC QueryValidPaths on 'nix-store.geninf.io:50051' failed: error: substituter 'https://cache.clan.lol' is disabled
22 succeeded
succeeded attributes
status attribute duration
loading…
21 already built
skipped attributes
status attribute duration
loading…